##TITLE=Nykon lote 02731 $$ Begin of the data block
##JCAMP-DX=5.00 $$ ACD/SpecManager v 10.08
##SPECTROMETER/DATA SYSTEM=Alpha
##DATE=04 Dec 2015 11:34:10
##DATA TYPE=INFRARED SPECTRUM
##DATA CLASS=XYDATA
##ORIGIN=
##OWNER=
##NPOINTS=1666
##FIRSTX=601.68603516
##LASTX=3997.64306641
##MAXX=3997.64306641
##MINX=601.68603516
##MAXY=1.07232440
##MINY=0.12204185
##XFACTOR=1.0000000000
##YFACTOR=0.000000010000000
##FIRSTY=0.97564203
##DELTAX=2.03961372
##XUNITS=1/CM
##YUNITS=ARBITRARY UNITS
##XYDATA=(X++(Y..Y))
601.7I7564203K82734K81209K70659K51591K28929K05034J79923J50371J16920Q7661
$$ 97564203 97846937 98128146 98398805 98650396 98879325 99084359 99264282 99414653 99531573 99619234
622.1I9619234O1565K9850j0979n7876j05143j56468k16591k78872l36385l82334m09007
$$ 99619234 99680799 99710649 99699670 99641794 99536651 99380183 99163592 98884720 98548335 98166001 97756994
644.5I7756994m21667m27157m08286l61168k92558j70123j5444J40005K84452M09591
$$ 97756994 97335327 96908170 96499884 96138716 95846158 95676035 95660591 95800596 96085048 96494639
664.9I6494639N11801N88131O33717O36893N87893M94247L82805K72477J84774J45424
$$ 96494639 97006440 97594571 98228288 98865181 99453074 99947321 100330126 100602603 100787377 100932801
685.3A00932801J14226P8249N3799M8745O1500Q1885R3782Q5234O1512L4929J5175
$$ 100932801 101047027 101125276 101179075 101227820 101289320 101371205 101464987 101550221 101611733 101646662 101661837
707.7A01661837J0061J8490L1543M1747N1403P0369R6822J17600J23238J10460Q4567
$$ 101661837 101671898 101690388 101721931 101763678 101815081 101885450 101982272 102099872 102223110 102333570 102418137
730.2A02418137N6457L0863Q607j0025k8265m7505o8438r2661j22821j63579k15042
$$ 102418137 102474594 102505457 102514064 102504039 102475774 102428269 102359831 102267170 102144349 101980770 101765728
752.6A01765728k73263l29364l64792l62075l19373k45899j53816n5450M0710J26922
$$ 101765728 101492465 101163101 100798309 100436234 100116861 99870962 99717146 99661696 99702406 99829328
773I9829328J92344K26927K23041J74832Q7285j9598j21343k04849k72918l36391m18854
$$ 99829328 100021672 100248599 100471640 100646472 100733757 100714159 100592816 100387967 100115049 99778658 99359804
795.4I9359804n68127q31467j193023j557374j811838j890284j786530j530641j161558
$$ 99359804 98791677 97960210 96767187 95209813 93397975 91507691 89721161 88190520 87028962
813.8H7028962p16531k35045K35951O36715Q94487R49335Q03566N44709K91753J16390
$$ 87028962 86312431 86077386 86313337 86950052 87844539 88793874 89597440 90142149 90433902 90550292
834.2I0550292K2739k2501n2047q1253j16461j59777k08121k58529l08282l49599l68911
$$ 90550292 90573031 90550530 90498483 90417230 90300769 90140992 89932871 89674342 89366060 89016461 88647550
856.6H8647550l53139k93243j85520l6692J35719L14069M82041O22719P28292P94857
$$ 88647550 88294411 88001168 87815648 87778956 87914675 88228744 88710785 89333504 90061796 90856653
877I0856653Q10367P61819O46615M68499K31015n8347l84867p23004j034343j275945
$$ 90856653 91667020 92428839 93075454 93543953 93774968 93716621 93331754 92608750 91574407 90298462
897.4I0298462j418233j456517j406747j299709j172555j052177r52655q86929q67736
$$ 90298462 88880229 87423712 86016965 84717256 83544701 82492524 81539869 80652940 79785204
915.8G9785204r00799r81510j092702j204479j279992j286363j203084j019985p37166
$$ 79785204 78884405 77902895 76810193 75605714 74325722 73039359 71836275 70816290 70079124
934.1G0079124l71724M6247M83876R06170J273727J549673J708961J742673J664531
$$ 70079124 69707400 69753647 70237523 71143693 72417420 73967093 75676054 77418727 79083258
952.5G9083258J511818J332396J167769J041722R55796Q88825Q08429O90043N24599
$$ 79083258 80595076 81927472 83095241 84136963 85092759 85981584 86790013 87480056 88004655
970.9H8004655L16590Q2189j57088l82597n82450p52175q93015j009840j105404j179635
$$ 88004655 88321245 88403434 88246346 87863749 87281299 86529124 85636109 84626269 83520865 82341230
991.3H2341230j245254j333428j465976j626825j770401j850218j836741j715845j481581
$$ 82341230 81095976 79762548 78296572 76669747 74899346 73049128 71212387 69496542 68014961
1009.6F8014961j137834o98698j86992L56919Q65841J258403J469606J475686J293564
$$ 68014961 66877127 66178429 65991437 66348356 67214197 68472600 69942206 71417892 72711456
1028G2711456R59617N13023q130n59807j089966j551879j913029k159536k302783k372641
$$ 72711456 73671073 74184096 74175966 73616159 72526193 70974314 69061285 66901749 64598966 62226325
1048.4F2226325k395445k385932k356684k319247k280056k243704k217293k206283
$$ 62226325 59830880 57444948 55088264 52769017 50488961 48245257 46027964 43821681
1064.7D3821681k210156k223357k237663k243340k233285k205523k156935k081584
$$ 43821681 41611525 39388168 37150505 34907165 32673880 30468357 28311422 26229838
1081B6229838j975205j838625j679260j509359j341260j183902j040655r08841p81478
$$ 26229838 24254633 22416008 20736748 19227389 17886129 16702227 15661572 14752731 13971253
1099.4A3971253o50767n12722l64760k04889l3930J45165L25843M96893O47063P68322
$$ 13971253 13320486 12807764 12443004 12238115 12204185 12349350 12675193 13172086 13819149 14587471
1119.8A4587471Q55607R08644R29949R22003Q86733Q27428P51648O70682N97840N44255
$$ 14587471 15443078 16351722 17281671 18203674 19090407 19917835 20669483 21340165 21938005 22482260
1140.1B2482260N14324N05870N11877N21082N21837N06270M71735M21617L66652L22356
$$ 22482260 22996584 23502454 24014331 24535413 25057250 25563520 26035255 26456872 26823524 27145880
1160.5B7145880L07501L43492M47548O25661Q71113J169425J503539J857397K214992
$$ 27145880 27453381 27796873 28244421 28870082 29741195 30910620 32414159 34271556 36486548
1178.9C6486548K554330K845496L056369L164440L167230L085065K951693K794755
$$ 36486548 39040878 41886374 44942743 48107183 51274413 54359478 57311171 60105926
1195.2F0105926K622705K430594K211673J959198J662916J306749Q76867L79944j48219
$$ 60105926 62728631 65159225 67370898 69330096 70993012 72299761 73176628 73556572 73408353
1213.6G3408353o49291j055688j309168j377386j262247r96083o25635k05695K02316
$$ 73408353 72759062 71703374 70394206 69016820 67754573 66758490 66132855 65927160 66129476
1231.9F6129476N40566P68066Q73059Q76242Q15415P27463O39528N66691N15348M85849
$$ 66129476 66670042 67438108 68311167 69187409 70002824 70730287 71369815 71936506 72451854 72937703
1252.3G2937703M75401M80830M95416N04661M89795M35841L39657K15292Q8472k9564
$$ 72937703 73413104 73893934 74389350 74894011 75383806 75819647 76159304 76374596 76463068 76433504
1272.7G6433504j77163m37254q82220j520735k267105k944505l356498l388876l042907
$$ 76433504 76256341 75819087 74936867 73416132 71149027 68204522 64848024 61459148 58416241
1291.1E8416241k390223j518828n15819N17708J435054K046716K196991J871253J224559
$$ 58416241 56026018 54507190 53991371 54509079 55944133 57990849 60187840 62059093 63283652
1309.4F3283652N05751m6795l02106k69491m2939K78813O21849R16016J088405J087695
$$ 63283652 63789403 63742608 63440502 63171011 63128072 63406885 64028734 64944750 66033155 67120850
1329.8F7120850Q97741N58186J82933r1368j85341q4835J82652N62692R83673J321966
$$ 67120850 68018591 68576777 68759710 68668342 68483001 68398166 68580818 69143510 70127183 71449149
1350.2G1449149J435244J227551N97054m42153j741093l063131m105723m631245m521066
$$ 71449149 72884393 74111944 74708998 74266845 72525752 69462621 65356898 60725653 56204587
1368.6E6204587l806269k630556j149174M64943J963365L150171L907824M112368L783316
$$ 56204587 52398318 49767762 48618588 49083531 51046896 54197067 58104891 62217259 66000575
1386.9F6000575L081924K232295J473808R37981O37292N03588M69297N15718O31076
$$ 66000575 69082499 71314794 72788602 73726583 74363875 74867463 75336760 75852478 76483554
1405.3G6483554Q19623J058662J286346J431548J454372J347690J126516Q55547N25231
$$ 76483554 77303177 78361839 79648185 81079733 82534105 83881795 85008311 85863858 86389089
1423.7H6389089P1865m36252r60559j495034j996791k443689k833164l115511l259176
$$ 86389089 86460954 86024702 85064143 83569109 81572318 79128629 76295465 73179954 69920778
1442F9920778l233796k940482k427787j791757j099706l62122M10343J107251J668614
$$ 69920778 66686982 63746500 61318713 59526956 58427250 58065128 58475471 59582722 61251336
1460.4F1251336K046198K191794K176553K105838K042675K027309K083111K106637
$$ 61251336 63297534 65489328 67665881 69771719 71814394 73841703 75924814 78031451
1476.7G8031451K088439K080053K067953J985532J824803J613730J341569J018131
$$ 78031451 80119890 82199943 84267896 86253428 88078231 89691961 91033530 92051661
1493I2051661P02131M65131L14748K01595R9086J5408l6937j05542k02649l09361m45097
$$ 92051661 92753792 93218923 93533671 93735266 93834352 93849760 93812823 93707281 93504632 93195271 92750174
1515.4I2750174o03432p75885r50182j078564j135224j090473r07856o30158k91914
$$ 92750174 92146742 91370857 90420675 89342111 88206887 87116414 86208558 85578400 85286486
1533.8H5286486O8861M08501P18933R83977J143539J204545J245260J241398J196319
$$ 85286486 85355347 85763848 86482781 87466758 88610297 89814842 91060102 92301500 93497819
1552.2I3497819J118135J047206J004040R46778Q66956P54374O29252N06598L80671
$$ 93497819 94615954 95663160 96667200 97613978 98480934 99235308 99864560 100371158 100751829
1570.5A00751829K34366R5486J860j18983k63286m15480n69725p07906q20816q95941
$$ 100751829 100986195 101081681 101083541 100964558 100701272 100285792 99716067 99008161 98187345 97291404
1590.9I7291404r08941q33613o63352m23765j54805R4044K56306L23421L06672K14040
$$ 97291404 96382463 95548850 94885498 94461733 94306928 94400972 94657278 94980699 95287371 95501411
1611.3I5501411Q0317p2580k43259l97521n21541p38930j045090j280541j315933j138645
$$ 95501411 95581728 95509148 95265889 94868368 94346827 93607897 92562807 91282266 89966333 88827688
1631.7H8827688p82639k74772K67095P67719J235378J627577J886349J979429J844138
$$ 88827688 88045049 87770277 88037372 88805091 90040469 91668046 93554395 95533824 97377962
1650.1I7377962J421636Q84378M41790J60467K6358p439k0671q1456j53982j98543
$$ 97377962 98799598 99683976 100125766 100286233 100312591 100305152 100284481 100203025 100049043 99850500
1670.5I9850500k60872l30997l92282m65357n25480o02508p43687r07081j185817j511556
$$ 99850500 99589628 99258631 98866349 98400992 97875512 97273004 96529317 95622236 94436419 92924863
1690.9I2924863j823890k205819k655268l178149l777105m413831n113304n742764
$$ 92924863 91100973 88895154 86239886 83061737 79284632 74870801 69757497 64014733
1707.2F4014733o101608o140829n811953n070818m007789k652514j031286P26319K331134
$$ 64014733 57913125 51772296 45960343 40889525 36881736 34229222 33197936 33924255 36255389
1725.5C6255389L667048M707453N355820N598423N590790N451507N211424M874999
$$ 36255389 39922437 44629890 49985710 55584133 61174923 66626430 71837854 76712853
1741.9G6712853M456526L984856L454280L006733K614677K103871J624733J238775
$$ 76712853 81169379 85154235 88608515 91615248 94229925 96333796 97958529 99197304
1758.2I9197304R03416O39069M51136L49044L02363K59685K25246K08390J94323J81353
$$ 99197304 100100720 100739789 101190925 101539969 101842332 102102017 102327263 102535653 102729976 102911329
1778.6A02911329J68026J54555J41906J26255J11902J06692J06788J05023J00553R6178
$$ 102911329 103079355 103233910 103375816 103502071 103613973 103720665 103827453 103932476 104033029 104129207
1799A04129207R5284R6929R5594Q8704Q3744Q2410P8654P2050O3586N9283N9402N7674
$$ 104129207 104224491 104321420 104417014 104505718 104589462 104671872 104750526 104822576 104886162 104945445 105004847 105062521
1823.4A05062521N2678N0354N1797M8232L9792L4940L3820L0720K5058J8537J1491
$$ 105062521 105115199 105165553 105217350 105265582 105305374 105340314 105374134 105404854 105429912 105448449 105459940
1845.9A05459940P213N328K790p27p880j9753l3569m2785m5383m6467m8340n0640n1677
$$ 105459940 105467153 105472481 105475271 105474544 105466664 105446911 105413342 105370557 105325174 105278707 105230367 105179727 105128050
1872.4A05128050n0032m7303m3761l8612l5811l6049l2353k4056j6368j0967p808q083
$$ 105128050 105078018 105030715 104986954 104948342 104912531 104876482 104844129 104820073 104803705 104792738 104784930 104776847
1896.9A04776847j0430j1325j1993j6415k0683k1851k3222k3043j9789j4591q404k146
$$ 104776847 104766417 104755092 104743099 104726684 104706001 104684150 104660928 104637885 104618096 104603505 104595101 104592955
1921.3A04592955L839R620J5139J8776J8978J6606J4841J3256R919N841J204l433p081
$$ 104592955 104596794 104606414 104621553 104640329 104659307 104675913 104690754 104704010 104713929 104719770 104720974 104717541 104710460
1947.9A04710460q893q643r227j2219j4817j4341j1707q952o819n710n639n758n793
$$ 104710460 104701567 104692924 104683697 104671478 104656661 104642320 104630613 104621661 104614842 104609132 104603493 104597735 104591942
1974.4A04591942n722o283q559j1599j2970j2576j2052j1588j0836r942q905p319n341
$$ 104591942 104586220 104579937 104571378 104559779 104546809 104534233 104522181 104510593 104499757 104489815 104480910 104473591 104468250
2000.9A04468250m327m458m447l040L58M244P653J1492J6367K1875K7525L2890L7146
$$ 104468250 104463923 104459465 104455018 104451978 104452336 104456580 104464233 104475725 104492092 104513967 104541492 104574382 104611528
2027.4A04611528M0030M1545M1675M1974M2391M1389L9590L7348L4070L0851K8444
$$ 104611528 104651558 104693103 104734778 104776752 104819143 104860532 104900122 104937470 104971540 105002391 105030835
2049.8A05030835K6309K3937K1053J8084J4841J1993J1158J1039R727Q190O807M816
$$ 105030835 105057144 105081081 105102134 105120218 105135059 105147052 105158210 105169249 105178976 105187166 105193973 105198789
2074.3A05198789L159K551K384TL135M375N865Q524J1980J4759J6069J6487J6880J6939
$$ 105198789 105201948 105204499 105206883 105209267 105212402 105216777 105222642 105231166 105243146 105257905 105273974 105290461 105307341 105324280
2102.9A05324280J6392J5640J4734J4234J4186J3232J1384R704Q142O270L958J812
$$ 105324280 105340672 105356312 105371046 105385280 105399466 105412698 105424082 105433786 105441928 105448198 105452156 105453968
2127.3A05453968L93j061k563k861j966j514k408l410k789j192p16j466k205k098j061
$$ 105453968 105454361 105453300 105450737 105447876 105445910 105444396 105441988 105438578 105435789 105434597 105433881 105432415 105430210 105428112 105427051
2157.9A05427051j79p2q3J91O67K086M387O116O461O580P272Q154R358J0657J0538
$$ 105427051 105426872 105426800 105426717 105426908 105427575 105429661 105434048 105440164 105446625 105453205 105460477 105468631 105477989 105488646 105499184
2188.5A05499184Q774P284O783O532O342N841M924M434M280L397K206K015K825K885
$$ 105499184 105507958 105515242 105522025 105528557 105534899 105540740 105545664 105550098 105554378 105557775 105559981 105561996 105564821 105567706
2217.1A05567706J955J514J990L398N913Q475J0109J0980J1634J2243J2553J3184J4329
$$ 105567706 105569661 105571175 105573165 105576563 105582476 105590951 105601060 105612040 105623674 105635917 105648470 105661654 105675983
2243.6A05675983J4472J4031J4484J4937J3781J1813J0741J0395R728R405R454R167
$$ 105675983 105690455 105704486 105718970 105733907 105747688 105759501 105770242 105780637 105790365 105799770 105809224 105818391
2268.1A05818391R715J1731J4174J6331J7703J8084J7643J7190J7488J7547J6892J7083
$$ 105818391 105828106 105839837 105854011 105870342 105888045 105906129 105923772 105940962 105958450 105975997 105992889 106009972
2292.5A06009972J7881J7548J6523J6474J7524J8787J9932K1255K2066K3138K7085
$$ 106009972 106027853 106045401 106061924 106078398 106095922 106114709 106134641 106155896 106177962 106201100 106228185
2315A06228185L2532L7289M3547M9638N0223M7052M6194M5931L6848J8286k264j8824
$$ 106228185 106260717 106298006 106341553 106391191 106441414 106488466 106534660 106580591 106617439 106635725 106633461 106614637
2339.5A06614637k6536k0814o246Q297K0325K8849L3343L4165K9266J4198j2935m3404
$$ 106614637 106588101 106567287 106561041 106569338 106589663 106618512 106651855 106686020 106715286 106729484 106716549 106673145
2363.9A06673145o7579q1265q1420o7759m8399l1960j7726k385J1600J8656J9288J7869
$$ 106673145 106605566 106524301 106442881 106375122 106326723 106294763 106277037 106274652 106286252 106304908 106324196 106342065
2388.4A06342065J5557J1861P487M005K229J824K194J776n96m268q511j1635j2291
$$ 106342065 106357622 106369483 106376970 106380975 106383204 106385028 106387222 106388998 106388402 106384134 106375623 106363988 106351697
2414.9A06351697j1420j0502j0216r835r036q738q440p212o867q368j0002j1063j1694
$$ 106351697 106340277 106329775 106319559 106309724 106300688 106291950 106283510 106276298 106269431 106261063 106251061 106239998 106228304
2441.4A06228304j2255j3578j5545j7440j8549j9693k1577k2662k2292k1458j9979
$$ 106228304 106216049 106202471 106186926 106169486 106150937 106131244 106109667 106087005 106064713 106043255 106023276
2463.9A06023276j7810j6117j5068j4424j3960j2815j0872q952p725o712n102l409
$$ 106023276 106005466 105989349 105974281 105959857 105945897 105933082 105922210 105913258 105905533 105898821 105893719 105890310
2488.3A05890310j681K98J299J347J371J228J443K122J514l22j204j407k921n018o605
$$ 105890310 105888629 105888927 105890226 105891573 105892944 105894172 105895615 105897737 105899251 105898929 105897725 105896318 105893397 105888379 105881774
2518.9A05881774q750j1694j3375j3304j3185j3983j5652j7428j7238j4639j2636j2779
$$ 105881774 105873024 105861330 105847955 105834651 105821466 105807483 105791831 105774403 105757165 105742526 105729890 105717111
2543.4A05717111j3280j4317j7047k0790k4498k8837l5441m4000n3417o2991p1704
$$ 105717111 105703831 105689514 105672467 105651677 105627179 105598342 105562901 105518901 105465484 105402493 105330789
2565.8A05330789p8869q4078q6975q7571q5128p8785o9583n8329m5907l4654k5606
$$ 105330789 105251920 105167842 105080867 104993296 104908168 104829383 104759800 104701471 104655564 104620910 104595304
2588.3A04595304j9098j5175j2481r990q321q404j0109j2338j4639j8048k2877k9254
$$ 104595304 104576206 104561031 104548550 104538560 104530239 104521835 104511726 104499388 104484749 104466701 104443824 104414570
2612.8A04414570l8206m8638n8639o7842p5960q2934q8262r0289q8799q4138p6115
$$ 104414570 104376364 104327726 104269087 104201245 104125285 104042351 103954089 103863800 103775001 103690863 103614748
2635.2A03614748o6042n5409m5562l7980l3188l1149l2413l8528m8972n9974o9713
$$ 103614748 103548706 103493297 103447735 103409755 103376567 103345418 103313005 103274477 103225505 103165531 103095818
2657.6A03095818p8476q4221q6177q6784q6081q0216o7890n3465m0484l1328k8753
$$ 103095818 103017342 102933121 102846944 102760160 102674079 102593863 102525973 102472508 102432024 102400696 102371943
2680.1A02371943l2604m1508n5314p2026q8775j04237j17182j25313j25897j20366
$$ 102371943 102339339 102297831 102242517 102170491 102081716 101977479 101860297 101734984 101609087 101488721
2700.5A01488721j14929j13166j15394j22786j36804j58501j84262k05004k16353k19733
$$ 101488721 101373792 101260626 101145232 101022446 100885642 100727141 100542879 100337875 100121522 99901789
2720.9I9901789k18498k14452k04670j88720j70070j53143j43575j42849j46264j52480
$$ 99901789 99683291 99468839 99264169 99075449 98905379 98752236 98608661 98465812 98319548 98167068
2741.2I8167068j61791j70928j80549j94365k12633k30497k43098k51251k59549k73442
$$ 98167068 98005277 97834349 97653800 97459435 97246802 97016305 96773207 96521956 96262407 95988965
2761.6I5988965k90799l00962l01689l00991l01332l01146l04222l11792l17574l17233
$$ 95988965 95698166 95397204 95095515 94794524 94493192 94192046 93887824 93576032 93258458 92941225
2782I2941225l14373l12305l08728l00896k85649k62815k39998k21032k04623j97035
$$ 92941225 92626852 92314547 92005819 91704923 91419274 91156459 90916461 90695429 90490806 90293771
2802.4I0293771k05368k26271k54923k94066l47638m13257m87977n78147o93214q38274
$$ 90293771 90088403 89862132 89607209 89313143 88965505 88552248 88064271 87486124 86792910 85954636
2822.8H5954636j017469j230061j473004j746773k044535k349645k644861k914118
$$ 85954636 84937167 83707106 82234102 80487329 78442794 76093149 73448288 70534170
2839.1G0534170l138608l299624l382766l381586l301311l151655k940562k679754
$$ 70534170 67395562 64095938 60713172 57331586 54030275 50878620 47938058 45258304
2855.5D5258304k385026k066785j731202j388344j047951p17095m03100j15272J33508
$$ 45258304 42873278 40806493 39075291 37686947 36638996 35921901 35518801 35403529 35537037
2873.8C5537037L28240M55409N11045N01105M36291L36969K31653J42953Q6641P7439
$$ 35537037 35865277 36320686 36831731 37332836 37769127 38106096 38337749 38480702 38567343 38644782
2894.2C8644782J21161K11367L31983M61531N79694O66046O99648O62932N44578L44404
$$ 38644782 38765943 38977310 39309293 39770824 40350518 41016564 41716212 42379144 42923722 43268126
2914.6D3268126Q0031k14737m91947o91065p52086o34652l32183J28243O93193J291445
$$ 43268126 43348157 43133420 42641473 41950408 41198322 40563670 40231487 40359730 41052923 42344368
2935D2344368J846706K288759K560458K626446K476346K111399J533735P55191j82486
$$ 42344368 44191074 46479833 49040291 51666737 54143083 56254482 57788217 58543408 58360922
2953.4E8360922j190841k144813k916998l411034l579703l415775k938768k192280
$$ 58360922 57170081 55025268 52108270 48697236 45117533 41701758 38762990 36570710
2969.7C6570710j238564j56846R52190J977199K829483L477824L950632M299709M561525
$$ 36570710 35332146 35175300 36127490 38104689 40934172 44411996 48362628 52662337 57223862
2988E7223862M735285M796374M727358M521316M181445L732842L221035K693439K187627
$$ 57223862 61959147 66755521 71482879 76004195 80185640 83918482 87139517 89832956 92020583
3006.4I2020583J732475J347774J041245Q13395O57147N51868M76968M23241L83872
$$ 92020583 93753058 95100832 96142077 96955472 97612619 98164487 98641455 99064696 99448568
3024.7I9448568L45873L00414K50816K04241J66762J40417J22642J13130J12975J19233
$$ 99448568 99794441 100094855 100345671 100549912 100716674 100857091 100979733 101092863 101205838 101325071
3045.1A01325071J25670J28770J31428J30403J16373R3686P5066O6424O1226M7421
$$ 101325071 101450741 101579511 101710939 101841342 101957715 102051401 102126467 102192891 102254117 102301538
3065.5A02301538K8920J7715J3923J5140J9026K0957K1064K0432K0111J8919J1646
$$ 102301538 102330458 102348173 102362096 102377236 102396262 102417219 102438283 102458715 102478826 102497745 102509391
3088A02509391k336k2626m8483o8986p0453n4037l2640j3029P426L2974O3097Q9002
$$ 102509391 102507055 102484429 102435946 102366960 102296507 102242470 102209830 102196801 102204227 102237201 102300298 102389300
3112.4A02389300J00016R4963Q3041P1203N8008M3070L1972K4807J5915O413J216N84
$$ 102389300 102489316 102584279 102667320 102738523 102796531 102839601 102871573 102896380 102912295 102918708 102919924 102920508
3136.9A02920508M8j860k408j132K801Q774J1397P343P15k170j680k849p034j5664
$$ 102920508 102920556 102918696 102916288 102915156 102917957 102926731 102938128 102945471 102946186 102944016 102942336 102939487 102932453 102916789
3165.5A02916789k9433m0424m3237m1795m0972m2450m5538m8340m9126m7898m6074
$$ 102916789 102887356 102846932 102803695 102761900 102720928 102678478 102632940 102584600 102535474 102487576 102441502
3187.9A02441502m4978m4668m4048m1544l7074l2723k8467k5428k7167l1543l4475
$$ 102441502 102396524 102351856 102307808 102266264 102229190 102196467 102168000 102142572 102115405 102083862 102049387
3210.3A02049387l7373m0960m4870n3025o7389q1777r0790r5284r6714r5976r9206
$$ 102049387 102012014 101971054 101926184 101873159 101805770 101723993 101633203 101537919 101441205 101345229 101246023
3232.8A01246023j09625j16992j16610j17064j21820j27625j35601j45411j49417j43522
$$ 101246023 101136398 101019406 100902796 100785732 100663912 100536287 100400686 100255275 100105858 99962336
3253.2I9962336j33813j31756j38509j46794j51330j46390j34307j25444j21146j14059
$$ 99962336 99828523 99696767 99558258 99411464 99260134 99113744 98979437 98853993 98732847 98618788
3273.6I8618788j04744j01363j05393j12331j22231j34033j36650j28853j23185j21630
$$ 98618788 98514044 98412681 98307288 98194957 98072726 97938693 97802043 97673190 97550005 97428375
3294I7428375j17719j08576r2631p1961n4896m7516m5616m3541m0424l4136k5558k3371
$$ 97428375 97310656 97202080 97109449 97037488 96982592 96935076 96889460 96845919 96805495 96771359 96745801 96722430
3318.4I6722430l1471m2987n2089n7029n7412n6612n5653n1659m8447n0765n1296m2027
$$ 96722430 96690959 96647972 96595883 96538854 96481442 96424830 96369177 96317518 96269071 96218306 96167010 96124983
3342.9I6124983k7740j6117n788M852R578O044J91j854J204L767K81m870l505K152
$$ 96124983 96097243 96081126 96075338 96080190 96089768 96095812 96096003 96094149 96095353 96099120 96099401 96094531 96091026 96093178
3371.5I6093178M679L594k748j8722l9273n5033o7026q3589j02526j12599j12522j10608
$$ 96093178 96097857 96101451 96098703 96079981 96040708 95985675 95918649 95835060 95732534 95619935 95507413 95396805
3395.9I5396805j11127j14179j17028j17164j22834j34229j33926j21134j18024j32894
$$ 95396805 95285678 95171499 95054471 94937307 94814473 94680244 94546318 94425184 94307160 94174266
3416.3I4174266j42205j34843j37783j59764j74606j68979j48612j25408j11562j01072
$$ 94174266 94032061 93897218 93759435 93599671 93425065 93256086 93107474 92982066 92870504 92769432
3436.7I2769432q3518o6584o0398o5231p7540r7239j24246j46961j57660j59156j48946
$$ 92769432 92685914 92619330 92558932 92493701 92416161 92318922 92194676 92047715 91890055 91730899 91581953
3459.2I1581953j28448j04344q0651o3539m8637l0005j8871j9604j8615j3268j6814
$$ 91581953 91453505 91349161 91268510 91204971 91156334 91126329 91107458 91087854 91069239 91055971 91039157
3481.6I1039157l1352l9154k9231j4376m649K497J1504K8878M9299O3521P7158R7668
$$ 91039157 91007805 90968651 90939420 90925044 90920395 90922892 90934396 90963274 91012573 91076094 91153252 91250920
3506.1I1250920J20503J36751J45698J52957J61237J70516J82415J94942K06292K18803
$$ 91250920 91371423 91508174 91653872 91806829 91968066 92138582 92320997 92515939 92722231 92941034
3526.5I2941034K30539K37322K39002K41685K46430K45571K42257K44361K48522K49570
$$ 92941034 93171573 93408895 93647897 93889582 94136012 94381583 94623840 94868201 95116723 95366293
3546.9I5366293K47050K41917K34318K24125K12807K01410J91730J87522J87778J87022
$$ 95366293 95613343 95855260 96089578 96313703 96526510 96727920 96919650 97107172 97294950 97481972
3567.3I7481972J86414J84869J74183J60998J58465J59937J57261J56212J61761J70773
$$ 97481972 97668386 97853255 98027438 98188436 98346901 98506838 98664099 98820311 98982072 99152845
3587.7I9152845J81729J94782K07984K18427K23822K21228K14100K12944K14886K10405
$$ 99152845 99334574 99529356 99737340 99955767 100179589 100400817 100614917 100827861 101042747 101253152
3608.1A01253152K06554K09546K10106K01607J96624J97565J97733J96552J95098J92976
$$ 101253152 101459706 101669252 101879358 102080965 102277589 102475154 102672887 102869439 103064537 103257513
3628.5A03257513J91128J88089J78396J60373J45936J42169J37841J26267J18971J16813
$$ 103257513 103448641 103636730 103815126 103975499 104121435 104263604 104401445 104527712 104646683 104763496
3648.8A04763496J18232J24108J30642J33133J34075J33192J19293R4902P9656P7116
$$ 104763496 104881728 105005836 105136478 105269611 105403686 105536878 105656171 105751073 105830729 105907845
3669.2A05907845P7057P4816O6710N4752N1916N8031O5685P3993Q4769R0933Q8442
$$ 105907845 105984902 106059718 106126428 106181180 106233096 106291127 106356812 106430805 106515574 106606507 106694949
3691.7A06694949Q7571R0802Q9716Q1158O7282M6968K7156J6964J1396O807K050j335
$$ 106694949 106782520 106873322 106963038 107044196 107111478 107158446 107185602 107202566 107213962 107220769 107222819 107221484
3716.2A07221484J502P081K373j2315k6071l0219k2984j4949q178j490j347m720m447
$$ 107221484 107222986 107230067 107232440 107220125 107194054 107163835 107140851 107125902 107117724 107116234 107114887 107110167 107105720
3742.7A07105720R18O783N019n341j2123q786l088k396l338K206L743q977j8417j8526
$$ 107105720 107106638 107113421 107118440 107113099 107100976 107092190 107089102 107086706 107083368 107085574 107089317 107080340 107061923 107043397
3771.2A07043397j9002j8489j4484q917l421l207p653r167o914n317j1778k1517j9896
$$ 107043397 107024395 107005906 106991422 106982505 106979084 106975877 106968224 106959057 106952143 106946826 106935048 106913531 106893635
3797.7A06893635r763l94O616J1599J0860M268m625j1111j3148j3566j1325j0670j4114
$$ 106893635 106883872 106883478 106890094 106901693 106912553 106916821 106912196 106901085 106887937 106874371 106863046 106852376 106838262
3824.3A06838262j4663j0144o056m530l827n317m804l767o544o497o68O998O866n60
$$ 106838262 106823599 106813455 106807399 106802869 106799042 106793725 106788921 106785154 106778610 106772113 106771445 106778443 106785309 106784749
3852.8A06784749m172l612l577m255l684J79J645l851j1682j6856j4377q392r239r215
$$ 106784749 106780577 106776965 106773388 106769133 106765449 106765628 106767273 106763422 106751740 106734884 106720507 106712115 106702876 106693661
3881.4A06693661k515K420K217j240p236j2135j4579j3853j2397j2100j0109j0061
$$ 106693661 106691146 106693566 106695783 106694543 106687307 106675172 106660593 106646740 106634343 106622243 106612134 106602073
3905.8A06602073j2052j0407q047r215j3125k0361l0636l6240l4404k9933k5964k3723
$$ 106602073 106590021 106579614 106571567 106562352 106549227 106528866 106498230 106461990 106427586 106397653 106371689 106347966
3930.3A06347966k4581k7549l0339l2294l2889l2115l1472l3724l8218m0067l8194
$$ 106347966 106323385 106295836 106265497 106233203 106200314 106168199 106136727 106103003 106064785 106024718 105986524
3952.7A05986524l6300l7360l9291l9184l8231l7861l5846l2997l2508l2056l1554
$$ 105986524 105950224 105912864 105873573 105834389 105796158 105758297 105722451 105689454 105656946 105624890 105593336
3975.2A05593336l4154l6585l6442l7218l8611l6729l2091k6929k3151k1481k0433
$$ 105593336 105559182 105522597 105486155 105448937 105410326 105373597 105341506 105314577 105291426 105269945 105249512
3997.6A05249512
$$ 105249512
##END=$$ End of the data block
