##TITLE=Nicole I $$ Begin of the data block
##JCAMP-DX=5.00 $$ ACD/SpecManager v 10.08
##SPECTROMETER/DATA SYSTEM=Alpha
##DATE=02 Apr 2015 08:37:18
##DATA TYPE=INFRARED SPECTRUM
##DATA CLASS=XYDATA
##ORIGIN=
##OWNER=
##NPOINTS=1765
##FIRSTX=399.76428223
##LASTX=3997.64306641
##MAXX=3997.64306641
##MINX=399.76428223
##MAXY=0.89119637
##MINY=0.60470241
##XFACTOR=1.0000000000
##YFACTOR=1.000000000000000e-9
##FIRSTY=0.87902820
##DELTAX=2.03961372
##XUNITS=1/CM
##YUNITS=ARBITRARY UNITS
##XYDATA=(X++(Y..Y))
399.8H79028201M269183k805591m094183K721846L590345l361046l466070M908204
416.1H80790889O873250l464758m959107K927363K660394m345477l821790L513456
432.4H80174220L566205l937244l990352L687083L977239l584504l703654L290058
448.7H79479051L557205l202140l332556L966391L559292m377485m178106K888321
465H78359973L486395k708375k948105K908170K297222l941774l985584K365589L103972
483.4H78937483l480375m864275P58886J555443m856348p220090m051387p594168k2249460
501.7H26935709k8359831j3385057n034864j1886299M55856L1297028M0965081K2842526
518.1H63830149N577684L524840M941403J13547m326820j054168K497316l93153l350496
$$ y = [879028201, 883297384, 880491793, 876397610, 879119456, 882709801, 879348755, 875882685, 880790889, 887664139, 884199381, 879240274, 882167637, 884828031, 880482554, 876660764, 880174220, 883740425, 879803181, 875812829, 879499912, 883477151, 879892647, 876188993, 879479051, 883036256, 879834116, 876501560, 880467951, 884027243, 879649758, 875471652, 878359973, 881846368, 879137993, 876189888, 879098058, 881395280, 877453506, 873467922, 875833511, 878937483, 875457108, 870592833, 871351719, 872907162, 868050814, 860830724, 856779337, 849185169, 826935709, 798575878, 785190821, 780155957, 768269658, 768725514, 800022542, 840987623, 863830149, 869407833, 872932673, 877874076, 877987623, 873660803, 872606635, 875103951, 874710798, 871360302]
536.4H71360302K58207M330337J677454k490282n54085L224373R12726l442049j701713
554.8H73575270K683640J343846l040314j952231K676905K065539k655387k429306
571.1H72267962K329528K569735k197385k678812J927972K512634k119720l200233
587.4H71411681J110017K126575k582490m306615n71012o21021q979798j5019357o234348
605.8H36333632R500504J2882829N734026K116919j0133n963504n534709N502761J2086093
624.1H72648418O256461r17315q703L667474J624644k886593j674831K255559N08964
642.5H81474078l889144j747787M206240L715754j653612k020359K163887K235115
658.8H84484172k131105k726435J218021K680838j946151k765239J553655K562165
$$ y = [871360302, 871618509, 875948846, 877626300, 875136018, 874581933, 877806306, 878719032, 875276983, 873575270, 876258910, 877602756, 874562442, 872610211, 875287116, 877352655, 874697268, 872267962, 874597490, 877167225, 874969840, 872291028, 874219000, 876731634, 874611914, 871411681, 872521698, 874648273, 872065783, 867759168, 867188156, 866567135, 857587337, 842567980, 836333632, 845834136, 858716965, 864450991, 866567910, 866557777, 860594273, 855059564, 860562325, 872648418, 878904879, 877987564, 877978861, 881646335, 883270979, 880384386, 878709555, 880965114, 881474078, 877584934, 875837147, 880043387, 883759141, 882105529, 880085170, 882249057, 884484172, 882353067, 879626632, 880844653, 883525491, 881579340, 878814101, 880367756, 882929921]
675.1H82929921j242041k953530O61314K589941r12428l232658q4639K305448p70211
693.5H79291117l484845q13425J868725q92579m266620j872718K289056R61662k790451
711.8H70289922j931906J216471J58012l427505l042043K00153k17259l655136l875911
730.2H55714798j024067j182497m790127o069482m008233l902495p013261q053422
746.5H19671214n048097k580285l001749k372325J750470N402088N253374M353285
762.8H23427975N938769O379365J567066j585662N328655J3316751J0860443L976285
779.1H69209647J981259L366947K469659n33939j003682J140475J318812j086533j852691
797.5H75009954k28643o16193m402042p171392p109940q963943j6592145k8149783
$$ y = [882929921, 881687880, 878734350, 879395664, 881985605, 881073177, 877840519, 877755880, 880061328, 879291117, 875806272, 874992847, 876861572, 875968993, 871702373, 869829655, 872118711, 873080373, 870289922, 868358016, 869574487, 869732499, 866304994, 863262951, 863463104, 863245845, 859590709, 855714798, 854690731, 853508234, 848718107, 842648625, 838640392, 834737897, 827724636, 819671214, 814623117, 812042832, 809041083, 806668758, 808419228, 813821316, 819074690, 823427975, 829366744, 835746109, 837313175, 835727513, 841056168, 854372919, 865233362, 869209647, 871190906, 874557853, 877027512, 876493573, 875489891, 876630366, 877949178, 876862645, 875009954, 874781311, 874165118, 869763076, 862591684, 855481744, 846517801, 829925656, 801775873]
813.8H01775873l8681805l9603055k3913324K077401K4468541L4162819L1024635K3883343
830.1H15194428K0064354J7018318J0712922M499614L322899M840911L584206k97547
846.4H78940105k363085j190424N30421J210273K103030L624142L538906J003504p39217
864.8H86657655N06222J793921L87431j198352j311J707315O63519j136422l10361
883.2H89069617J454234O72519j333356r32455J042545Q60631j102387j083434R05514
901.5H89553428J128494q14437j233042O22750J181066o40989j476526O1333Q39114
919.9H89221191q01563j852333k94984R65536n40674k593160l227174l901601l277421
938.2H73697817R85504M766702M193247Q76903k010763k316832j357675j925707l540754
$$ y = [801775873, 763094068, 723491013, 699577689, 701655090, 726123631, 760286450, 791311085, 815194428, 835258782, 852277100, 862990022, 867489636, 870812535, 875653446, 879237652, 878940105, 876577020, 875386596, 875917017, 877127290, 879230320, 882854462, 886393368, 887396872, 886657655, 887163877, 888957798, 889345229, 888146877, 888145566, 889852881, 890516400, 889379978, 889069617, 890523851, 891196370, 889863014, 888930559, 889973104, 890833735, 889731348, 888647914, 889553428, 890681922, 889867485, 888634443, 889257193, 890438259, 889797270, 888320744, 888382077, 889221191, 888419628, 886567295, 886272311, 887237847, 886697173, 884104013, 880876839, 876975238, 873697817, 874683321, 879450023, 883643270, 884520173, 882509410, 880192578, 878834903, 876909196, 873368442]
956.6H73368442l761232j933455o72698r86219J134753M945398M643261R97067r72629
974.9H76762688k90274q6606j889169l427804l372550l762662m865349k816140K551854
993.3H58803988N348503K928138o43075j777827j811207l409624o208598q174539q190632
1011.6H36865127m800916K427459P901013N770326K092600L496468M810333K964020
1028H61526430J68740l464162p197201r807944j0348440o006539L443420J1539102
1044.3H39853406J2617528Q480192M348456K767981K381503J299501P4863K20597J012564
1062.6H73056591O67274l34979l01420M72486L75092m76718n12540L15248M38929l56793
1083H73343170n94855J22547L94643l23773p38680k14338M2557p28130j387179j087129
$$ y = [873368442, 869607210, 867673755, 867001057, 866014838, 867149591, 872094989, 876738250, 877735317, 876762688, 876472414, 876385808, 874496639, 871068835, 867696285, 863933623, 859068274, 856252134, 858803988, 864152491, 867080629, 866437554, 864659727, 862848520, 859438896, 853230298, 845055759, 836865127, 832064211, 834491670, 842392683, 848163009, 850255609, 853752077, 858562410, 861526430, 861695170, 858231008, 851033807, 841225863, 830877423, 824870884, 828314304, 839853406, 852470934, 860951126, 865299582, 868067563, 870449066, 871748567, 871823430, 872044027, 873056591, 873723865, 873388886, 873087466, 873559952, 873935044, 873458326, 872945786, 873261034, 873699963, 873343170, 872748315, 872870862, 873265505, 872941732, 872203052, 871988714, 872031271, 871303141, 869915962, 868828833]
1103.4H68828833r26733k182662m365206n435705l135383J185596K797722J247108
1119.8H58013570q3863J27673J713156L481806L598332K090216M73320n0723L32415
1138.1H69695902L43919l06309n63562p5817J55628l08633n77688j80364L6717m72248
1158.5H67747545q79705n30362j28686l97921p17997m05670j50084r64224k788246
1176.9H60784650m371464k826751K086521M747807L180266J243412K03371n87403p39396
1195.2H63721013m06086n51701j253009j715779k066732k859830k547920j7286J885236
1213.6H54187906J361966K30908k90274m99010j106084k283275k720952j347959M13477
1231.9H47946703M90308o23345j284897j474202j906693k293944k067924j729786k143562
$$ y = [868828833, 867902100, 865719438, 861354232, 855918527, 852783144, 853968740, 856766462, 858013570, 857929707, 858057380, 859770536, 863252342, 866850674, 868940890, 869414210, 869363487, 869695902, 870039821, 869733512, 869169950, 869094133, 869249761, 868941128, 868363440, 868183076, 868219793, 867747545, 866867840, 866337478, 866208792, 865810871, 865092874, 864687204, 864537120, 863572896, 860784650, 856413186, 853586435, 855672956, 860420763, 863601029, 864844441, 865047812, 864460409, 863721013, 863314927, 862763226, 861510217, 859794438, 857727706, 854867876, 852319956, 852302670, 854187906, 855549872, 855780780, 855490506, 854991496, 853885412, 851602137, 848881185, 847533226, 847946703, 848437011, 847813666, 846528769, 845054567, 843147874, 840853930, 838786006, 837056220, 834912658]
1250.3H34912658l236294m565060o549597j0016024j4469147j5419960n260527J4314532
1266.6G89710581K6702822K2408068J1096418L117680o80804k182126k474070k662539
1282.9H45036030l233016l688097l785372l867805m009485m013240m250348n104005
1299.2H13084662n559921l261149J67310j817822r650588j7004014k1858096k5403917
1315.6G28696465k5657892j9474506n927563J5502989L8109243M6262086L6932349
1329.8H14443171K1995485J0467470L790080K61128k296567m491627n600810n649269
1346.2H32919061n154669n229294n998075o568730p167876r544313j5297949k1233023
1362.5G56725132j4482498O442488K3261785K3305833J2179673k573132j3743282p861972
$$ y = [834912658, 831676364, 827111304, 820561707, 810545683, 796076536, 780656576, 775396049, 789710581, 816413403, 838821471, 849917889, 853035569, 852354765, 850172639, 847698569, 845036030, 841803014, 838114917, 834329545, 830461740, 826452255, 822439015, 818188667, 813084662, 807524741, 804263592, 804430902, 802613080, 792962492, 775958478, 754100382, 728696465, 703038573, 683564067, 677636504, 693139493, 731248736, 777510822, 814443171, 836438656, 846906126, 850696206, 850957334, 848660767, 844169140, 838568330, 832919061, 827764392, 822535098, 816537023, 809968293, 802800417, 793256104, 777958155, 756725132, 742242634, 748685122, 771946907, 795252740, 807432413, 804859281, 791115999, 783254027]
1378.8G83254027Q989394J5128732Q491397J084447l721238n878329q236289j3736129
1395.1G85376012k0742356k7862013k2517562N905152L8391232M3343544K5965452
1409.4H27859461J0248006J746833p80106j561045m890919p339716p346511p622599
1425.7H10313404p502556p521153o759822m925370o564975j1308014j0070086m962802
1442G50698626r63330m01378l914535q216023q929968m022718R015858K3023189K0254194
1460.4G76543915J4611900J0700405M851579J274288Q27909q91686l602385l903687
1476.7H00412238l507376l577769l508866k530694j885056l540158o274581n674601
1493G69913137m231632o175458r616375j0398269r251535j1650741k1693468j9172847
$$ y = [783254027, 792243421, 807372153, 815863550, 816947997, 813226759, 807348430, 799112141, 785376012, 764633656, 736771643, 714254081, 720159233, 758550465, 801894009, 827859461, 838107467, 839854300, 839074194, 837513149, 832622230, 825282514, 817936003, 810313404, 802810848, 795289695, 788529873, 783604503, 777039528, 765731514, 755661428, 750698626, 749735296, 749333918, 745419383, 737203360, 728273392, 724250674, 733266532, 756289721, 776543915, 791155815, 801856220, 806707799, 807982087, 808809996, 807918310, 804315925, 800412238, 796904862, 793327093, 789818227, 787287533, 785402477, 781862319, 775587738, 769913137, 765681505, 759506047, 749889672, 739491403, 730239868, 718589127, 696895659, 677722812]
1509.3F77722812n142093Q315682K0332754K4560630J8189311R563744J138032l925681
1525.6G50755191o085217n866110m119218l148556j502394J524925J451552n391121
1542G27619052j1571109j5393258j5714228j0953307J284182J6120434K4950326L2748699
1558.3G49090791K8968870J2477279J0034442J1492550J1852742R737014M671812J777590
1574.6H40103090j937926o426990q288443j0219753j1961043j3161421j4733612j6417265
1590.9G56956637j7342389j7932653j7963231j5900850j1040747m679382J550R44733
1607.2F73043668J63555K630771R694874J9204318K3799241J5648365P993102K975285
1623.5G55153179j063168j657307k040863k960324m010678q281946j1590123r820879
$$ y = [677722812, 672580719, 680896401, 701229155, 725789785, 743979096, 753542840, 754680872, 750755191, 744669974, 738803864, 734684646, 731536090, 730033696, 731558621, 733010173, 727619052, 716047943, 700654685, 684940457, 673987150, 675271332, 691391766, 716342092, 749090791, 778059661, 790536940, 800571382, 812063932, 823916674, 833653688, 838325500, 840103090, 838165164, 831738174, 823449731, 813229978, 801268935, 788107514, 773373902, 756956637, 739614248, 721681595, 703718364, 687817514, 676776767, 672097385, 672098935, 673043668, 673207223, 675837994, 685532868, 704737186, 728536427, 744184792, 752177894, 755153179, 754090011, 752432704, 750391841, 747431517, 743420839, 735138893, 723548770, 713727891]
1639.9G13727891p377028l876925o88135j300872k947628q078694k3591936k5567412
1656.2F40299261k0089150j3662696j845002R323001J5539110K4198532L2065511K7819812
1672.5G13648379K3672461K0274759J4840305J3547658J5003741J3811887P235169
1686.8H22034359N337536O115258O048918P387817P873237O063163L282607J026332
1703.1H65169227J553178J556754M46439Q23140K712309M476369K712488j756310j913965
1721.5H75779629l0756M80115M06504J286864K658665K445042n38647n62668J528502
1739.8H83453250J686454O78360P56443J768768J235008j291752j818776k33948N88774
1758.2H86822581K40863o44684p17700Q86560J953602J669943N20706q65340j069248
$$ y = [713727891, 706350863, 702473938, 701785803, 700484931, 697537303, 689458609, 665866673, 640299261, 620210111, 606547415, 604702413, 614025414, 629564524, 653763056, 685828567, 713648379, 737320840, 757595599, 772435904, 785983562, 800987303, 814799190, 822034359, 827371895, 833487153, 839536071, 846923888, 854797125, 860860288, 864142895, 865169227, 866722405, 868279159, 868725598, 869548738, 872261047, 876737416, 879449904, 877693594, 875779629, 875748873, 876228988, 876635492, 877922356, 880581021, 883026063, 882487416, 881924748, 883453250, 885139704, 885818064, 886574507, 888343275, 889578283, 888286531, 886467755, 886233807, 886822581, 887063444, 886418760, 885701060, 886587620, 888541222, 890211165, 890731871, 889866531, 888797283]
1776.5H88797283o45339l43263n5075k13266r07898l10182J258552P83682j036167
1794.9H87328327o44923R42648J127720m00305r71794K08199J186252K64525j157582
1813.2H87883067p63178J81079p2419m07637M40419J257420J026570m5418j222670
1831.6H88277233p32005J13189k94089k96772J127124J516581n80549j674414p81477
1850H86674821k6285l17574o73353j80066K83778j06275k56062P20918J055420p14124
1870.3H86461198j793623q31961K78651K27154m20034l67463K87712M86612k25961
1888.7H84102285j275718j541138k002478l585398l874540j134336K351284L477633
1905H76517594K611995J735687J080155L95179K38359N62906M44114j79708q51392
$$ y = [888797283, 888151944, 887808681, 887753606, 887540340, 886632442, 886322260, 887580812, 888364494, 887328327, 886683404, 887626052, 888753772, 888353467, 887381673, 887589872, 888776124, 889040649, 887883067, 887119889, 887300968, 887228549, 886820912, 887261331, 888518751, 889545321, 889499903, 888277233, 887545228, 887658417, 887364328, 887067556, 888194680, 889711261, 889130712, 887456298, 886674821, 886648536, 886330962, 885657609, 885477543, 885761321, 885655046, 885398984, 886119902, 887175322, 886461198, 884667575, 883835614, 884114265, 884341419, 883921385, 883553922, 883841634, 884328246, 884102285, 882826567, 881285429, 879282951, 875697553, 871823013, 870688677, 873039961, 876517594, 879129589, 880865276, 881945431, 882340610, 882578969, 883141875, 883585989, 883406281, 882554889]
1923.4H82554889q84116p4744K37584k14398l26633M4941J40012P987J09017J35302
1943.8H81729841r4771m38094n28932n1618K85089j42693o33240m30107m1723q6546
1964.2H79567206l19839l17692o3837m8101l71814l52800J05560K51949p2181j58668
1984.6H78219783K55645M95851J57118l70086m45306k08318l17216m77076j22785K79724
2005H77467334J09136k73764k11358J71006K21133k55406o01768m20451m24386o66916
2025.4H75114560k09212N06401M22656j38938k83182J43409M22657O9201l28899j56164
2045.8H75562489J02341q4877l28243j30057J76430J8418l41773k44022J22249J5259
2066.2H74868214l92675l79265j490Q7440k28464l46899n8771N4777k47896l43024
$$ y = [882554889, 881670773, 881596029, 881833613, 881619215, 881292582, 881337523, 881477535, 881485522, 881594539, 881729841, 881635070, 881196976, 880668044, 880616426, 880901515, 880758822, 880125582, 879695475, 879653752, 879567206, 879247367, 878929675, 878865838, 878817737, 878445923, 878093123, 878198683, 878450632, 878378451, 878219783, 878475428, 878971279, 879128397, 878758311, 878313005, 878104687, 877787471, 877310395, 877187610, 877467334, 877576470, 877302706, 877091348, 877262354, 877483487, 877228081, 876626313, 876205862, 875781476, 875114560, 874905348, 875411749, 875834405, 875695467, 875412285, 875555694, 875978351, 876047552, 875718653, 875562489, 875664830, 875579953, 875251710, 875121653, 875298083, 875316501, 874974728, 874730706, 874852955, 874868214, 874475539, 874096274, 874094784, 874182224, 873953760, 873606861, 873548090, 873602867, 873354971, 873011947]
2086.6H73011947P4148L74973J35481j29282K8073K23637R954k89142j67251J31250
2106.9H73403788K5928l19362k60770P4148O5982k22623k18570J04427J73092j69814
2127.3H72656226l42786p4327O8426k24650l94940q3626J71483o5208l60250j95503
2147.7H71154845J11758K563k81214j46806K06649J28925k52188l15308r6738j17243
2168.1H70395243l20256j98245K25842L87609R9779j16647L4571J25468j03295k36392
2188.5H70293677k6941J30772m1246k27928r3103J24812J9551k19822j26005J13905
2208.9H69947672K861l23355l48628q2016j4424k00272j90437P8559J55926q1599k08735
2231.4H68735552n8770k861j84000k65121j00375J0968j48893k82645r2626J30594
$$ y = [873011947, 873086095, 873461068, 873596549, 873467267, 873495340, 873718977, 873728931, 873439789, 873272538, 873403788, 873429716, 873110354, 872849584, 872923732, 872989714, 872767091, 872548521, 872652948, 872826040, 872656226, 872313440, 872239113, 872307539, 872082889, 871687949, 871604323, 871775806, 871710598, 871350348, 871154845, 871266603, 871269166, 870987952, 870841146, 871047795, 871176720, 870924532, 870609224, 870512486, 870395243, 870074987, 869876742, 870102584, 870490193, 870589972, 870473325, 870507896, 870633364, 870530069, 870293677, 870266736, 870397508, 870356262, 870128334, 870035231, 870160043, 870179594, 869959772, 869833767, 869947672, 869950533, 869627178, 869278550, 869196534, 869182110, 868981838, 868791401, 868869960, 869025886, 868944287, 868735552, 868676782, 868673921, 868489921, 868224800, 868124425, 868135393, 867986500, 867703855, 867611229, 867741823]
2251.8H67741823L4571j47641n3346J15395n126k46227k54154j05024j26362l22997
2272.2H66630912l48509j26123k1338j36376j16289J09315J79589j1205j47701o7115
2292.5H65945160o616j24752k32280j72555p6115p1585J3768L00587M78327K60413
2312.9H66314352p1764r2388Q6487Q2075j05202p9095K12133L28958J19567q5593j35541
2335.4H66573989j41561j02996N066O2227j07765k73943j17302K22206M00603K38240
2355.8H66758764J2755o8724j35839l56674n39243m60089l06129l31879m18305l95298
2376.2H63759339l76165m61340m94897l68119k33769k23696k42532j66356m9830m2975
2396.6H61099660j17719p1108P3671Q0168o3121j23620l2365J192r9599j38104l5584
$$ y = [867741823, 867776394, 867628753, 867575407, 867690802, 867685676, 867439449, 867185295, 867080271, 866953909, 866630912, 866282403, 866156280, 866134942, 865998566, 865882277, 865991592, 866171181, 866159976, 866012275, 865945160, 865938544, 865813792, 865581512, 865408957, 865332842, 865261257, 865275025, 865575612, 866053939, 866314352, 866242588, 866150200, 866236687, 866318762, 866213560, 866134465, 866346598, 866675556, 866795123, 866709530, 866573989, 866432428, 866329432, 866334498, 866396725, 866288960, 866015017, 865897715, 866119921, 866520524, 866758764, 866771519, 866702795, 866566956, 866210282, 865671039, 865210950, 864904821, 864572942, 864154637, 863759339, 863383174, 862921834, 862426937, 862058818, 861825049, 861601353, 861358821, 861192465, 861142635, 861099660, 860981941, 860910833, 860984504, 861064672, 861001551, 860877931, 860845566, 860846758, 860747159, 860609055, 860573471]
2419H60573471l100j14322j39415j8179K9146r1552k10524j93834j37568j72794k17914
2441.4H59303415j46449o2346j15931k10464j83404j13964j33335j62363q6785Q702
2461.8H58097076l635p0215n8591K563l0875j54317j75059n6743j9253j26898k00808
2484.3H57203245j56641j20282k02715k90037k35676j36495j27792q5295Q6189J82151
2504.7H56116652N0545j28686j45316p8738j21176k41101k67327k27213k85625l92855
2525.1H54279160l15725m5061J36256R3341K622J5617k861j76132l24130k93851k05696
2547.5H53163540j76847j07407O6459J77920R4890m7802n3764K4080k0802j56521j32144
2569.9H52831602L4869M0412j83225l42727k64525j11878n3465k6524Q5592J51098
$$ y = [860573471, 860570371, 860456049, 860316634, 860298455, 860327601, 860236049, 860025525, 859831691, 859694123, 859521329, 859303415, 859156966, 859094620, 858978689, 858768225, 858584821, 858470857, 858337522, 858175159, 858088374, 858097076, 858093441, 858023226, 857964635, 857967198, 857936323, 857782006, 857606947, 857550204, 857530951, 857404053, 857203245, 857046604, 856926322, 856723607, 856433570, 856197894, 856061399, 855933607, 855848312, 855934501, 856116652, 856167197, 856038511, 855893195, 855814457, 855693281, 855452180, 855184853, 854957640, 854672015, 854279160, 853963435, 853918374, 854054630, 854147971, 854150593, 854166210, 854163349, 853987217, 853663087, 853369236, 853163540, 852986693, 852879286, 852945745, 853123665, 853218555, 853170753, 853116989, 853141069, 853120267, 852963746, 852831602, 852866471, 852906883, 852723658, 852380931, 852116406, 852004528, 851951063, 851924539, 852010131, 852161229]
2590.3H52161229J0728j40905q4996Q464j03355k63691k04861p8857j75714l67403
2610.7H50760639l56496k55406l68118n81682n18560j43051J81138K44499K61664M07755
2631.1H49632382M49717K27452M9352J09196J14501q8692k26021j51634j00136k77042
2651.5H49739075m75586m15623k77281l69847n68389m86255j21951Q8215M9173O2764
2671.9H47224295J54913R2208j39296k40922j11878n2750j93179k58445q6487L8743
2692.3H46427202j03414k40087j37031m1247k12252m21286l30984j58847l04162n42343
2712.7H43935549m54783j88291j21594k38657k26199j09315l31998q49843q18908J38402
2733.1H40734363J013040Q34048J78158p4625p7903k17497l77536l16024j44303j66416
$$ y = [852161229, 852171957, 852031052, 851946056, 851954520, 851851165, 851587474, 851382613, 851303756, 851128042, 850760639, 850404143, 850148737, 849780619, 849198937, 848680377, 848537326, 848718464, 848962963, 849224627, 849632382, 850082099, 850309551, 850358903, 850468099, 850582600, 850493908, 850267887, 850116253, 850016117, 849739075, 849263489, 848847866, 848570585, 848200738, 847632349, 847146094, 847024143, 847112358, 847161531, 847224295, 847379208, 847471416, 847332120, 847091198, 846979320, 846926570, 846733391, 846474946, 846388459, 846427202, 846323788, 846083701, 845946670, 845905423, 845693171, 845271885, 844940901, 844782054, 844477892, 843935549, 843480766, 843292475, 843170881, 842932224, 842706025, 842596710, 842264712, 841414869, 840595961, 840734363, 841747403, 842581451, 842759609, 842684984, 842607081, 842389584, 842012048, 841696024, 841551721, 841385305]
2753.5H41385305l27230l34620k75016m15087o16848n49615l17215l12508m87268m91261
2773.9H37258637l44992l62277o17265p82431o63161o00219q69393j172423j153768
2792.2H30692708r62138q28266n76675p272O32585Q49366P06970O94216P17103M28021
2812.6H32346618J2577j37925n6744j61409n21422p02202o00696o27637r01103j035809
2833H27614248q56817p56741j072645j441419j388132j189650j315116j497865j208604
2851.4H16887259p08103o06775p87556q65162q91208r29594n44608P27475K371907
2869.7H14653635L077507K330244J159191M93943l1590p41303j170516j106739r42051
2888.1H17722321r34720q35836m17710o3717j45435l25025k73466k43783o00815j272439
$$ y = [841385305, 841058075, 840723455, 840448439, 840033352, 839416504, 838866889, 838549674, 838237166, 837749898, 837258637, 836913645, 836551368, 835934103, 835151672, 834488511, 833888292, 833018899, 831846476, 830692708, 829730570, 828902304, 828325629, 828318357, 828950942, 829800308, 830507278, 831201494, 831918597, 832346618, 832359195, 832221270, 832164526, 832003117, 831481695, 830779493, 830178797, 829551160, 828650057, 827614248, 826757431, 826000690, 824928045, 823486626, 822098494, 820908844, 819593728, 818095863, 816887259, 816179156, 815572381, 814784825, 813919663, 813028455, 812098861, 811554253, 812281728, 814653635, 817731142, 820061386, 821220577, 821714520, 821682930, 820941627, 819771111, 818664372, 817722321, 816787601, 815951765, 815534055, 815470338, 815324903, 814999878, 814726412, 814482629, 813881814, 812609375]
2908.5H12609375j928926k625287l527283l873050k340675Q27253L281116L372133
2924.8H05794656K124965J137257M96566k97188j359880k920568n267918p060707n135059
2943.2G87512124J006841O543100P320702M789353K071499R0421j569331l120184m124939
2961.5H00519586l935814k195359O59407L324985M600346M154146K686083J446605
2977.8H11259985Q82328M44114q0765l05712k07901k56300o90877j130760j037776
2996.2H08876336n64695j05142M19080R29534J035035O17743K0682k87831k81810l84987
3016.6H10273945p32302r95100j160085j616657k296448k640009k449691j969933j402080
3034.9G95011640r16005p46488r97126j284302j017212l54410j22368o53446j331329
$$ y = [812609375, 810680449, 808055162, 804527879, 800654829, 798314154, 799141407, 802422523, 805794656, 807919621, 809056878, 809553444, 809256256, 807896376, 804975808, 799707890, 792647183, 787512124, 788518965, 795062065, 802382767, 807172120, 809243619, 809334040, 807764709, 804644525, 800519586, 796583772, 794388413, 795047820, 798372805, 802973151, 807127297, 809813380, 811259985, 812142313, 812586427, 812505662, 812199950, 811992049, 811735749, 811044872, 809914112, 808876336, 808311641, 808206499, 808625579, 809555113, 810590148, 811207891, 811228573, 810940742, 810658932, 810273945, 809541643, 808546543, 807386458, 805769801, 803473353, 800833344, 798383653, 796413720, 795011640, 794095635, 793349147, 792352021, 791067719, 790050507, 789696097, 789573729, 788920283, 787588954]
3053.3G87588954j574218j609564j724243j630366j082719m12881j1206L95298J210690
3071.7G81149745K144039K630412K545119K197742J881063J493156R51350N49555L04400
3090G95846581j67191r32276j656294k177417k656519k945841k518296j601040j278937
3108.4G79912770j954913k832950l212273l245949l163398k697348j491666L32057
3124.7G61646330K060652L116369L572524L641963L283083K623320J944065J330137
3141G83218443P90179L13997q761m8995j57297p56681j385033j488507j400232j556874
3161.4G77520239j867890k060056k162575k422989k785385k961635k965987l055632
3177.7G57238090l168642k962888k361357j586378p18832L48211J470566K260327K540290
$$ y = [787588954, 786014736, 784405172, 782680929, 781050563, 779967844, 779554963, 779543757, 779939055, 781149745, 783293784, 785924196, 788469315, 790667057, 792548120, 794041276, 794992626, 795542181, 795846581, 795679390, 794747114, 793090820, 790913403, 788256884, 785311043, 782792747, 781191707, 779912770, 777957857, 775124907, 771912634, 768666685, 765503287, 762805939, 761314273, 761646330, 763706982, 766823351, 770395875, 774037838, 777320921, 779944241, 781888306, 783218443, 784008622, 784322619, 784313858, 784264863, 784107566, 783350885, 781965852, 780477345, 779077113, 777520239, 775652349, 773592293, 771429718, 769006729, 766221344, 763259709, 760293722, 757238090, 754069448, 751106560, 748745203, 747158825, 746439993, 746788204, 748258770, 750519097, 753059387]
3196.1G53059387K394557J986206J439452P71522J32919k72334n81026r90271j341165
3214.4G56599247j443088j483202j716315j993597k107918k238631k577901k991498
3230.7G40047097l361821l785253m196465m419505m448593m322231m166543m119456
3247.1G07227230l908515l164947k066255j026988r6321Q19385J336873R99212N4300
3265.4G00173974r03368j681507k411484k924502l026247k980232l087521l337979
3281.7F79821134l455580l186106k523125j507520k31624J144350K484321L612340
3298F76158190M549801N391121N872786N786121N455613N218983N006552M625558M028738
3316.4G22093463L392637K897978K597630K554297K724946K867639K780377K476037
$$ y = [753059387, 755453944, 757440150, 758879602, 759651124, 759784043, 759511709, 758930683, 757940412, 756599247, 755156159, 753672957, 751956642, 749963045, 747855127, 745616496, 743038595, 740047097, 736685276, 732900023, 728703558, 724284053, 719835460, 715513229, 711346686, 707227230, 703318715, 700153768, 698087513, 697060525, 696964204, 697783589, 699120462, 700119674, 700173974, 699270606, 697589099, 695177615, 692253113, 689226866, 686246634, 683159113, 679821134, 676365554, 673179448, 670656323, 669148803, 668917179, 670061529, 672545850, 676158190, 680707991, 686099112, 691971898, 697758019, 703213632, 708432615, 713439167, 718064725, 722093463, 725486100, 728384078, 730981708, 733536005, 736260951, 739128590, 741908967, 744385004]
3332.7G44385004K130210J803577J380563R33409O47008M90368L69549J97947j22011
3351.1G52215624m59612o13153o46710p10666q35419q98957q55029r48250j286268
3369.4G44961560j565337j554668j396418j277804j232922j233042j218676j108527
3385.7G34374166q33750n77450p48992j176119j125157o40511n23448r77457j276731
3404.1G26494551r96650o98506o89865o89566p29203p69854n63621l82662m69506m92334
3424.5G20012784k76506p7307n3942j9014N0425r8705k87890j60635J27494L84152
3444.9G19600856M55916K49982J70827L40223N26846P10368P79271O17921N95749R07361
3465.3G24955320R82404N32627J78874L63111O59466Q46028R73821Q09550O01530O43433
$$ y = [744385004, 746515214, 748318791, 749699354, 750632763, 751279771, 751770139, 752139688, 752337635, 752215624, 751756012, 751142859, 750496149, 749785483, 748950064, 748051107, 747196078, 746247828, 744961560, 743396223, 741841555, 740445137, 739167333, 737934411, 736701369, 735482693, 734374166, 733540416, 732962966, 732213974, 731037855, 729912698, 729272187, 728748739, 727771282, 726494551, 725497901, 724799395, 724109530, 723419964, 722690761, 721920907, 721357286, 720974624, 720505118, 720012784, 719736278, 719658971, 719605029, 719586015, 719636440, 719537735, 719249845, 719089210, 719216704, 719600856, 720056772, 720306754, 720477581, 720817804, 721344650, 722055018, 722834289, 723452210, 724047959, 724955320, 725937724, 726470351, 726649225, 727012336, 727671802, 728517830, 729491651, 730301201, 730902731, 731546164]
3485.7G31546164O18815N59092P27653R20534R15289Q40783J008451J148343P07090
3504G38992214L66986P14898R85205R06110Q79467R77635J119614J314163J515865
3522.4G47772157J330257Q64744O31690O41644R01759J267910J188576Q98659J255453
3540.8G56752849J890599J770079Q68559M46201Q62479R63509P01070R64761J488506
3559.1G66708612J616002J669228K080559J733065K20299k24471O28054J329362J405239
3577.5G77165949J375020J653314K279818K731561J907885N45740P18534J520157J552463
3595.8G91450441J316666J309753J163304J224398J791776K095818J729131J462042
3612.1H03543329J357556J336693J452566O97434j03593O74367K188682K425790K92063
$$ y = [731546164, 732164979, 732724071, 733451724, 734372258, 735287547, 736128330, 737136781, 738285124, 738992214, 739359200, 740074098, 741059303, 741965413, 742844880, 743822515, 744942129, 746256292, 747772157, 749102414, 749967158, 750598848, 751240492, 752142251, 753410161, 754598737, 755497396, 756752849, 758643448, 760413527, 761282086, 761728287, 762590766, 763554275, 764255345, 765220106, 766708612, 768324614, 769993842, 772074401, 773807466, 774027765, 773803294, 774431348, 775760710, 777165949, 778540969, 780194283, 782474101, 785205662, 787113547, 787659287, 788377821, 789897978, 791450441, 792767107, 794076860, 795240164, 796464562, 798256338, 800352156, 802081287, 803543329, 804900885, 806237578, 807690144, 808387578, 808283985, 808958352, 811147034, 813572824, 813864887]
3630.5H13864887p57039j27137K35796L19481O10888J164496K125085L209173K513230
3648.8H23158860q02815k185344r72748j18494l85940m59850j65463N03600J632214
3667.2H20204020K094507R21786L22520K13206j429438k121807j280009k1696J434803
3685.6H20337892K513468J438379j065016j486420n80967J07348N63741N10037j23859
3703.9H22214603O5446J239300J765668K15829j548350j216292P689P35998O09755
3722.3H24089646N5015l28600j36435R18746K171397J762450n33521j762092r44555
3740.6H25292051N44727J094699J85728N5790q3983j462758j597643o06537k92718
3759H23129356p39455n88894N2810K55167N126o69420r96053k56360P07686O41883
$$ y = [813864887, 813107848, 812980711, 813216507, 813535988, 814146876, 815311372, 817436457, 820645630, 823158860, 822356045, 820170701, 819197953, 819079459, 818693519, 818233669, 818068206, 818571806, 820204020, 822298527, 823220313, 823542833, 823756039, 822326601, 820204794, 818924785, 818903089, 820337892, 822851360, 824289739, 823224723, 821738303, 821157336, 821264684, 821828425, 822338462, 822214603, 822280049, 823519349, 825285017, 825500846, 823952496, 822736204, 822743893, 823479891, 824089646, 824144661, 823816061, 823679626, 824598372, 826769769, 828532219, 827998698, 826236606, 825292051, 825836778, 826931477, 827117205, 827172995, 827089012, 825626254, 824028611, 823422074, 823129356, 822389901, 821801007, 821853817, 822108984, 822114110, 821444690, 820448637, 820192277, 820899963, 821541846]
3779.4H21541846l26276o13987m10796m33385l32773l6835N06699J114368J110971
3797.7H22119832Q54552K73824p67112r15587j021266j150370k06232J066804J413524
3816.1H21667969Q62360N03421o03497j550376j034260l62516J90318P00176R35912
3834.4H21309507J001894L79980q41439j452803j386524p41362M82321J751363J756549
3852.8H22259486p39515k079606j158118J65224Q40127L30210j11342K30492l5227
3871.2H19701731q29458j081526n55992M81724N85139q8274m18902p02262l25322N6446
3891.6H16823304n09978m13417P51912J377762O34193o10292j459420j490056q88706
3909.9H14215302k04741L78370O80864K83539l06070k72453o8426k25246k02477J24395
$$ y = [821541846, 821215570, 820601583, 820190787, 819757402, 819424629, 819387794, 819894493, 821008861, 822119832, 822974384, 823248208, 822481096, 821565509, 820544243, 819393873, 819187641, 820254445, 821667969, 822530329, 823033750, 822430253, 820879877, 819845617, 819483101, 819673419, 820373595, 821309507, 822311401, 822691381, 821849942, 820397139, 819010615, 818269253, 818751574, 820502937, 822259486, 821519971, 819440365, 818282247, 818447471, 819287598, 819617808, 819506466, 819736958, 819701731, 818872273, 817790747, 817234755, 817716479, 818301618, 818213344, 817794442, 817092180, 816766858, 816823304, 816313326, 815899909, 816651821, 818029583, 818663776, 818053484, 816594064, 815104008, 814215302, 814010561, 814388931, 815069795, 815353334, 815047264, 814774811, 814706385, 814481139, 814278662, 814403057]
3930.3H14403057L874n15759o07490j64330L28004L49164j01447j76191N1856j66476
3950.7H13404262m45425l43860j02222J0789p6354k08914j44601M2319N3764n2810
3971.1H12136948m6193L933r9003k03550j01685r537q1003j17480o8188l5525n6088
3993.5H11322629j55210k22385
3997.6H10945034
$$ y = [814403057, 814406931, 813891172, 813283682, 813119352, 813447356, 813796520, 813695073, 813518882, 813570738, 813404262, 812958837, 812614977, 812512755, 812523544, 812447190, 812238276, 812093675, 812135994, 812189758, 812136948, 812090755, 812094688, 811995685, 811792135, 811690450, 811680913, 811599910, 811482430, 811414242, 811378717, 811322629, 811167419, 810945034]
##END=$$ End of the data block
