##TITLE=Nicole $$ Begin of the data block
##JCAMP-DX=5.00 $$ ACD/SpecManager v 10.08
##SPECTROMETER/DATA SYSTEM=Alpha
##DATE=04 Nov 2014 09:02:00
##DATA TYPE=INFRARED SPECTRUM
##DATA CLASS=XYDATA
##ORIGIN=
##OWNER=
##NPOINTS=1765
##FIRSTX=399.76428223
##LASTX=3997.64306641
##MAXX=3997.64306641
##MINX=399.76428223
##MAXY=0.88833421
##MINY=0.39259961
##XFACTOR=1.0000000000
##YFACTOR=1.000000000000000e-9
##FIRSTY=0.83851725
##DELTAX=2.03961372
##XUNITS=1/CM
##YUNITS=ARBITRARY UNITS
##XYDATA=(X++(Y..Y))
399.8H38517249l939689j346469P51317J597345J032472K97904R56714L357410N328000
418.1H46552253L113925L71874J194238J727939N2869j165151Q6367J441657R4533
436.5H53470504j518905l96430J184940K69413j491964r41217Q33869M96447j233101
454.8H50673556j174986Q34o44087k557218l176570l011644n669832j2976170j8898606
473.2H02565277r791077R859741J9375146J4074683P012248L502965O69002j391172
489.5H45876813j283586J49429O59406o4850j58489M50194m80413l091693n447924
507.9H36608887p518590r494722p142365O3897K897441j296103j593113N901098J1960030
526.2H30386460J0035813M764080J138746J21475O39438M77434n67198q74758j53065
$$ y = [838517249, 834577560, 833231091, 833982408, 835579753, 836612225, 836910129, 837866843, 841224253, 846552253, 849666178, 850038052, 851232290, 852960229, 853013098, 851847947, 851934314, 853375971, 853470504, 851951599, 851555169, 852740109, 853009522, 851517558, 850576341, 851410210, 851906657, 850673556, 849498570, 849499404, 848855317, 846298099, 843121529, 840109885, 834440053, 821463883, 802565277, 792774200, 802633941, 822009087, 836083770, 843096018, 846598983, 847267985, 845876813, 844593227, 844742656, 845402062, 845337212, 845178723, 845628917, 845148504, 842056811, 836608887, 829090297, 819595575, 812453210, 812517107, 815414548, 814118445, 812525332, 818426430, 830386460, 840422273, 845186353, 846325099, 846446574, 847086012, 847563446, 846996248, 846121490, 845968425]
544.6H45968425P8857q95798j699686j381397j447618l065408n016326p130921j1093200
562.9H14316928j1056602L33906J3079583J3773382O975472J692116o47425j312376
579.3H37154984j949250l547132n729079p557631r187520j0647475r913087m952312
595.6G83671498L487289J1382520J4374495J2222111Q468390N145013K327263J74046
611.9H41252625j197219k891838n306304r645998j5208483q662522J1044323J7128647
628.2H26513231K148568j8453359l3586025j9841612J8190861L0466020P329822k3801208
644.5G88966298m5374989k7582407K7666032N6350469L9045096J6040802O059766K644062
660.8H63815129Q52108l12627j316130j908242j361549p12097N94735J738310J303613
$$ y = [845968425, 846047282, 845151484, 843451798, 842070401, 840622783, 837557375, 832541049, 825410128, 814316928, 803260326, 803594232, 816673815, 830447197, 837422669, 839114785, 838467360, 837154984, 835205734, 831658602, 825929523, 818371892, 809184372, 798536897, 788623810, 783671498, 787158787, 798541307, 812915802, 825137913, 833606303, 838751316, 841078579, 841252625, 840055406, 837163568, 831857264, 822211266, 807002783, 798340261, 809384584, 826513231, 828661799, 810208440, 776622415, 756780803, 774971664, 805437684, 812767506, 788966298, 743591309, 716008902, 743674934, 800025403, 839070499, 855111301, 861171067, 863815129, 864667237, 864354610, 863038480, 861130238, 859768689, 859056592, 859651327, 861389637, 862693250]
679.2H62693250j92463j731873l072381m914701q648276j6298711l2249391o0349167
695.5G35236287q0296516m3506921L8264454Q0372035O3508094L7053167K1577180
709.8H52207780J2590587P209480L660559J242757J84596O6519m13418j640141l737986
728.1H71370733o127119m250050K847433O068051K761662p84933k929628m017830l355503
746.5H61582816k311588k826631m658341p063806j0407329j7228126l1085790m7635495
762.8G38365710l7113369J8921912O5262735N4724514K4003744Q476019L088236M15445
779.1H76144946k20895O90698R84848r954r31561r46105q46683j363636k126991k436102
799.5H68938565k723276l702343m271328l385723l194809o903946j5246690k5740444
$$ y = [862693250, 862500787, 860768914, 857696533, 852781832, 844133556, 827834845, 795585454, 735236287, 654939771, 611432850, 649697304, 730069339, 793577433, 830630600, 852207780, 864798367, 872007847, 875668406, 876911163, 877095759, 877162278, 876748860, 875108719, 871370733, 865243614, 860993564, 863840997, 869909048, 872670710, 871885777, 868956149, 864938319, 861582816, 859271228, 856444597, 851786256, 844722450, 834315121, 817086995, 786001205, 738365710, 701252341, 720174253, 785436988, 840161502, 864165246, 872641265, 875729501, 876144946, 875924051, 876614749, 877599597, 877589643, 876658082, 875711977, 874865294, 873501658, 871374667, 868938565, 866215289, 862512946, 858241618, 854855895, 851661086, 844757140, 829510450, 803770006]
815.8H03770006k6511431m807770K3123264K8023064J3461411j10090p801473j3437271
832.2H15709710j9929409l0773282m7842503n6016802l0505598R346187J7264426J3285518
848.5F70538247L8537919O2737703N2015126K6268721Q305430J013100K638579O756663
864.8H68811488O215155K372027q18730l497004o517589p640958l311157M358709Q340179
883.2H68312120O674231L221988P29919q29995k106607l725290o588757j1870861j8730581
901.5H35086167j8875718m380942J2474060J0421873j0119379k1273494l40879K7317286
917.8H30308974K7219057J1857152K866387J7107j039446j419007j647830k326251
934.1H65836143l612577n502761p305145q070052p362544m927397l912330r761154
$$ y = [803770006, 777258575, 772450805, 795574069, 823597133, 837058544, 836948454, 829146981, 815709710, 795780301, 765007019, 717164516, 661147714, 630642116, 639988303, 657252729, 670538247, 709076166, 771813869, 823828995, 850097716, 858403146, 859416246, 862054825, 868811488, 875026643, 877398670, 876579940, 873082936, 866565347, 858924389, 855613232, 859971941, 868312120, 874986351, 878208339, 878938258, 878108263, 876001656, 872276366, 865687609, 853816748, 835086167, 816210449, 811829507, 824303567, 834725440, 824606061, 803332567, 802991688, 830308974, 857528031, 869385183, 872251570, 872268677, 871229231, 869810224, 868162394, 865836143, 862223566, 856720805, 849415660, 841345608, 833983064, 829055667, 825143337, 815382183]
950.5H15382183k1110833l0610502k7650297l593266K7821482L9635479K9192329J4883041
966.8H43949616O741106M157961L569305K046764K20418q14677j388907k315938l519953
985.1H52645695l774464k470314j529396k455950m303992o769597q678615o606102
1001.4H16057265m433990j0498106k3451328k8693438p416129K3547470K6504398O909907
1017.8G98526049j0665417k2620738k4871409j1392831O72102k81632m450202j3785541
1034.1G11130381k8983176l4389019k1116674J949966J6661346J0595858n028725m078984
1050.4F46740973J6866505L4514010L4443319K3331344Q931875r365380l3588826o1032772
1066.7F60841048o6099644r517372O8423331P8157902L6791563J2132525N545080j727104
$$ y = [815382183, 794271350, 763660848, 736010551, 732417285, 760238767, 799874246, 829066575, 843949616, 850690722, 854848683, 858417988, 860464752, 860685170, 859870493, 858481586, 856165648, 852645695, 848871231, 846400917, 844871521, 842415571, 838111579, 831341982, 822663367, 816057265, 811623275, 801125169, 777673841, 748980403, 741564274, 765111744, 791616142, 798526049, 787860632, 765239894, 740368485, 728975654, 729647756, 729366124, 724915922, 711130381, 682147205, 647758186, 626641512, 628591478, 645252824, 655848682, 650819957, 646740973, 663607478, 698121488, 732564807, 755896151, 764828026, 755462646, 721873820, 660841048, 594741404, 585224032, 653647363, 731805265, 768596828, 780729353, 786274433, 784547329]
1083G84547329p908404j0439038j2751520j6840219k2105277k7876556l4674704m2817175
1099.4F09134436n0333083n2281141m3541938k4505198j824499J7393321L3784867
1113.6D87826765M8172831M7842860K6305974L484726j90437J1581600K3169398K6827872
1129.9F75021589K4553954J9680679J4314652R931028O697356L332317j074672o186842
1146.3G46270061j1721373j8301070k5682628l1206608l5064995m0787280m2212426
1160.5E41293681k5679350O173670L3091307M0706515L2093883K1175146J5807032
1174.8F64661884Q410871o627977j9511461j8190861L064931L5552382N3617597M6975017
1191.1G67952383L1388580J9243598J0821045M583299P4208l944934q297205q548379
$$ y = [784547329, 776638925, 766199887, 753448367, 736608148, 714502871, 686626315, 651951611, 609134436, 558801353, 506520212, 462978274, 438473076, 436648577, 454041898, 487826765, 535999596, 583842456, 610148430, 613633156, 613442719, 625024319, 648193717, 675021589, 699575543, 719256222, 733570874, 743501902, 750199258, 753531575, 752456903, 746270061, 734548688, 716247618, 690564990, 659358382, 624293387, 583506107, 541293681, 515614331, 521788001, 554879308, 595585823, 627679706, 648854852, 664661884, 673072755, 666444778, 646933317, 628742456, 631807387, 667359769, 720977366, 767952383, 799340963, 818584561, 829405606, 833988905, 834063113, 830118179, 821820974, 813272595]
1207.5H13272595k22087R256483R489417K685666l775597q003235j1242509j4216482
1223.8G97244251j7831624k3555457l0486346l5752773m0581405m9929917o1371922
1238.1E37734807n9900880l2437831J0083049L9041877M4062197L9076328L3133746
1252.3F10793293K2657513Q381486L188551J5258789L1153857L4938872K9428482K3324609
1268.6G79125452J8946946J5192270J2054563R843885P509649M767597K171636l35753
1285H49276245k901316n072475p015228r540915j2967468j7330408k2506654k7484536
1301.3G44457245k9263139k3539185j2560904q513809j8136978k9753387k2303879
1315.6F00385964o632805j9709468n0940096n9627712m2934239k1258771o683261K818466
$$ y = [813272595, 813050508, 822306991, 831796408, 834482074, 830706477, 822703242, 811460733, 797244251, 779412627, 755857170, 725370824, 689618051, 649036646, 599106729, 537734807, 477833927, 445396096, 455479145, 494521022, 538583219, 577659547, 610793293, 633450806, 641832292, 645020843, 660279632, 691433489, 726372361, 755800843, 779125452, 798072398, 813264668, 825319231, 835163116, 842672765, 847440362, 849611998, 849276245, 846374929, 841302454, 834287226, 824746311, 811778843, 794448435, 771941781, 744457245, 715194106, 691654921, 679094017, 670580208, 652443230, 622689843, 600385964, 593753159, 574043691, 523103595, 463475883, 420541644, 399282873, 392599612, 395418078]
1331.9C95418078J7598360M3712318P0960522P8125358O0488522L9076567K5617659
1346.2G30997384J7802894J3388574R927094N356729M99606l576338n005539K839327
1362.5G72229731J4974952J6755879J1634290P286727M978300L265559J367212j06514
1378.8H32386136q76903o84619l67105k307296n678058n263805L16500P584691R803653
1397.1H34913194O959379L562927J617313N34236o31690j572073k138793k023578j325726
1415.5H39895189j152814k682924n028725q009672j0259926q825958l513813N635023
1431.8H06056380J2564302J2602985O230116m64440m638016p449210o996870m147112
1448.1H13758135m343033r941995j6776085j4135778J0500729K2787631J3060093J239478
$$ y = [395418078, 413016438, 456728756, 527689278, 605814636, 666303158, 705379725, 730997384, 748800278, 762188852, 772115946, 777472675, 777972281, 774395943, 769390404, 772229731, 787204683, 803960562, 815594852, 822881579, 827859879, 831125438, 832492650, 832386136, 831509233, 830824614, 830457509, 828150213, 822472155, 817208350, 817524850, 825109541, 834913194, 841872573, 845435500, 847052813, 847587049, 846955359, 845383286, 843244493, 841220915, 839895189, 838742375, 836059451, 831030726, 823021054, 812761128, 803935170, 800421357, 806056380, 818620682, 831223667, 837453783, 836989343, 832351327, 824902117, 817905247, 813758135, 809415102, 799473107, 782697022, 768561244, 779061973, 801849604, 814909697, 816149175]
1464.5H16149175o095886o463945q588612j9688249k3563146r095371Q782864K3640692
1480.8G75077522K9447019K2490322J1557282K186715o059527r594620o422519L835201
1497.1H22517395J2300015J0054290M550516j924157j5429258k5534153l2163918m2405188
1513.4G31965542m6042264k7979433J7333567O0434520N6985438L0275345J6207576
1527.7H39180291Q671641N349040L660679J893520J607120J669407j75953p90834N2452
1546H61117363J195192J864136J776874J695811J934827J561999j304090j935601r22918
1564.4H66983593l69967p03990k347112l515720m299641p616222j1727988j6337812
1580.7H20065141k1165490j9070745j0748148l669321J890778P668913R250223M685044
$$ y = [816149175, 810053289, 803589344, 795000732, 775312483, 751749337, 742653966, 751436830, 775077522, 804524541, 827014863, 838572145, 840758860, 834699333, 825104713, 818682194, 822517395, 834817410, 844871700, 849422216, 847498059, 832068801, 806534648, 774370730, 731965542, 685923278, 657943845, 675277412, 735711932, 792697370, 822972715, 839180291, 847851932, 853200972, 856861651, 858755171, 860362291, 862031698, 861855745, 861064911, 861117363, 862312555, 864176691, 865953565, 867649376, 869584203, 871146202, 869842112, 867906511, 866983593, 866613626, 865909636, 863562524, 860046804, 855747163, 848130941, 836402953, 820065141, 798899651, 779828906, 769080758, 765411437, 767302215, 774971128, 784221351, 788906395]
1597G88906395k963841j0753393j5949249j8395185k3941994l5510540m5947969m3119669
1613.4E92324555j9364476K2962630M5050501M3315173L8528561K6367307J5365898
1627.6G64550149R652913O279588N515277N999267M998982M707456N651235O409467
1643.9H13764334P209897O287098M122793M925132N307555K018452J435697K277732
1660.3H47348690K799630K436578K146781K598762K576709J922667J680076R12190
1676.6H64422083J76370P14958J766979J338304l82543m07398J20461O96182J418829
1694.9H69864225J463294Q33691j86503p64668m23134j81675k7835L55780P58886R40443
1715.3H72632504J20103j271904j247167n50986j6093N17130J081705J482129J512707
$$ y = [788906395, 785942554, 775189161, 759239912, 740844727, 716902733, 681392193, 635444224, 592324555, 572960079, 595922709, 640973210, 684288383, 722816944, 749184251, 764550149, 774203062, 780482650, 785997927, 791997194, 796996176, 801703632, 807354867, 813764334, 820974231, 827261329, 831384122, 836309254, 841616809, 843635261, 845070958, 847348690, 850148320, 852584898, 854731679, 857330441, 859907150, 861829817, 863509893, 864422083, 864598453, 865313411, 867080390, 868418694, 868036151, 867628753, 867749214, 868445396, 869864225, 871327519, 872161210, 871974707, 871210039, 870786905, 870605230, 870577395, 870933175, 871692061, 872632504, 872752607, 871480703, 870233536, 869682550, 869666457, 870183587, 871265292, 872747421, 874260128]
1733.7H74260128N61535J40726M59493N22315N19097O06000N32210l5703q53181j030147
1754.1H75682473r52303r77040l58522Q14379J728058K327263K544880J949727N47231
1772.4H83306146r74536j506448j644373j922786j584530j84476J367330K194464K227068
1790.8H81277859J302064K45869J42753K37524j90734q92520j284898j307845j086771
1809.2H78443301n76496L10480J262903J684189J537442J390517J290381Q38161M13835
1827.5H86594713K12669k77996m48286l815M30107O09279P01546N15998o0201l55840
1847.9H87918174l95179m21047k74658q2254j15455k50875j59085J81675L58820j76311
1868.3H86583805j133561j411498j268148j473188j919151k020180j488268q91030
$$ y = [874260128, 874821663, 874962389, 875421882, 875944197, 876463294, 877069294, 877601504, 877565801, 876712620, 875682473, 874730170, 873753130, 873394608, 874208987, 875937045, 878264308, 880809188, 882758915, 883306146, 882331610, 880825162, 879180789, 877258003, 875673473, 875488997, 876856327, 879050791, 881277859, 882579923, 882825792, 882968545, 883206069, 883015335, 882122815, 880837917, 879530072, 878443301, 877866805, 878177285, 879440188, 881124377, 882661819, 884052336, 885342717, 886180878, 886594713, 886807382, 886529386, 886081100, 886077285, 886507392, 887116671, 887818217, 888334215, 888274014, 887918174, 887522995, 887101948, 886827290, 886745036, 886629581, 886378706, 886219621, 886401296, 886760116, 886583805, 885450244, 884038746, 882770598, 881297410, 879378259, 877358079, 875869811, 874978781]
1884.6H74978781r09090j211465q69810O8426N70237L28720o8664j2100N00262N91516
1905H73966813j51038m22657P78020K271533K763450K411962J469850L89576l96788
1923.4H83080721r71854j187026q67904j99973K25007J24872k56717o33001j073361
1941.7H78240764j770496k446294k812088k751588k163351q87275J147092L111004
1958.1H69667768L705740K860249J661479P86483J25587n04672p86484j30355J122236
1976.4H78508031J655281J064956J52052l90351m42386k28763n3942r3758j88291j60694
1996.8H79822135p8559K5272J78338L30328L76881L17990K52307K39789J95861m2259
2017.2H81618083l77536n00977l67463j54793j5736L1233O2346P9871Q8095J14978
$$ y = [874978781, 874069691, 872858226, 871988416, 872056842, 872627079, 872955799, 872887135, 872875035, 873375297, 873966813, 873815775, 873393118, 874171138, 876442671, 879206121, 881618083, 883087933, 883477509, 883080721, 882108867, 880921841, 880053937, 879853964, 880078971, 880203843, 879947126, 879314125, 878240764, 876470268, 874023974, 871211886, 868460298, 866296947, 865409672, 866556764, 869667768, 873373508, 876233757, 877895236, 878681719, 878807306, 878302634, 877516150, 877385795, 878508031, 880163312, 881228268, 881380320, 880989969, 880547583, 880318820, 880264878, 880171120, 879982829, 879822135, 879743576, 879768848, 879947186, 880277514, 880654395, 880972385, 881224692, 881464481, 881660342, 881618083, 881240547, 880739570, 880372107, 880217314, 880201578, 880232811, 880295157, 880375028, 880463123, 880578101]
2037.6H80578101J26779M2975j74702m37796o13510o55651o01709m49538j81437P9870
2058H77713382J59621O3777j00374k35379k11298q2731l3915p8321j59919k49088k25007
2080.4H76560748k5332J94013K89321L11255L83079N49376O84917O09756L62813J25349
2100.8H80045295m5061k24531m16577m67658l04282m5001J70350L60191N84364P05898
2121.2H80362988N82039L51786K22385J62244J7286j95325k78652j41799J013j08123
2141.6H80975842l64959n35607o53207q24988r67324r11892o38961k60234J28329M89175
2162H76436174P59184Q11935O19471L45945J18494p3194j81616j15096J14739L12507
2182.4H79148543K93851J12712p2002j60158j14918L5227J67608J91867J32323M4405
$$ y = [880578101, 880704880, 880747855, 880573153, 880135357, 879521847, 878866196, 878264487, 877814949, 877633512, 877713382, 877873003, 877936780, 877836406, 877601027, 877389729, 877306998, 877273083, 877194762, 877034843, 876785755, 876560748, 876535416, 876729429, 877018750, 877330005, 877713084, 878262460, 878947377, 879557133, 879919946, 880045295, 880000234, 879775703, 879359126, 878891468, 878587186, 878542185, 878712535, 879072726, 879657090, 880362988, 880945027, 881296813, 881519198, 881681442, 881698728, 881503403, 881224751, 881082952, 881083965, 880975842, 880610883, 880075276, 879422069, 878597081, 877629757, 876717865, 876078904, 875818670, 875946999, 876436174, 877195358, 878007293, 878626764, 878972709, 879091203, 879018009, 878836393, 878721297, 878836036, 879148543, 879442394, 879555106, 879483104, 879322946, 879208028, 879243255, 879410863, 879602730, 879735053, 879779458]
2202.8H79779458m5896j33156k01226k14517j76370j67668k35319l06725l25859l57985
2223.2H77614737m18306l85225k29954r2686o5147p7129J2279J82688K14636Q3864
2243.6H76839757k921k4736j29759l23594m57525m81725n13672n62013m05430K4736
2264H73963118L59892L15786J37627J28210K46286K62320R0718o5386l3915J0133j61052
2286.4H75253737l87490l95775k76506k70247l64304l31700j50799j01626k37525l09467
2306.8H72428298k18511j33335k20776l57926l93271m41194o29842q37803p90954n34892
2327.2H67869794l79383m07756m78446n01037n58495p44760r26674q75532o05405n21838
2347.6H61870468q85308j416087j659394j417994q68499j32323O08981J015007R63510
$$ y = [879779458, 879733562, 879600406, 879399180, 879184663, 879008293, 878840625, 878605306, 878298581, 877972722, 877614737, 877196431, 876811206, 876581252, 876488566, 876423419, 876346290, 876358569, 876541257, 876755893, 876839757, 876836836, 876812100, 876682341, 876358747, 875901222, 875419497, 874905825, 874343812, 873938382, 873963118, 874323010, 874638796, 874776423, 874904633, 875150919, 875413239, 875503957, 875438571, 875404656, 875414789, 875253737, 874866247, 874470472, 874193966, 873923719, 873559415, 873227715, 873076916, 872975290, 872737765, 872428298, 872209787, 872076452, 871855676, 871497750, 871104479, 870663285, 870033443, 869195640, 868404686, 867869794, 867490411, 867082655, 866604209, 866103172, 865544677, 864799917, 863873243, 862997711, 862392306, 861870468, 860985160, 859569073, 857909679, 856491685, 855623186, 855490863, 856099844, 857114851, 858078361]
2366H58078361P11321M15087N0008l70562p26819r39965j068175j159847j156508j012147
2386.4H52820754q68082r48668j271367j617848j813174j923144k120971k377749k530157
2404.7H37349594k617538k837181l232181l683746m134775m716098n605578o767273
2421H03755224p926107q758366r021759q582890p538378o215274m914761l801584l232181
2439.4G43763924l904164o259799r723008j2386620j1704147o385207K465546J2560487
2455.7G08427012K1150768K5287568K3974598J8989026J3111413Q416533N450070L587544
2472H28394532K222181J193642L11971p65622j992523k831459k963245k562404j630366
2490.4H19376707J29640K348662L891587M129469L500998K686262J946927J323640
$$ y = [858078361, 858789682, 859204769, 859254777, 858884215, 858157396, 857217431, 856149256, 854989409, 853832901, 852820754, 851952672, 851004004, 849732637, 848114789, 846301615, 844378471, 842257500, 839879751, 837349594, 834732056, 831894875, 828662694, 824978948, 820844173, 816128075, 810522497, 803755224, 795829117, 787070751, 778048992, 769466102, 761927724, 755712450, 750797689, 746996105, 743763924, 739859760, 733599961, 723876953, 711490333, 699786186, 693400979, 695866525, 708427012, 729577780, 754865348, 778839946, 797828972, 810940385, 819356918, 824806988, 828394532, 830616713, 831810355, 832122326, 831356704, 829364181, 826532722, 823569477, 821007073, 819376707, 819506347, 821855009, 825746596, 829876065, 833377063, 836063325, 838010252, 839333892]
2506.7H39333892R52124R20356R62734P34329L01600J3888n7221j31428k69890l59118
2527.1H42401266l82841n96106j208722j993180k564013k757430k657711k348244j711667
2545.5H26181352o81937M68910J336754J749098J763224J390517O47783j53780o13451
2563.8H32088470o89625o39975n87702m85778m78387q22723j379370j665533j432240
2582.2H23907137r62079q42154j338899k197206l105342l842592m088521l601909k625704
2600.5H01302731j771152j399100j428783j723468k172828k437949k153814j255691
2616.8G86959946o5744P58171O89924j25766j040816j671255k115011k458572k608002
2635.2G78322875k408623j704037n85497N30184J320242J837373K164006K097845J488925
$$ y = [839333892, 840286016, 841206372, 842169106, 842903435, 843205035, 843218923, 843161702, 843030274, 842760384, 842401266, 842018425, 841422319, 840213597, 838220417, 835656404, 832898974, 830241263, 827893019, 826181352, 825499415, 825968325, 827305079, 829054177, 830817401, 832207918, 832855701, 832701921, 832088470, 831398845, 830758870, 830171168, 829685390, 829207003, 828384280, 827004910, 825339377, 823907137, 822945058, 822102904, 820764005, 818566799, 815461457, 811618865, 807530344, 803928435, 801302731, 799531579, 798132479, 796703696, 794980228, 792807400, 790369451, 788215637, 786959946, 786894202, 787652373, 788342297, 788216531, 787175715, 785504460, 783389449, 780930877, 778322875, 775914252, 774210215, 773624718, 774154902, 775475144, 777312517, 779476523, 781574368, 783063293]
2653.5G83063293N30779l99947j025081j346827j507282j659751j952588k403081k933323
2671.9G70366192l496289m063130m592955n062759n376875n335570m919707m432679
2688.2G33086228m266023m624844n394995o227195o736100o731689o455898o491602
2704.5F86157882p293403q857071j0689855j2191713j3160586j3782084j4342070j5055179
2720.9E90785921j5868128j6386568j5987158j3749063q839011j497984O703019J3607502
2737.2E38768530J7604113J8175125J5703737J1442006P162929M148185K692997K353013
2753.5F18050635K211511J460731J64032r63867j493811j727164k319217l392815m001022
2771.8F07989013k988815o44148P93577j234830o740272j2466788j4857948j3023615
$$ y = [783063293, 783594072, 783194125, 782169044, 780822217, 779314935, 777655184, 775702596, 773299515, 770366192, 766869903, 762806773, 758213818, 753151059, 747774184, 742438614, 737518907, 733086228, 728820205, 724195361, 718800366, 712573171, 705837071, 699105382, 692649484, 686157882, 678864479, 670007408, 659317553, 647125840, 633965254, 620183170, 605841100, 590785921, 574917793, 558531225, 542544067, 528795004, 519955993, 518458009, 525161028, 538768530, 556372643, 574547768, 590251505, 601693511, 608856440, 613004625, 615697622, 618050635, 620262146, 621722877, 621886909, 620923042, 619429231, 617702067, 615382850, 611990035, 607989013, 605000198, 604356050, 605149627, 603914797, 597174525, 584707737, 569849789, 556826174]
2788.2E56826174q407056k409279M021108R014427J0600925R072304O756961N222142
2804.5E90697706M331171L736735L489911L534615L624976L913820N193352P630825
2820.8F26153111R731651R705484P807672O156802N535662M659355L035843J565337
2837.1F74350917J005769J820266M070878O777347Q504569Q379221O365359L036082
2853.4G14310408o10352l415704m848838m961848l693104j400649P14362J725018J693904
2871.8F99513197J076400L21508l29435j022518j829207k525449k780258k179086n52357
2890.1F89692795J503289K651453J879513k81274k340972l534914m108965m593015
2906.5F80867910n456447p061362r394408j1406004j1357665q755386n201876k698541
$$ y = [556826174, 548419118, 546009839, 550030947, 559045374, 569646299, 578718603, 585475564, 590697706, 595028877, 598765612, 602255523, 605790138, 609415114, 613328934, 618522286, 626153111, 635884762, 645590246, 653397918, 659554720, 665090382, 669749737, 672785580, 674350917, 675356686, 677176952, 681247830, 688025177, 696529746, 704908967, 711274326, 714310408, 713700056, 710284352, 705435514, 700473666, 696780562, 695379913, 696094275, 697819293, 699513197, 700589597, 700911105, 700581670, 699559152, 697729945, 695204496, 692424238, 690245152, 689692795, 691196084, 693847537, 695727050, 695445776, 693104804, 689569890, 685460925, 680867910, 675411463, 668350101, 658955693, 647549689, 636192024, 627436638, 622234762, 619536221]
2922.8F19536221j866996j849830j645863r82941L44634K220989L803491M570544M385054
2941.1F28515303K628505r87291n230606q195519q942008q238256p332802o225586
2957.4E85991740m028678j97649M816950R443700J2016535J2349605J1720121J1297286
2973.8F43409610J1197746J1014461J0404885R319723Q119940O685257M200220J319468
2990.1G05671310Q15869L784895P338464Q320808P008255N332708L899336K119720
3006.4G44291365o40571m174352o222307l615082K675951P179856P402241N664170
3022.7G52561271L849864K045274K42889j146853j157045O05881K511501K669811J133085
3041.1G63315678j22965J328051N182684P873356P174492M520476J930892r1195j473725
$$ y = [619536221, 617669225, 615819395, 614173532, 613190591, 613535225, 615756214, 619559705, 624130249, 628515303, 631143808, 630156517, 624925911, 616730392, 607788384, 599550128, 592217326, 585991740, 581963062, 581765413, 586582363, 596026063, 608042598, 620392203, 632112324, 643409610, 654607356, 665621817, 676026702, 685346425, 693466365, 700151622, 704351842, 705671310, 706487179, 710272074, 717610538, 725931346, 732939601, 738272309, 742171645, 744291365, 743650794, 739476442, 733254135, 729639053, 732315004, 739494860, 746897101, 752561271, 756411135, 758456409, 758699298, 757552445, 756395400, 757001281, 759512782, 762182593, 763315678, 763192713, 764520764, 769703448, 777576804, 784751296, 789271772, 791202664, 791111469, 789637744]
3059.4G89637744j953303j418174K05934K332867L628492L732979L382862L036082
3075.7H02585483K644956K121031J464665N54740o62446j489579r01401J067400L047704
3094.1H10432553L700495L061533J942813Q99852L30269L54529O20722P82669R51886
3112.4H23077321J160801J131415R48429P49469M89294L85583N38945O36220M66764
3130.8H29584241K49565K74658N27441O18518L09407K9028R6083K66790L76224L89755
3151.2H32721710J18077k95043m61221m64678n20408o80625r87411j391649j784682
3169.6H26254070k102792k239764j931966j062810O4015R91524J450181J474678J285076
3187.9H24182212R93848O66201M12882K27272M6611j10328j79649j76310j79410k45154
$$ y = [789637744, 787684441, 786266267, 786472201, 788805068, 792433560, 796166539, 799549401, 802585483, 805230439, 807351470, 808816135, 809370875, 808708429, 807218850, 806317449, 807384849, 810432553, 814133048, 817194581, 819137394, 820037246, 820367515, 820722044, 821342766, 822125435, 823077321, 824238122, 825369537, 826317966, 827067435, 827556729, 827942312, 828481257, 829117477, 829584241, 829833806, 830108464, 830635905, 831254423, 831563830, 831592858, 831688941, 831955731, 832331955, 832721710, 832839787, 832544744, 832083523, 831618845, 831098437, 830417812, 829430401, 828038752, 826254070, 824151278, 821911514, 819979548, 818916738, 818980753, 819972277, 821422458, 822897136, 824182212, 825176060, 825842261, 826255143, 826482415, 826529026, 826418698, 826239049, 826062739, 825883329, 825638175]
3208.3H25638175l45230m21405n05447o13451o85633p33256p90298q02100p24077n62131
3228.7H19455147l71695k48492k70962m19498n64873o35624o37054n79954n59031o31810
3249.1H14536154o48081n38170m53651m93586n54443n46992n18620m87864l85284k67685
3269.5H09641778l76403o21974p28429p18593o72102o67691p21574p57158p08699n66423
3289.9H03102732n50628q00073j102388j255214j200974r72331p95901r54449j401186
3308.2G94069588j790702j899600j782417j649201j624644j695395j717448j672029
3324.6G80238152j827836k114416k185285k078831j989126j978517k173125k475441
3340.9G63415575k627194k697348k631367k411246k522647k944410l074289k878010
$$ y = [825638175, 825292945, 824871540, 824366093, 823752642, 823067009, 822333753, 821543455, 820741355, 820017278, 819455147, 819083452, 818834960, 818563998, 818144500, 817579627, 816944003, 816306949, 815726995, 815167964, 814536154, 813888073, 813349903, 812896252, 812402666, 811848223, 811301231, 810782611, 810294747, 809909463, 809641778, 809265375, 808643401, 807914972, 807196379, 806524277, 805856586, 805135012, 804377854, 803669155, 803102732, 802552104, 801752031, 800649643, 799394429, 798193455, 797221124, 796425223, 795470774, 794069588, 792278886, 790379286, 788596869, 786947668, 785323024, 783627629, 781910181, 780238152, 778410316, 776295900, 774110615, 772031784, 770042658, 768064141, 765891016, 763415575, 760788381, 758091033, 755459666, 753048420, 750525773, 747581363, 744507074, 741629064]
3357.2G41629064k738953k810418k871156k700686k601862k894759l310204l316164
3373.5G18384862k921999k595484k474844k458990k415299k252698j955509j586557
3389.8F99723482j593232j989722k013684j512944j237810j645267k071977j837968
3406.1F85820878j392901j210273j214266j353979j406073j145601r08494q55268o76631
3424.5F75657392l91067k47120k62142j77741L6717M887k16007j26600K02179M46260
3444.9F74926758N79893N87583O28829P95543R70364J130760J213252J132369J115799
3463.2F83081150J364827J525402J207769P91609Q52645J184881J447141J501322J294970
3481.6F94251716J198948J345038J338959J225114J326382J522243J604378J493394
$$ y = [741629064, 738890111, 736079693, 733208537, 730507851, 727905989, 725011230, 721701026, 718384862, 715462863, 712867379, 710392535, 707933545, 705518246, 703265548, 701310039, 699723482, 698130250, 696140528, 694126844, 692613900, 691376090, 689730823, 687658846, 685820878, 684427977, 683217704, 682003438, 680649459, 679243386, 678097785, 677189291, 676334023, 675657392, 675266325, 675019205, 674757063, 674579322, 674616039, 674620926, 674404919, 674278319, 674480498, 674926758, 675506651, 676094234, 676723063, 677518606, 678488970, 679619730, 680832982, 681965351, 683081150, 684445977, 685971379, 687179148, 687970757, 688823402, 690008283, 691455424, 692956746, 694251716, 695450664, 696795702, 698134661, 699359775, 700686157, 702208400, 703812778, 705306172]
3497.9G05306172J439155J577079J417339J092970J221359J572251J746833J657606
3514.2G17030764J493811J539052J750290J945794J798093J475573J470089J591622
3530.6G30095088J694680J934826J983285J737118J836479K245664K315998J862049
3546.9G45705187J466513J591444J801074J803398J913190K182781K305687K211570
3563.2G60980844K326131K549589K126336J702488J932203K305031K475441K578377
3579.5G78976440K642274K709210K912641K891719K336085K092958K442598K656281
3595.8G99660206K585769K543985K431989K277613K402663K720356K663374K404749
3612.1H19690704K230227K033592K202332K148628J409232J122773J638532K483666
$$ y = [705306172, 706745327, 708322406, 709739745, 710832715, 712054074, 713626325, 715373158, 717030764, 718524575, 720063627, 721813917, 723759711, 725557804, 727033377, 728503466, 730095088, 731789768, 733724594, 735707879, 737444997, 739281476, 741527140, 743843138, 745705187, 747171700, 748763144, 750564218, 752367616, 754280806, 756463587, 758769274, 760980844, 763306975, 765856564, 767982900, 769685388, 771617591, 773922622, 776398063, 778976440, 781618714, 784327924, 787240565, 790132284, 792468369, 794561327, 797003925, 799660206, 802245975, 804789960, 807221949, 809499562, 811902225, 814622581, 817285955, 819690704, 821920931, 823954523, 826156855, 828305483, 829714715, 830837488, 832476020, 834959686]
3628.5H34959686K059817R67562R06289J083732J119554J177370J179338J276433J726508
3646.8H46456289K032936Q75711m31358j03355P94828P47561L25621K42114L74376
3665.2H51314723O56903J011551P46965K62559L55780j01686n73039k68042J88708
3683.5H53594422O93739J348972J190663n8294m93049j17839J73092L70801M69863
3701.9H57172370J84119L8027M09961Q10147O06834j58310m35531j08361K26081K70843
3722.3H59016180J16169n781p7129J26183P47145J034975M01139l84510n85556q94
3742.7H60387921P88510L49343p8440K02239j93954o44207l67641j6987j76132l18527
3763.1H59932125k1100J57952J53601l5167l60667k42472K57134M65930K503k96592
$$ y = [834959686, 837019503, 837987065, 838893354, 839977086, 841096640, 842274010, 843453348, 844729781, 846456289, 848489225, 849364936, 848933578, 848830223, 849625051, 850372612, 850698233, 850940347, 851314723, 851971626, 852983177, 853730142, 853992701, 854348481, 854246795, 853673756, 853405714, 853594422, 854288161, 855637133, 856827796, 856769502, 856276453, 856158614, 856331706, 856702507, 857172370, 857356489, 857394516, 857804477, 858614624, 859221458, 859063148, 858627617, 858519256, 858745337, 859016180, 859132349, 859126568, 859049439, 859175622, 859922767, 860957742, 861358881, 860974371, 860388815, 860387921, 861176431, 861525774, 861447334, 861649573, 861455619, 860811412, 860443771, 860426784, 860250652, 859932125, 859911025, 860068977, 860222578, 860187411, 859826744, 859584272, 859841406, 860307336, 860309839, 860013247]
3783.5H60013247j83106k31862k34365n7996J21773L38137K97188K80321M20153j48773
3803.9H60614717m11928k13682m44472m58002O6995O25551N08905K68936j19686o89269
3824.3H59748065m62710q5771N6266K09034K71797L50833K26021k83659n61416m88281
3844.6H58980179l86000k26915K32578R30368M12882q64983q88526k40266K37643J61410
3865H58348370j04785P4386Q7381l43323n17011m33326J7822K17557p1168k1636j65701
3887.5H57088566k25127J42038k4974l25740l0041L78132L90709J26719l20375o43491
3907.9H56556416m57228j09195O3538J84298J51753n5015r9540l278l7730o0796J10447
3930.3H56243670J39654j39356l06785j62244P7605J25110o8783j22249m769o2585
$$ y = [860013247, 859830141, 859598279, 859363914, 859305918, 859427691, 859765828, 860063016, 860343337, 860763490, 860614717, 860202789, 859989107, 859544635, 859086633, 859153628, 859779179, 860288084, 860557020, 860437334, 859748065, 859285355, 859199584, 859255850, 859464884, 859736681, 860087514, 860313535, 860029876, 859468460, 858980179, 858594179, 858367264, 858599842, 859530210, 859943092, 859078109, 858189583, 857949317, 858186960, 858348370, 858243585, 858317971, 858405352, 858062029, 857545018, 857111692, 857129514, 857347071, 857275903, 857254267, 857088566, 856863439, 857005477, 856980503, 856654763, 856624722, 857002854, 857393563, 857520282, 857199907, 856556416, 856099188, 855989993, 856053531, 856237829, 856389582, 856334567, 856235027, 856231749, 856194019, 856133223, 856243670, 856383324, 856243968, 855937183, 855774939, 855852544, 855977654, 855908871, 855786622, 855781853, 855719268]
3950.7H55719268j83284j63972o7592O318J2040j7047k3007k0504l1650o914M2498
3973.1H55266154M6134n5433j56998r8407k0326o3896r6261o7890n7042l8266m1008
3995.6H54616761j42753
3997.6H54474008
$$ y = [855719268, 855535984, 855372012, 855304420, 855310738, 855322778, 855305731, 855282724, 855262220, 855230570, 855223656, 855266154, 855312288, 855256855, 855099857, 855001450, 854981124, 854917228, 854820967, 854753077, 854696035, 854657769, 854616761, 854474008]
##END=$$ End of the data block
