##TITLE=Naftalenossulfonato de sodio $$ Begin of the data block
##JCAMP-DX=5.00 $$ ACD/SpecManager v 10.08
##SPECTROMETER/DATA SYSTEM=Alpha
##DATE=17 Dec 2014 10:47:54
##DATA TYPE=INFRARED SPECTRUM
##DATA CLASS=XYDATA
##ORIGIN=
##OWNER=
##NPOINTS=1765
##FIRSTX=399.76428223
##LASTX=3997.64306641
##MAXX=3997.64306641
##MINX=399.76428223
##MAXY=1.00000000
##MINY=0.60036749
##XFACTOR=1.0000000000
##YFACTOR=0.000000010000000
##FIRSTY=1.00000000
##DELTAX=2.03961372
##XUNITS=1/CM
##YUNITS=ARBITRARY UNITS
##XYDATA=(X++(Y..Y))
399.8A00000000l84676l74085l56519l34651l06779k70563k28852j88357j52725j21963
420.2I7280830r7704q4221q3137r0420j01280j15061j34367j58691j82367k00092k11293
442.6I5822197k18361k22671k23452k21080k18874k19554k21109k19041k12562k04999
463I3640494j97178j86217j69473j47850j24687j01971p9912n9462m3970l6770l7957
485.4I2455047m5603n9199p9281j04439j30719j54102j73044j87701j97542k01183
505.8I1122234j98132j89936j78975j66947j54870j44387j38020j38110j45292j58853
526.2H9508712j79493k09195k48426k95120l45868l97027m44680m84294n11110n21916
546.6H5871583n16879m98432m68284m26614l73298l09134k35855j54567o4862L3611
$$ plain form
399.8 100000000 99615324 99241239 98884720 98550069 98243290 97972727 97743875 97555518 97402793 97280830
420.2 97280830 97183126 97098905 97015768 96925348 96824068 96709007 96574640 96415949 96233582 96033490 95822197
442.6 95822197 95603836 95381165 95157713 94936633 94717759 94498205 94277096 94058055 93845493 93640494
463 93640494 93443316 93257099 93087626 92939776 92815089 92713118 92633206 92573744 92529774 92493004 92455047
485.4 92455047 92409444 92350245 92270964 92166525 92035806 91881704 91708660 91520959 91323417 91122234
505.8 91122234 90924102 90734166 90555191 90388244 90233374 90088987 89950967 89812857 89667565 89508712
526.2 89508712 89329219 89120024 88871598 88576478 88230610 87833583 87388903 86904609 86393499 85871583
546.6 85871583 85354704 84856272 84387988 83961374 83588076 83278942 83043087 82888520 82823658 82857269
567H2857269J39129K48450L58117M64433N62346O44750P04139P35581P37316P07888
587.4H8159418O44076N43565M09406K50363P7981r5254k56610l93695m96632n59830
607.8H8282788n81473n61709n02270m08220k90132j63054m2117O1846J43093J97738
628.2H6136490K21324K12640J78402J24777N6404k0725j00571j79678k58321l38775
648.6H6031967m21887n05316n86015o64688p46435q35681r30255j018202j081598j106489
669G8135401j080453r91762q35311o17886l49182l7593L06231O65659J018143J340347
689.4G7553594J614058J827794J973492K044911K040952J969028J842969J678556J489908
707.7I4035262J289546J092160R10068P45982N97918M65899L51817K53403J61844O7562
$$ plain form
567 82857269 82996398 83244848 83602965 84067398 84629744 85274494 85978633 86714214 87451530 88159418
587.4 88159418 88803494 89347059 89756465 90006828 90084809 89989555 89732945 89339250 88842618 88282788
607.8 88282788 87701315 87139606 86637336 86229116 85938984 85775930 85733813 85795659 85938752 86136490
628.2 86136490 86357814 86570454 86748856 86873633 86930037 86909312 86808741 86629063 86370742 86031967
648.6 86031967 85610080 85104764 84518749 83854061 83107626 82271945 81341690 80323488 79241890 78135401
669 78135401 77054948 76063186 75227875 74609989 74260807 74223214 74529445 75195104 76213247 77553594
689.4 77553594 79167652 80995446 82968938 85013849 87054801 89023829 90866798 92545354 94035262
707.7 94035262 95324808 96416968 97327036 98073018 98670936 99136835 99488652 99742055 99903899 99971461
728.1I9971461l2073j32006k24865l04997l67182m04227m10181l85148l34322k62207
748.5I7114253j70845o4784M6647J49118K32143K91991L26478L31349L03906K48229
768.9I8808485J74356R2309Q995o8700j31232j70261j84726j80257j62583j34457r9855
791.4I7952074o8402n2560o0296r2328j46168k20287l12489m15498n17595o08075o80285
813.8I4778091p27934p41661p12627o38997n26387l81887k10595j9073J79910L69346
834.2I1368186N35095O70129P71570Q36671Q63713Q55565Q19212P60490O81233N83160
854.6I8745024M72695L59112K47782J37717K6631q3643j88112k83325l68434m40830
875I8624617m93872n20772n19645m93032m43351l71444k80178j77312p2819K5922J14942
$$ plain form
728.1 99971461 99939388 99807382 99582517 99277520 98910338 98506111 98095930 97710782 97376460 97114253
748.5 97114253 96943408 96878624 96925271 97074389 97306532 97598523 97925001 98256350 98560256 98808485
768.9 98808485 98982841 99075150 99084145 99015445 98884213 98713952 98529226 98348969 98186386 98051929 97952074
791.4 97952074 97883672 97831112 97770816 97678488 97532320 97312033 96999544 96584046 96066451 95458376 94778091
813.8 94778091 94050157 93308496 92595869 91956872 91430485 91048598 90838003 90818930 90998840 91368186
834.2 91368186 91903281 92573410 93344980 94181651 95045364 95900929 96720141 97480631 98161864 98745024
854.6 98745024 99217719 99576831 99824613 99962330 99988961 99905318 99717206 99433881 99065447 98624617
875 98624617 98130745 97609973 97090328 96597296 96153945 95782501 95502323 95325011 95252192 95278114 95393056
897.4I5393056J89876K43908K71154K71529K50375K13313J63216J02883L8356k3365
917.8I7114301p8726j28126j72091k09039k37680k59858k79206k97123l12001l22592
938.2I4817859l30681l39043l48007l55298l59618l62933l68136l75277l81857l86441
958.6I1210568l89957l93385l95560l94607l91054l87848l86881l87228l87925l91000
979H7305123l99995m16339m38380m64320m94957n32526n77450o28113o83725p46006
999.4H1923312q17740r00155r92114j091009j193172j292378j378482j439595j466483
1017.8G1352184j454920j404261j314730j186490j020205q16828n76806l01218N132
1036.1F3281858L32034O65515R91142J295853J567965J796371J970214K079791K117502
$$ plain form
897.4 95393056 95582932 95826840 96097994 96369523 96619898 96833211 96996427 97099310 97137666 97114301
917.8 97114301 97035575 96907449 96735358 96526319 96288639 96028781 95749575 95452452 95140451 94817859
938.2 94817859 94487178 94148135 93800128 93444830 93085212 92722279 92354143 91978866 91597009 91210568
958.6 91210568 90820611 90427226 90031666 89637059 89246005 88858157 88471276 88084048 87696123 87305123
979 87305123 86905128 86488789 86050409 85586089 85091132 84558606 83981156 83353043 82669318 81923312
999.4 81923312 81105572 80205417 79213303 78122294 76929122 75636744 74258262 72818667 71352184
1017.8 71352184 69897264 68493003 67178273 65991783 64971578 64154750 63577944 63276726 63281858
1036.1 63281858 63613892 64279407 65270549 66566402 68134367 69930738 71900952 73980743 76098245
1054.5G6098245K078391J960510J766157J503127J185018Q29739M57203Q7237k62022
1072.8H5703605n75500q42113j054549j208430j302100j337879j323462j271975j199889
1091.2G5587708j123631j055771j002020r59826r20438q73542q10856p26884o18446
1109.6F7496294m84318l25227j44743N0151K49457M41426O13368P51835Q43620Q78352
1129.9G0370215Q51041P62749O19894M34029K20842k856k22206m25374o03157p48861
1150.3G1256316q58468r30894r68295r75752r59766r26727q81904q28958p69430p02661
1170.7F2453461o27059n42170m49490l51340k50047j48076m8530M4965J28848K00397
1191.1F0410959K58040L00974L28868L41952L41517L29989L10624K86972K62731K41519
$$ plain form
1054.5 76098245 78176636 80137146 81903303 83406430 84591448 85421187 85878390 85965627 85703605
1072.8 85703605 85128105 84285992 83231443 82023013 80720913 79383034 78059572 76787597 75587708
1091.2 75587708 74464077 73408306 72406286 71446460 70526022 69652480 68841624 68114740 67496294
1109.6 67496294 67011976 66686749 66542006 66592157 66841614 67283040 67896408 68648243 69491863 70370215
1129.9 70370215 71221256 71984005 72603899 73037928 73258770 73255914 73033708 72608334 72005177 71256316
1150.3 71256316 70397848 69466954 68498659 67522907 66563141 65636414 64754510 63925552 63156122 62453461
1170.7 62453461 61826402 61284232 60834742 60483402 60233355 60085279 60036749 60081714 60210562 60410959
1191.1 60410959 60668999 60969973 61298841 61640793 61982310 62312299 62622923 62909895 63172626 63414145
1211.5F3414145K26509K19953K23023K36112K59220K91860L32612L79205M29261M80884
1231.9F6492784N32728N83709O32834O79344P22808P63213Q00836Q36409Q71116R06389
1252.3G3822170R43387R82451J022983J063866J103949J141810J175470J202547J220697
1270.7H3679330J228023J222998J204395J171482J124531J064914R94766R16791Q34197
1289I3441427P50458O69008N92661N23395M62681M11784L71224L40313L16769K97051
1309.4I8176771K77371K54321K25252J88499J43284Q9079K5058m9770j36000k32154
1329.8I8961711l33732m34643n28002o06805o64819o96945o99621o71143o11525n23097
1350.2I3191379m11164k83039j46478r799J18303K30908L23403L93111M39667M65322
$$ plain form
1211.5 63414145 63640654 63860607 64083630 64319742 64578962 64870822 65203434 65582639 66011900 66492784
1231.9 66492784 67025512 67609221 68242055 68921399 69644207 70407420 71208256 72044665 72915781 73822170
1252.3 73822170 74765557 75748008 76770991 77834857 78938806 80080616 81256086 82458633 83679330
1270.7 83679330 84907353 86130351 87334746 88506228 89630759 90695673 91690439 92607230 93441427
1289 93441427 94191885 94860893 95453554 95976949 96439630 96851414 97222638 97562951 97879720 98176771
1309.4 98176771 98454142 98708463 98933715 99122214 99265498 99354577 99379635 99329865 99193865 98961711
1329.8 98961711 98627979 98193336 97665334 97058529 96393710 95696765 94997144 94326001 93714476 93191379
1350.2 93191379 92780215 92497176 92350698 92340899 92459202 92690110 93013513 93406624 93846291 94311613
1370.6I4311613M74167M70674M59152M43226M25232M06474L88902L74675L64107L53998
1391I8472220L38632L13288K75367K23547J58811Q6099J0997o2484j31792j95747k53463
1413.5I9235475l03036l41672l68011l83442l90166l87687l75467l55429l29852k98315
1433.9I5702398k58756k10982j55497r2340k1821N4044J31970K08062K78062L38340
1454.3I5973480L88211M27800M53186M60398M50075M25357L87567L36808K72030J94883
1474.7I9769795J07962J2654q7512j87260k80493l60584m20881m56744m64886m41891
1495I7190160l86310l01606j95205p5757M5991J61361K62005L39436L86840M03136
1515.4I7830051L89934L49474K86168K06327J19448L3182m6552j14852j67668k02936
$$ plain form
1370.6 94311613 94785780 95256454 95715606 96158832 96584064 96990538 97379440 97754115 98118222 98472220
1391 98472220 98810852 99124140 99399507 99623054 99781865 99867964 99878961 99816477 99684685 99488938 99235475
1413.5 99235475 98932439 98590767 98222756 97839314 97449148 97061461 96685994 96330565 96000713 95702398
1433.9 95702398 95443642 95232660 95077163 94984823 94963002 95017046 95149016 95357078 95635140 95973480
1454.3 95973480 96361691 96789491 97242677 97703075 98153150 98578507 98966074 99302882 99574912 99769795
1474.7 99769795 99877757 99890411 99802899 99615639 99335146 98974562 98553681 98096937 97632051 97190160
1495 97190160 96803850 96502244 96307039 96231282 96277273 96438634 96700639 97040075 97426915 97830051
1515.4 97830051 98219985 98569459 98855627 99061954 99181402 99214584 99168032 99053180 98885512 98682576
1535.8I8682576k23422k34222k39170k43157k51031k62266k77263k97350l22729l52609
1556.2I5979357l85648m23986m70424n26917n93322o69021p50708q31705r03482r59712
1576.6H9464432r96268j008361r91798r46086q73739p78157o64174n38689m10157k86353
1597H1970650j74499q3047j5753K7632M9758N5820N0640L9113K8008K0891J8156K4200
1621.5H2011569M3225P6067J19883J70469K23905K75016L20053L59452L94577M26089
1641.9H4420305M55213M83000N09924N32967N49525N62656N74505N83548N87648N89645
1662.3H9848936N91111N89615N83851N75882N66513N54877N41777N28121N12302M92531
1682.7I5385516M70030M46296M21315L93737L64929L36957L07602K75969K43694K12270
$$ plain form
1535.8 98682576 98459154 98224932 97985762 97742605 97491574 97229308 96952045 96654695 96331966 95979357
1556.2 95979357 95593709 95169723 94699299 94172382 93579060 92910039 92159331 91327626 90424144 89464432
1576.6 89464432 88468164 87459803 86468005 85521919 84648180 83870023 83205849 82667160 82257003 81970650
1597 81970650 81796151 81713104 81697351 81724983 81774741 81830561 81881201 81920314 81948322 81969213 81987369 82011569
1621.5 82011569 82054794 82130861 82250744 82421213 82645118 82920134 83240187 83599639 83994216 84420305
1641.9 84420305 84875518 85358518 85868442 86401409 86950934 87513590 88088095 88671643 89259291 89848936
1662.3 89848936 90440047 91029662 91613513 92189395 92755908 93310785 93852562 94380683 94892985 95385516
1682.7 95385516 95855546 96301842 96723157 97116894 97481823 97818780 98126382 98402351 98646045 98858315
1703.1I8858315J81788J51926J24741J02037Q2499O5213N1081M0365L2413K6756K3675
1725.5I9740809K1959K0825J9920J7774J3096O246j025p230j3548k1267k9528l6949
1750I9731082m3541n0247n6929o1923o4343o4963o5309o6006o5982o3819n9611n4663
1774.5I9013746m9693m3702l5810k7240j9639j3054o526N3N341Q154R173J0037J1224
1801I8862064J1569J0294Q196O532N484M154K098K27p39j693l964p540j1343j4728
1829.6I8870611j8281k2882k8002l2115l5012l7813m1062m3988m5842m6825m7827m9221
1854I8421741n0295n0402n0109n0533n1773n2744n2535n1683n1451n1922n1892n1015
1878.5I7805387n0253n0366n0807n0717n0146m9865n0294n0790n0419m9269m8232m7529
$$ plain form
1703.1 98858315 99040103 99192029 99316770 99418807 99501306 99566519 99617600 99657965 99690378 99717134 99740809
1725.5 99740809 99762768 99783593 99803513 99821287 99834383 99840629 99839604 99832374 99818826 99797559 99768031 99731082
1750 99731082 99687541 99637294 99580365 99518442 99454099 99389136 99323827 99257821 99191839 99128020 99068409 99013746
1774.5 99013746 98964053 98920351 98884541 98857301 98837662 98824608 98818082 98818135 98823476 98831630 98840803 98850840 98862064
1801 98862064 98873633 98883927 98892123 98898655 98904139 98908293 98910391 98910618 98909879 98908186 98904222 98896682 98885339 98870611
1829.6 98870611 98852330 98829448 98801446 98769331 98734319 98696506 98655444 98611456 98565614 98518789 98470962 98421741
1854 98421741 98371446 98321044 98270935 98220402 98168629 98115885 98063350 98011667 97960216 97908294 97856402 97805387
1878.5 97805387 97755134 97704768 97653961 97603244 97553098 97503233 97452939 97402149 97351730 97302461 97254229 97206700
1903I7206700m6396m4078m0746l7253l3956l0327k5976k1523j7888j5139j2511r692
1927.5I6871215p224n782n149m530l827l737m530n561o187o539p206q416r799j0920
1956I6781808j1968j3525j5688j7881j9646k1267k3341k5827k7996k9391l0428l1597
1980.5I6513253l2651l3003l2634l2049l1537l0982l0327k9856l0071l1185l2830l4410
2005I6131718l5810l7372l9232m0859m1682m1681m1241m0435l8910l6717l4392l2389
2029.4I5670998l0702k9308k8312k7967k8473k9659l0994l2199l3521l5167l6818l7873
2053.9I5290005l8117l7807l7170l6049l4332l2329l0357k8390k6113k3305k0146j7113
2078.4I4928777j4382j1719q958o420m524l326k414j609j180j401k104k843l421m089
$$ plain form
1903 97206700 97160304 97116226 97075480 97038227 97004271 96973944 96947968 96926445 96908557 96893418 96880907 96871215
1927.5 96871215 96863991 96858209 96853060 96848530 96844703 96840966 96836436 96830875 96824688 96818149 96810943 96802527 96792728 96781808
1956 96781808 96769840 96756315 96740627 96722746 96703100 96681833 96658492 96632665 96604669 96575278 96544850 96513253
1980.5 96513253 96480602 96447599 96414965 96382916 96351379 96320397 96290070 96260214 96230143 96198958 96166128 96131718
2005 96131718 96095908 96058536 96019304 95978445 95936763 95895082 95853841 95813406 95774496 95737779 95703387 95670998
2029.4 95670998 95640296 95610988 95582676 95554709 95526236 95496577 95465583 95433384 95399863 95364696 95327878 95290005
2053.9 95290005 95251888 95214081 95176911 95140862 95106530 95074201 95043844 95015454 94989341 94966036 94945890 94928777
2078.4 94928777 94914395 94902676 94893718 94887298 94882774 94879448 94877034 94875425 94874245 94872844 94870740 94867897 94864476 94860387
2106.9I4860387n043o085o807p135p397p826q190q159p779p433p331p188o694n996
2135.5I4761324n531n407n292m971m638m589m816n037n078n168n585o235o771p104
2164.1I4685102p475q207r221j0163j0955j1868j3130j4550j5795j6880j8025j9347
2188.5I4529486k0564k1422k1922k2310k2644k2704k2310k1547k0665j9759j8668j7214
2213I4277757j5497j3792j2166j0472q595o694n001l480j938l33J114K259L207M166
2241.6I4210535N210O181O926P540Q273R155R990J0633J1188J1844J2534J2953J2952
2268.1I4335914J2725J2440J2034J1295J0198Q971P784O658N418M065K813J771P45
2294.6I4432831n96k241l887n400p009q881j0831j2761j4877j7262j9580k1356k2251
$$ plain form
2106.9 94860387 94855344 94849259 94842452 94835317 94827920 94820094 94811904 94803745 94795966 94788533 94781202 94774014 94767320 94761324
2135.5 94761324 94755793 94750386 94745094 94740123 94735485 94730896 94726080 94721043 94715965 94710797 94705212 94698977 94692206 94685102
2164.1 94685102 94677627 94669420 94660199 94650036 94639081 94627213 94614083 94599533 94583738 94566858 94548833 94529486
2188.5 94529486 94508922 94487500 94465578 94443268 94420624 94397920 94375610 94354063 94333398 94313639 94294971 94277757
2213 94277757 94262260 94248468 94236302 94225830 94217235 94210541 94205540 94202060 94200122 94199789 94200903 94203162 94206369 94210535
2241.6 94210535 94215745 94221926 94228852 94236392 94244665 94253820 94263810 94274443 94285631 94297475 94310009 94322962 94335914
2268.1 94335914 94348639 94361079 94373113 94384408 94394606 94403577 94411361 94418019 94423437 94427502 94430315 94432086 94432831
2294.6 94432831 94432235 94429994 94426107 94420707 94413698 94404817 94393986 94381225 94366348 94349086 94329506 94308150 94285899
2321.1I4285899k2143k1320k0129j8704j6969j5080j3495j2457j1760j1235j1230j1939
2345.6I4099438j2880j3459Tj2797j1146q273m256O32N901J0925J5384J9193K2215
2372.1I4097418K3990K4158K2763K0045J6111J1063N549M17l886p373j0186j2332j3733
2398.6I4174004j4341j4305j3918j3322j2439j1289j0109r150q362p570o694n906n323
2425.1I4041276m882m422l976l725l767l970m196m488n043n925o967p987r007j0174
2453.7I3962747j1426j2488j3166j3477j3542j3328j2630j1390r746p933o050m101
2478.1I3833470k199n72N48J198J490J431Q88j49j502k897m250n615o943q071q857
2508.7I3797970r370r775j0085j0217j0162j0061j0032j0103j0115j0055Tj0211j0442
$$ plain form
2321.1 94285899 94263756 94242436 94222307 94203603 94186634 94171554 94158059 94145602 94133842 94122607 94111377 94099438
2345.6 94099438 94086558 94073099 94059640 94046843 94035697 94027424 94023168 94023800 94029701 94040626 94056010 94075203 94097418
2372.1 94097418 94121408 94145566 94168329 94188374 94204485 94215548 94221097 94221514 94217628 94210255 94200069 94187737 94174004
2398.6 94174004 94159663 94145358 94131440 94118118 94105679 94094390 94084281 94075131 94066769 94059199 94052505 94046599 94041276
2425.1 94041276 94036394 94031972 94027996 94024271 94020504 94016534 94012338 94007850 94002807 93996882 93989915 93981928 93972921 93962747
2453.7 93962747 93951321 93938833 93925667 93912190 93898648 93885320 93872690 93861300 93851554 93843621 93837571 93833470
2478.1 93833470 93831271 93830699 93831247 93832445 93833935 93835366 93836254 93836105 93834603 93831706 93827456 93821841 93814898 93806827 93797970
2508.7 93797970 93788600 93778825 93768740 93758523 93748361 93738300 93728268 93718165 93708050 93697995 93687940 93677729 93667287
2535.3I3667287j0598j0663j0789j1050j1313j1474j1593j1820j2136j2379j2547j2732
2559.7I3528193j3053j3435j3715j3828j3888j4019j4162j4150j4002j3870j3822j3733
2584.2I3362516j3494j3209j3077j3131j3149j3077j3000j3047j3155j3214j3155j3059
2608.7I3204749j3042j3071j2982j2767j2583j2535Tj2487j2433j2559j2857j3125
2633.2I3051773j3238j3363j3626j3965j4234j4341j4299j4144j3864j3387j2750j2117
2657.6I2888445j1617j1254j0961j0800j0944j1527j2428j3482j4758j6279j7869j9342
2682.1I2727184k0617k1708k2620k3287k3658k3710k3479k3049k2453k1738k0980k0284
2706.6I2459601j9717j9252j8812j8465j8185j7834j7291j6529j5592j4472j3167j1730
$$ plain form
2535.3 93667287 93656689 93646026 93635237 93624187 93612874 93601400 93589807 93577987 93565851 93553472 93540925 93528193
2559.7 93528193 93515140 93501705 93487990 93474162 93460274 93446255 93432093 93417943 93403941 93390071 93376249 93362516
2584.2 93362516 93349022 93335813 93322736 93309605 93296456 93283379 93270379 93257332 93244177 93230963 93217808 93204749
2608.7 93204749 93191707 93178636 93165654 93152887 93140304 93127769 93115234 93102747 93090314 93077755 93064898 93051773
2633.2 93051773 93038535 93025172 93011546 92997581 92983347 92969006 92954707 92940563 92926699 92913312 92900562 92888445
2657.6 92888445 92876828 92865574 92854613 92843813 92832869 92821342 92808914 92795432 92780674 92764395 92746526 92727184
2682.1 92727184 92706567 92684859 92662239 92638952 92615294 92591584 92568105 92545056 92522603 92500865 92479885 92459601
2706.6 92459601 92439884 92420632 92401820 92383355 92365170 92347336 92330045 92313516 92297924 92283452 92270285 92258555
2731.1I2258555j0234q738p332o163n352m906m840n138n698o497p689r328j1218j3125
2759.6I2152297j5020j6987j8972k0886k2751k4706k6763k8872l0965l3009l4946l6746
2784.1I1841674l8463m0013m1192m2016m2647m3070m3106m2743m2277m1962m1676m1216
2808.6I1341293m0662m0245m0126m0305m0871m1991m3822m6450m9764n3358n6803n9748
2833I0787148o1941o3067o2728o0630n6821n1362m4173l5488k5946j6367p374M95O729
2859.5I0308475J0956J2922J2535R745M638k432j0944k0563l0965m1455n1343o0082
2884I0141487o7216p2295p5173p6026p5167p2694o8521o2746n5731m7910l9881l2354
2908.5H9395773k5671j9682j4168r203m780n90L505P307J0586J3345J5611J7166J7810
$$ plain form
2731.1 92258555 92248321 92239583 92232251 92226088 92220736 92215830 92210990 92205852 92200154 92193657 92185968 92176640 92165422 92152297
2759.6 92152297 92137277 92120290 92101318 92080432 92057681 92032975 92006212 91977340 91946375 91913366 91878420 91841674
2784.1 91841674 91803211 91763198 91722006 91679990 91637343 91594273 91551167 91508424 91466147 91424185 91382509 91341293
2808.6 91341293 91300631 91260386 91220260 91179955 91139084 91097093 91053271 91006821 90957057 90903699 90846896 90787148
2833 90787148 90725207 90662140 90599412 90538782 90481961 90430599 90386426 90350938 90324992 90308625 90301251 90301746 90308475
2859.5 90308475 90319431 90332353 90344888 90354633 90359271 90356839 90345895 90325332 90294367 90252912 90201569 90141487
2884 90141487 90074271 90001976 89926803 89850777 89775610 89702916 89634395 89571649 89515918 89468008 89428127 89395773
2908.5 89395773 89370102 89350420 89336252 89327049 89322269 89321679 89325184 89332491 89343077 89356422 89372033 89389199 89407009
2935H9407009J7649J6683J4717J1724P921L642o14m154o342p016o467m917k605j2K325
2965.6H9449543M053M816M005Q71n126j4133k5761l9249n3698o8134q1617r3281j02240
2992.1H8980049j07819j09768j07849j01941r2215p9310o4295m8471l3009j8924p290
3014.5H8209158Q76M918M446p69j0484k4039m0686n9330p8428r6279j11455j22911
3039H7675017j30045j32585j30564j24162j13595r9176q1700o2245m1837k1475k313
3061.5H6735320J4848K9689M2116N1976N8901O2734O3872O2698N9295N3680M6176L7455
3085.9H7318760K8318J9402J1050L302l683r608j4496j8716k2644k6190k9183l2276
3110.4H7224036l6412m1741m7767n4014o0231o6161p1466p5864p9233q1742q3869q5944
$$ plain form
2935 89407009 89424658 89441341 89456058 89467782 89475703 89479345 89478731 89474577 89468235 89461219 89454752 89449835 89447230 89447218 89449543
2965.6 89449543 89453596 89458412 89462417 89463288 89458162 89444029 89418268 89379019 89325321 89257187 89175570 89082289 88980049
2992.1 88980049 88872230 88762462 88654613 88552672 88460457 88381147 88316852 88268381 88235372 88216448 88209158
3014.5 88209158 88210034 88214952 88219398 88218629 88208145 88184106 88143420 88084090 88005662 87909383 87797928 87675017
3039 87675017 87544972 87412387 87281823 87157661 87044066 86944890 86863190 86800945 86759108 86737633 86735320
3061.5 86735320 86750168 86779857 86821973 86873949 86932850 86995584 87059456 87122154 87181449 87235129 87281305 87318760
3085.9 87318760 87347078 87366480 87377530 87380832 87377149 87367541 87353045 87334329 87311685 87285495 87256312 87224036
3110.4 87224036 87187624 87145883 87098116 87044102 86983871 86917710 86846244 86770380 86691147 86609405 86525536 86439592
3134.9H6439592q7887q9568r1148r3066r5475r8187j01197j04665j08385j11825j14739
3157.3H5343450j17111j18923j20294j21331j22071j22708j23501j24472j25480j26367
3177.7H4121192j27185j28108j29181j30266j31250j32054j32513j32376j31690j30838
3198.1H2815731j30052j29235j28150j26659j24950j23411j22243j21236j20235j19358
3218.5H1570202j18738j18250j17665j16969j16324j15836j15281j14572j13857j13285
3238.9H0409425j12670j11753j10334j08492j06544j04791j03163j01483r9993r9003
3259.3G9351199r8491r8133r7865r8008r8884j00338j01966j03516j04951j06287j07456
3281.7G8235304j08403j09315j10691j12957j16032j19472j23137j27232j31995j37591
$$ plain form
3134.9 86439592 86351705 86262137 86170989 86077923 85982448 85884261 85783064 85678399 85570014 85458189 85343450
3157.3 85343450 85226339 85107416 84987122 84865791 84743720 84621012 84497511 84373039 84247559 84121192
3177.7 84121192 83994007 83865899 83736718 83606452 83475202 83343148 83210635 83078259 82946569 82815731
3198.1 82815731 82685679 82556444 82428294 82301635 82176685 82053274 81931031 81809795 81689560 81570202
3218.5 81570202 81451464 81333214 81215549 81098580 80982256 80866420 80751139 80636567 80522710 80409425
3238.9 80409425 80296755 80185002 80074668 79966176 79859632 79754841 79651678 79550195 79450202 79351199
3259.3 79351199 79252708 79154575 79056710 78958702 78859818 78759480 78657514 78553998 78449047 78342760 78235304
3281.7 78235304 78126901 78017586 77906895 77793938 77677906 77558434 77435297 77308065 77176070 77038479
3302.1G7038479j43820j50365j57028j63466j69200j74039j78212j81937j85210j88076
3322.5G5347126j90694j93339j96248j99539k03294k07573k12204k16985k21985k27058
3342.9G3278207k31827k36153k39873k42639k44433k45970k47771k49242k49589k48968
3363.3G0841742k47944k46334k43336k38746k32935k25973k17629k07919j97124j85764
3383.7F8598038j74683j64509j54990j45751j37425j31070j26666j23066j19460j15883
3404.1F7204535j12051j06948r9945r1446q1986p1824o1035m9555l7670k6304j6111
3426.5F6449660o795K098J0276J7428K4194L1656M0323M9895N9819P0035Q0735R1684
3451F6921008J02526J12950J22601J31262J38694J44332J47963J50180J51896J53500
$$ plain form
3302.1 77038479 76894659 76744294 76587266 76423800 76254600 76080561 75902349 75720412 75535202 75347126
3322.5 75347126 75156432 74963093 74766845 74567306 74364012 74156439 73944235 73727250 73505265 73278207
3342.9 73278207 73046380 72810227 72570354 72327715 72083282 71837312 71589541 71340299 71090710 70841742
3363.3 70841742 70593798 70347464 70104128 69865382 69632447 69406474 69188845 68980926 68783802 68598038
3383.7 68598038 68423355 68258846 68103856 67958105 67820680 67689610 67562944 67439878 67320418 67204535
3404.1 67204535 67092484 66985536 66885591 66794145 66712159 66640335 66579300 66529745 66492075 66465771 66449660
3426.5 66449660 66442865 66444963 66455239 66472667 66496861 66528517 66568840 66618735 66678554 66748589 66829324 66921008
3451 66921008 67023534 67136484 67259085 67390347 67529041 67673373 67821336 67971516 68123412 68276912
3471.4F8276912J55079J57059J59794J63227J67000J70821J74803J79136J83498J87469
3491.8F9974798J90973J94144J97143J99783K01851K03699K05892K08473K11209K14058
3512.2G2002023K17146K20472K23917K27528K31386K35402K39265K42841K46257K49064
3532.6G4335301K50798K52110K53469K54637K55620K56843K58213K59382K60430K61754
3553G6898557K63560K65866K68561K71726K75260K78467K81167K84153K87503K90126
3573.4G9664946K91723K92843K93219K92754K91622K89333K86150K83116K80982K78932
3593.8H2545620K75958K72804K70236K68483K67512K67058K67822K70873K76131K81804
3614.2H5264301K86180K90221K96199L04830L15249L26324L38817L54409L72690L91394
$$ plain form
3471.4 68276912 68431991 68589050 68748844 68912071 69079071 69249892 69424695 69603831 69787329 69974798
3491.8 69974798 70165771 70359915 70557058 70756841 70958692 71162391 71368283 71576756 71787965 72002023
3512.2 72002023 72219169 72439641 72663558 72891086 73122472 73357874 73597139 73839980 74086237 74335301
3532.6 74335301 74586099 74838209 75091678 75346315 75601935 75858778 76116991 76376373 76636803 76898557
3553 76898557 77162117 77427983 77696544 77968270 78243530 78521997 78803164 79087317 79374820 79664946
3573.4 79664946 79956669 80249512 80542731 80835485 81127107 81416440 81702590 81985706 82266688 82545620
3593.8 82545620 82821578 83094382 83364618 83633101 83900613 84167671 84435493 84706366 84982497 85264301
3614.2 85264301 85550481 85840702 86136901 86441731 86756980 87083304 87422121 87776530 88149220 88540614
3634.6H8540614M09317M27818M46826M65262M82333M96369N07558N17624N25374N27322
3655I3346417N23639N17410N09631M98820M83900M64064M40192M14449L86268L55041
3675.4I7939831L22068K88957K56086K23684J91903J60837J32942J09685Q9353P1079
3695.8I9786425N6028M4054L4112K5773J8584J2148O807K986K44j377j830j490n06
3722.3I9981958N84J192J651K265K307J406k68k491n114q119j1336j4276j6761j8829
3750.8I9914169j9926j9884j9359j8484j6915j5051j3375j2213j1670j1528j1563j1373
3775.3I9732828j0574q923p087n996n376m780m125l099j830o92K15O14L69m29j484
3805.9I9679631k342k575k200j973j955j621j252j079q94m82L5L94L10l40j419k616
$$ plain form
3634.6 88540614 88949931 89377749 89824575 90289837 90772170 91268539 91776097 92293721 92819095 93346417
3655 93346417 93870056 94387466 94897097 95395917 95879817 96343881 96784073 97198522 97584790 97939831
3675.4 97939831 98261899 98550856 98806942 99030626 99222529 99383366 99516308 99625993 99715346 99786425
3695.8 99786425 99842453 99886507 99920619 99946392 99964976 99977124 99983931 99986917 99987161 99985784 99983954 99982464 99981958
3722.3 99981958 99982542 99983734 99985385 99987650 99989957 99991363 99991095 99988604 99983490 99975371 99964035 99949759 99932998 99914169
3750.8 99914169 99894243 99874359 99855000 99836516 99819601 99804550 99791175 99778962 99767292 99755764 99744201 99732828
3775.3 99732828 99722254 99713331 99706244 99700248 99694872 99690092 99685967 99682868 99681038 99680346 99680561 99681175 99681544 99681115 99679631
3805.9 99679631 99677289 99674714 99672514 99670541 99668586 99666965 99665713 99664634 99663740 99663258 99663293 99663687 99663997 99663657 99662238 99659622
3838.5I9659622l892m924n328n305m810m274m381m607m286l648l111k271j115k26l6
3869.1I9607408n13j174j532j484j150p03m00k02m8r6m94q29n66l28o02r53r90o62
3905.8I9594682j84M17J305K367L480M554N454O169O765P397P957Q083P933P838P594
3936.4I9671811O986O282N901N912O086O229O348O497O711P165P933Q845R764J0710
3965I9773180J1677J2505J3173J3804J4508J5104J5360J5282J5086J4884J4651J4394
3989.5I9943608J4222J4096J4037T
3997.6A00000000
$$ plain form
3838.5 99659622 99655730 99650806 99645478 99640173 99635363 99631089 99626708 99622101 99617815 99614167 99611056 99608785 99607670 99607444 99607408
3869.1 99607408 99606895 99605721 99604189 99602705 99601555 99600852 99600452 99600250 99600202 99600106 99599612 99598783 99598217 99597889 99597287 99596334 99595344 99594682
3905.8 99594682 99594498 99594915 99596220 99598587 99602067 99606621 99612075 99618244 99625009 99632406 99640363 99648446 99656379 99664217 99671811
3936.4 99671811 99678797 99685079 99690980 99696892 99702978 99709207 99715555 99722052 99728763 99735928 99743861 99752706 99762470 99773180
3965 99773180 99784857 99797362 99810535 99824339 99838847 99853951 99869311 99884593 99899679 99914563 99929214 99943608
3989.5 99943608 99957830 99971926 99985963 100000000
3997.6 100000000
##END=$$ End of the data block
