##TITLE=Naftaalenossulfonato de sodio $$ Begin of the data block
##JCAMP-DX=5.00 $$ ACD/SpecManager v 10.08
##SPECTROMETER/DATA SYSTEM=Alpha
##DATE=28 Jan 2015 08:33:22
##DATA TYPE=INFRARED SPECTRUM
##DATA CLASS=XYDATA
##ORIGIN=
##OWNER=
##NPOINTS=1765
##FIRSTX=399.76428223
##LASTX=3997.64306641
##MAXX=3997.64306641
##MINX=399.76428223
##MAXY=0.80271578
##MINY=0.40444669
##XFACTOR=1.0000000000
##YFACTOR=1.000000000000000e-9
##FIRSTY=0.53627139
##DELTAX=2.03961372
##XUNITS=1/CM
##YUNITS=ARBITRARY UNITS
##XYDATA=(X++(Y..Y))
399.8 536271393 537029564 533908904 529248416 527550519 528622866 528086722 524584591 521600962 522763491
418.1 522763491 526554406 527610838 526329041 526530862 529360712 531693041 530631423 527753592 526680708
436.5 526680708 527785242 527737617 524381280 520302832 519322515 520798504 521201789 519467413 518241465
454.8 518241465 519758821 521892309 520656645 516621828 513698757 513866246 515020013 514116049 511811733
473.2 511811733 511696041 514585972 517498672 517820597 516977966 517995775 520364285 520869732 518515646
491.5 518515646 516020477 516139448 517889380 518136859 516054809 514258802 514842868 516218662 515621722
509.9 515621722 513270557 511933267 512933433 514237881 513312697 511088192 510571718 512570858 514470577
528.3 514470577 513823152 511591852 510431111 510697663 509950817 506723046 502650738 500054657 498855919
546.6 498855919 496823847 492959887 489211917 487687737 487785995 487340569 485898823 485420823 487400323
565 487400323 490575343 492604107 493191451 494105250 496536434 499737978 502696812 506476700 513302684
583.3 513302684 523372233 533770025 541359484 545977890 549456716 552294791 552923322 550337315
599.6 550337315 546092749 542774439 540959299 539086759 536030352 532678664 530278563 528286517
616 528286517 525261343 521448612 519429564 521824896 527923226 533980668 537658691 539514661 540758491
634.3 540758491 541446209 540832400 538814664 536404490 534349620 531845510 527851105 523248434 520313859
652.7 520313859 519696236 519244432 516222537 510397732 504068315 498895168 492877156 484225631 476278871
671 476278871 468920738 461797923 456382960 453244001 452550471 454266101 457771450 462585896 469798028
689.4 469798028 481576383 498749554 518973649 538216472 554042757 566891074 578692734
703.7 578692734 590541184 601736546 611462712 620393276 629568279 638383269 645229340 649670601
720 649670601 653088033 656771123 660568953 663506627 665406466 667394042 670180023 672803283 673540950
738.3 673540950 671689153 667960286 663412452 658392251 653083384 648640871 647067845 649444163
754.7 649444163 654978573 661968350 669078052 675769687 681358039 684652627 685259700 684629500 684768379
773 684768379 686222911 687794685 687999547 686616719 684676707 683047354 681524575 679689229 678029537
791.4 678029537 677641988 678815365 680765867 682781458 684931397 687233329 688553035 687167704 682351589
809.7 682351589 675220072 667953789 661838830 655750513 647816837 638234138 629182458 622782826
826 622782826 619810164 620014966 623110056 628912807 636577010 644675195 652439177 660332799 669110715
844.4 669110715 678756833 688477933 697530806 705864310 713617802 720251977 724572897 725960970
860.7 725960970 725456655 725038767 725754857 726924777 727249324 726210475 723894000 719999194 714014232
879.1 714014232 706225455 697943866 690642059 685006857 680866718 678173840 677656293 680029869 684884131
897.4 684884131 690750897 696281433 701093853 705415308 709066451 711271763 711761236 711402476 711209297
915.8 711209297 711148918 710432470 708810747 707042396 705846071 704869270 703199387 700571537 697662771
934.1 697662771 695137560 692541420 688773215 683830142 679306805 676587880 675017178 672715068
950.5 672715068 669029891 665061116 661767244 658750236 655079544 650595069 645931423 641365290
966.8 641365290 636611402 632003486 628498137 626121402 623749197 620570540 616743922 612807333
983.1 612807333 609068155 605260611 600613415 594590068 587595344 580616355 574028790 567201376
999.4 567201376 559466422 551045656 542642772 534326136 525307834 514875233 503168464 490750760
1015.7 490750760 477882266 464758962 452113092 440655321 430229276 420625657 412752777 408279330
1032 408279330 408574671 414019972 423448890 434360206 444675446 454358518 464627236 476156682
1048.4 476156682 489117444 504536211 524493277 550269783 579869211 607692301 627975821
1062.6 627975821 638800561 642080665 640404999 635361493 628390610 621171296 614491999 607594848
1079 607594848 599065065 588266850 575827897 562687516 549303949 536264896 524986207 516852796
1095.3 516852796 511567473 507010341 501131833 493857592 486669630 480502397 474726230 468250364
1111.6 468250364 461092949 454566181 450185478 448817700 450889617 456975490 467614532 482436657
1127.9 482436657 499404192 514559448 524228036 528030515 527845025 524776697 518964887 511170864
1144.2 511170864 502841234 494800538 486785144 478441179 470085621 462242424 454967111 447893560
1160.5 447893560 440906197 434465557 429066122 424549222 420225471 415703893 411441267 408233106
1176.9 408233106 406289637 405163467 404479623 404446691 405489892 407547891 409989238 412315696 414679915
1195.2 414679915 417527199 420850456 424012631 426512361 428575605 430701464 432867765 434532940
1211.5 434532940 435447395 436153561 437422454 439378560 441536844 443674535 446321428 450104564 454889685
1229.9 454889685 459902614 464708388 469737291 475567669 481993228 488207340 493965775 500049829
1246.2 500049829 507279575 515433311 523551583 531158805 538854182 547514081 557163179 567034721
1262.5 567034721 576728582 586757958 597653806 609198153 620791137 632452786 644985020
1276.8 644985020 658673584 672282815 684050262 693637848 702293634 710948646 718971908 725302517
1293.1 725302517 730181217 734994590 740435302 745609283 749404967 752170682 755307257 759322643
1309.4 759322643 763155639 765702248 767358303 769449472 772348225 774834394 775733829 775385380 774799645
1327.8 774799645 773841798 770919144 764876187 756656289 748302519 740889549 733836889 726082027
1344.1 726082027 717804849 709961057 702507436 694900393 687907875 683971882 684954822 690385997
1360.4 690385997 698238194 705998361 712499022 718283951 723263860 726635814 728735745 731066346
1376.7 731066346 734609246 738832831 742754519 746781051 752393961 759460807 765816748 770270824
1393.1 770270824 773245573 776062369 779680848 783209682 784909308 784769535 784239650 784021258 783305585
1411.4 783305585 780907691 776595175 770807862 764310181 758162022 752140760 747156382 744950533
1427.7 744950533 745086551 745329320 743252397 738047421 732193768 728519022 726268470 724972665 725369930
1446.1 725369930 728251517 732841253 736839414 739136040 741474152 747415304 755443335 762726545
1462.4 762726545 769085467 774611115 779062390 782404244 784724414 785826445 786151350 786531627 786913931
1480.8 786913931 786366820 784160435 780614376 776881218 773501158 769117475 761525393 750710070
1497.1 750710070 740735710 733696103 728990734 727303207 732974946 744555950 755935669 764797628
1513.4 764797628 770119309 773134172 775173604 776576579 776836336 775550842 773751855 772557557
1529.7 772557557 771020532 768287897 765181959 761599362 757347405 754550040 752490938 749656260
1546 749656260 746518373 743496358 740343094 736089826 730473757 723264694 717374682 714038610 709087014
1564.4 709087014 701883912 693593562 685226083 677878916 669097006 657389283 647348821 639282823
1580.7 639282823 630436242 620341659 609590709 599264085 590598583 584754169 582774997 585116267
1597 585116267 590620637 596765101 600905359 601790786 600105286 597617447 595687151 594242513 592502654
1615.4 592502654 590911329 590637803 591060340 591639996 592123926 592387021 593118131 594554484 596090257
1633.7 596090257 597922266 600628078 603825033 607188582 610219121 613050997 616512954 619942665
1650.1 619942665 624000013 630738914 637025356 641917169 646994770 653280437 660154521 665853322
1666.4 665853322 671279490 678269744 685720026 692988276 700227201 706622720 712335944 718459964
1682.7 718459964 726589739 734479666 740861952 747281075 753206313 758320332 762690306 766797245
1699 766797245 772338569 777702689 781483710 784487784 787075639 789485395 791509092 792643726 793351650
1717.4 793351650 794898510 797050238 798912823 800027430 800151825 799856305 799714029 800052404 801019132
1735.7 801019132 801499307 801421523 801861107 802656770 802715778 801826000 801036477 801482439 802214205 801894307
1756.1 801894307 800705314 799555898 799100578 799174905 798544526 796817601 794987202 794180036 794485867
1774.5 794485867 794496357 793663502 792866409 792838752 793132901 793090045 792518556 791826129 792113006 793229282
1794.9 793229282 793766916 793516159 793509901 794326484 795227110 795387745 794966519 794872105 795506299 796169043
1815.3 796169043 796177566 795754611 795461893 795442641 795489788 795169950 794457436 794282377 794748068 794901431
1835.7 794901431 794374883 793479562 792522669 791833818 791745663 791611433 791011333 790468514 790259600 789974988
1856.1 789974988 789200068 788146019 787342548 786858976 786132038 784951389 784046054 783782542 783691645
1874.4 783691645 783357024 782597244 781616151 780900359 780568719 780160725 779263854 778280258 777716279 777432859
1894.8 777432859 777076602 776362360 775426090 774727106 774350703 773885369 773095548 772300363 771874130 771669686
1915.2 771669686 771318614 770822704 770387888 770245075 770510018 770748913 770578146 770231664 770134628 770344675
1935.6 770344675 770485044 770175874 769590616 769377828 769639552 769832790 769649208 769276500 769106209 769221604
1956 769221604 769253612 768902898 768381655 768069506 768012226 767936289 767559707 766963780 766527057 766355753
1976.4 766355753 766106367 765485168 764683425 764124393 763880849 763601601 763002217 762328267 762023866 762009501
1996.8 762009501 761831403 761264801 760541677 760063350 759878397 759614885 759002686 758249998 757743120 757526278
2017.2 757526278 757201731 756411970 755299807 754495919 754475594 754677474 754324615 753649771 753233910 753077030
2037.6 753077030 752728343 752001584 751225770 750776470 750596344 750266314 749555707 748737156 748247862 748080373
2058 748080373 747764885 747052014 746272802 745885313 745848596 745664120 745085299 744461298 744234085 744331539
2078.4 744331539 744264305 743812084 743346989 743295312 743534088 743568659 743218780 742869675 742917895 743206859
2098.8 743206859 743226230 742818952 742403090 742389560 742612720 742565393 742128551 741735637 741762042 741993368
2119.2 741993368 741920769 741445124 741006553 740989923 741206348 741146803 740715146 740377247 740463972 740705967
2139.6 740705967 740607440 740136385 739790738 739897192 740156174 740066648 739620805 739303172 739415467 739648521
2160 739648521 739511788 739023685 738670170 738722384 738892257 738731742 738254011 737941086 738036633 738150656
2180.4 738150656 737820387 737161636 736706555 736708462 736770868 736402094 735725403 735279143 735261917 735277414
2200.8 735277414 734894753 734247327 733844638 733873129 733952045 733657479 733132124 732887566 733040571 733148396
2221.2 733148396 732852697 732392073 732267857 732541323 732754648 732562363 732210219 732193351 732549250 732793391
2241.6 732793391 732600391 732266009 732307255 732743979 733078480 732990801 732775986 732931793 733426630 733751655
2262 733751655 733661532 733483076 733664572 734154105 734469771 734380305 734210551 734402299 734896660 735162675
2282.3 735162675 734933794 734597802 734628975 734938443 735035658 734718561 734359860 734376729 734629750 734614015
2302.7 734614015 734138846 733575523 733355463 733386934 733209372 732639492 731970489 731520772 731226623 730778694
2323.1 730778694 730088174 729434311 729114950 729041755 728787065 728175044 727589905 727400780 727423191 727353334
2343.5 727353334 727516711 728196204 728731394 728433371 727302969 725905240 724905968 724688470 724916518
2361.9 724916518 724986613 724955678 725308120 726135314 727013826 727554262 727876902 728419721 729283929 730025709
2382.3 730025709 730211616 729953885 729768217 729885697 729953945 729624748 729089856 728817523 728901744 728929639
2402.7 728929639 728585243 728071749 727824092 727932990 727992892 727689564 727251530 727098525 727264404 727337122
2423.1 727337122 727015316 726554453 726422966 726630867 726734281 726468086 726093709 726022780 726237595 726293743
2443.5 726293743 725926936 725433528 725265086 725403190 725376844 724950552 724483907 724383354 724516511 724404275
2463.9 724404275 723878801 723320067 723124027 723186731 723092973 722694933 722341776 722390473 722674906 722747803
2484.3 722747803 722496390 722278953 722394288 722638786 722602844 722239256 721917093 721926212 722080290 721956253
2504.7 721956253 721490920 721083522 721031189 721116543 720939875 720482409 720113635 720088184 720164239 719936430
2525.1 719936430 719446719 719100237 719082475 719122827 718880534 718432665 718165040 718209743 718251407 717961073
2545.5 717961073 717442513 717084467 717046559 717054486 716790617 716343284 716069579 716088593 716080904 715737462 715207577
2567.9 715207577 714848161 714760900 714688003 714354038 713874817 713611364 713607788 713514984 713113308 712593675
2588.3 712593675 712275684 712217450 712141693 711797893 711339951 711109638 711128652 711043537 710614324 710063636
2608.7 710063636 709754944 709710360 709615231 709258556 708814800 708583653 708568573 708456457 708051860 707539678
2629.1 707539678 707223058 707150996 707067311 706763029 706370234 706149638 706096530 705922246 705449879 704913199
2649.5 704913199 704645514 704600692 704460561 704098582 703719378 703552485 703527927 703338563 702854574 702351630
2669.9 702351630 702126801 702072144 701879859 701467693 701044261 700811923 700674176 700337946 699732423 699137032
2690.3 699137032 698803008 698644936 698369145 697862923 697347462 697048903 696874440 696544230 695975602 695409596
2710.7 695409596 695089221 694910705 694591105 694088697 693652153 693471968 693374336 693015099 692380786 691844463
2731.1 691844463 691661954 691659749 691499650 691152573 690926015 690975189 691077173 690932691 690520704 690137088
2751.4 690137088 690015793 689987659 689736307 689284563 688940465 688823402 688693583 688283801 687675595 687215686
2771.8 687215686 687030733 686810255 686270475 685555100 684982240 684628725 684275866 683685541 682848334 682030737
2792.2 682030737 681473434 681030989 680367589 679484665 678731084 678228378 677708805 676965356 676090658 675316751
2812.6 675316751 674756587 674240887 673555136 672775865 672101915 671542645 670883894 669947028 668892086
2831 668892086 668017149 667348444 666634738 665608108 664347410 663237989 662367404 661439598 660374224
2849.3 660374224 659548283 659326017 659626067 660085440 660424888 660646677 660926163 661246598 661346972 661169350
2869.7 661169350 660949469 660764933 660492897 660071433 659492075 658821940 658163488 657444179 656479597 655229747
2890.1 655229747 653907239 652765214 651726902 650574267 649394274 648416162 647710085 647155583 646565139
2908.5 646565139 645927608 645371675 644899964 644421279 643891871 643383980 643119276 643210173 643531561 643817365
2928.9 643817365 643845677 643793702 643970609 644289970 644494832 644579351 644690573 644827306 644782841 644434333
2949.3 644434333 643947303 643483281 643097639 642837226 642620683 642381251 642229021 642218471 642205596 642045379
2969.7 642045379 641815543 641664386 641552866 641381800 641025662 640346825 639475703 638622642 637696385 636524677
2990.1 636524677 635053992 633348465 631674349 630107582 628479779 626890898 625618875 624764979
3006.4 624764979 624193490 623730242 623325527 623030424 622905374 622872293 622755706 622547448 622334242 622059166
3026.8 622059166 621607780 620906115 619960129 618771076 617355585 615838170 614166915 612227082 610206246
3045.1 610206246 608400047 606930614 605699122 604656160 603960216 603617191 603385508 603108406 602848113
3063.5 602848113 602726161 602654755 602441132 602149963 602091312 602508664 603244007 603807747 603982091 603956521
3083.9 603956521 603915870 603909671 603778243 603302836 602641165 602133393 601821065 601428390 600765049 600022376
3104.3 600022376 599474490 599042773 598393381 597536922 596800566 596197903 595478475 594442308 593121827
3122.6 593121827 591853857 590852737 589956343 588912189 587670505 586438358 585431159 584536374 583433092
3141 583433092 582097411 580764294 579552948 578445435 577297986 575923502 574384451 572948992 571681201
3159.4 571681201 570403993 569019914 567631841 566335142 565062225 563719034 562285781 560821533
3175.7 560821533 559456825 558225989 556942463 555511296 554099619 552821338 551604688 550315559
3192 550315559 548899174 547467768 546175897 545027792 543874383 542626560 541379213 540228963 539122939
3210.3 539122939 537931263 536660314 535460114 534392416 533404350 532387078 531271100 530178905
3226.7 530178905 529247761 528420329 527519524 526418507 525260568 524280190 523432910 522543430 521591425
3245 521591425 520665884 519767761 518869936 517969251 517027020 516080737 515234768 514462590 513613105 512672424
3265.4 512672424 511830628 511165619 510444582 509481847 508389294 507369697 506518960 505741119 504892170
3283.8 504892170 503968418 503079474 502322197 501589954 500679255 499575198 498445332 497480094 496701509
3302.1 496701509 495945483 495032161 493931800 492750257 491545588 490324885 489105493 487949222 486926347
3320.5 486926347 485977620 484931678 483699858 482421339 481232733 480042845 478817046 477670342
3336.8 477670342 476564467 475387812 474143296 472838014 471590191 470539898 469457597 468099624
3353.1 468099624 466648877 465368479 464293450 463279396 462239385 461296678 460467786 459501237 458253026
3371.5 458253026 456922144 455735445 454692662 453735024 452799052 451851636 450969040 450324029 449964523
3389.8 449964523 449512273 448650330 447707593 447164863 446909755 446399063 445546985 444813102 444386303 444106817
3410.2 444106817 443810046 443375796 442855984 442434579 442181170 442046702 441995919 442059696 442237496 442417622
3430.6 442417622 442628741 442871273 442857921 442552328 442359716 442509890 442826360 443119347 443416983 443819314
3451 443819314 444284409 444731623 445213854 445794463 446405441 447090089 447996289 448969990 449659914 450040758
3471.4 450040758 450479925 451167822 452041864 452947825 453749806 454595149 455564260 456481010 457383573 458443671
3491.8 458443671 459598422 460738152 461809695 462880641 464026898 465103030 466099262 467208952
3508.1 467208952 468528867 470009625 471385539 472485274 473526627 474805534 476359576 477852851
3524.4 477852851 479101986 480400383 481947660 483644515 485355735 486918837 488338023 489904553
3540.8 489904553 491686910 493433833 494991094 496534914 498246640 500092745 501938522 503710508
3557.1 503710508 505516887 507392704 509130538 510706007 512599587 514980376 517351449 519478023
3573.4 519478023 521469057 523408115 525406837 527534127 529586136 531331182 532988548 534983218
3589.7 534983218 537075937 538977981 540828824 542739272 544647336 546584666 548488915 550097585
3606 550097585 551599205 553408504 555488408 557650983 559700310 561770856 564453185 567485631 570107877
3624.4 570107877 572270155 574907184 578816772 583037674 587143719 591289461 595497608 599957049
3640.7 599957049 604594469 609022677 613444030 619123638 626241326 632996082 639287770 646177113
3657 646177113 653233469 659819305 666098893 671984136 677303314 682689250 688413858 693447292 698349237
3675.4 698349237 703703344 708381474 712195337 715386510 717822075 719601214 721301019 723354220
3691.7 723354220 725378811 726867437 727690816 728021264 728426635 729226232 729807258 729650140 729135871
3710 729135871 729199171 730076373 730807602 730813742 730358005 729931235 729744792 729706645 729677498 729237556 728288412
3732.5 728288412 727564991 727677107 728164256 728111148 727056324 725863397 725715518 725457311 724802136
3750.8 724802136 725121140 725928247 726109445 725804389 725680590 725634217 725339592 724949598 724588811 724494934
3771.2 724494934 724672377 724602699 724053919 723360956 723001122 722831786 722658873 722569704 722413123 722092152
3791.6 722092152 721579313 720893979 720213175 719326437 718525112 718525410 718582392 718521357 718771398 718778372 718064725
3814.1 718064725 717044175 716393471 715751827 715507627 715995848 716215491 715994060 715537965 714932799
3832.4 714932799 714389384 713706195 712978244 712799251 713051140 713431001 713660121 713298917 712023854
3850.8 712023854 710190296 709822118 710876822 711401701 710974753 710181355 709747910 709548831 708997965
3869.1 708997965 708594441 708724737 708952010 708957791 708410621 707799613 707563996 707339883 707255423 707053363
3889.5 707053363 706576884 706508398 706585586 706022680 705002189 704218149 703994751 704360962 704860926 704955280
3909.9 704955280 704727829 704368532 703875303 703444660 703194201 702935040 702626705 702469468 702329636 701954722
3930.3 701954722 701633573 701677680 701787770 701626420 701182663 700662374 700394034 700329721 700178862 699977219
3950.7 699977219 699836731 699683726 699490666 699288845 699048102 698817909 698679924 698581755 698432922 698199749
3971.1 698199749 697966516 697855175 697808444 697691739 697504461 697325885 697167635 697001159 696845114 696716249
3991.5 696716249 696599066 696481466 696382999
3997.6 696382999
##END=$$ End of the data block
