##TITLE=NaSeCN $$ Begin of the data block
##JCAMP-DX=5.00 $$ ACD/SpecManager v 10.08
##SPECTROMETER/DATA SYSTEM=Alpha
##DATE=13 Jul 2015 15:22:34
##DATA TYPE=INFRARED SPECTRUM
##DATA CLASS=XYDATA
##ORIGIN=
##OWNER=
##NPOINTS=1765
##FIRSTX=399.76428223
##LASTX=3997.64306641
##MAXX=3997.64306641
##MINX=399.76428223
##MAXY=0.53299785
##MINY=0.00013597
##XFACTOR=1.0000000000
##YFACTOR=1.000000000000000e-9
##FIRSTY=0.09486887
##DELTAX=2.03961372
##XUNITS=1/CM
##YUNITS=ARBITRARY UNITS
##XYDATA=(X++(Y..Y))
$$ plain form
399.8 94868869 93544595 91350697 89395657 88478267 87865256 86865902 85771598 85028097 84576853
418.1 84576853 84314317 84515348 84763259 84904060 85095793 84895372 84269546 83491303 82698002 81916869
438.5 81916869 80882661 79745121 79161674 78925088 78399040 77762000 77210478 76577209 75868160 74967004
458.9 74967004 74062914 73575400 73402271 73329195 73180929 72862871 72389819 72069407 72170772 72301805
479.3 72301805 72114632 71701318 71352065 71229301 71189336 71162961 71253031 71448326 71532585 71392685 71220741
501.7 71220741 71224771 71424246 71682483 71963303 72373375 72748989 72905384 72931193 73146395 73667988
522.1 73667988 74201427 74577138 74979670 75529546 76109268 76719023 77376992 78000635 78599773 79280503
542.5 79280503 80041319 80810435 81507802 82066216 82565583 83164006 83897695 84464177 84767520 85150778
$$ packed form
399.8I4868869j324274k193898j955040r17390o13011r99354j094304p43501m51244
418.1H4576853k62536K01031K47911J40801J91733k00421o25826p78243p93301p81133
438.5H1916869j034208j137540n83447k36586n26048o37040n51522o33269p09049r01156
458.9G4967004r04090m87514j73129p3076j48266l18058m73052l20412J01365J31033
479.3G2301805j87173m13314l49253j22764l9965k6375R0070J95295Q4259j39900j71944
501.7G1220741M030J99475K58237K80820M10072L75614J56395K5809K15202N21593
522.1G3667988N33439L75711M02532N49876N79722O09755O57969O23643N99138O80730
542.5G9280503P60816P69116O97367N58414M99367N98423P33689N66482L03343L83258
$$ plain form
562.9 85150778 85808717 86605132 87388389 88266276 89177042 89914188 90724282 91787174 92813715 93651883
583.3 93651883 94347045 95017634 95860302 96886531 97884133 98812290 99749058 100651994 101559758 102605060
603.7 102605060 103808157 105051033 106251329 107359178 108423673 109567106 110784344 111982524
620 111982524 113145091 114291444 115436278 116607644 117803261 119051956 120273829 121408679 122539960
638.4 122539960 123694204 124892242 126138493 127288818 128409311 129741997 131166995 132475987
654.7 132475987 133729041 135044038 136372790 137614638 138671815 139967084 141870111 143332288
671 143332288 144486845 145760924 147069573 148469970 149953201 151395679 152777582 154158100 155606091
689.4 155606091 157117039 158655822 160257071 161909252 163507104 165061429 166701287 168401673
$$ packed form
562.9H5150778O57939P96415P83257Q77887R10766P37146Q10094J062892J026541Q38168
583.3I3651883O95162O70589Q42668J026229R97602R28157R36768R02936R07764J045302
603.7A02605060J203097J242876J200296J107849J064495J143433J217238J198180
620A11982524J162567J146353J144834J171366J195617J248695J221873J134850J131281
638.4A22539960J154244J198038J246251J150325J120493J332686J424998J308992
654.7A32475987J253054J314997J328752J241848J057177J295269J903027J462177
671A43332288J154557J274079J308649J400397J483231J442478J381903J380518J447991
689.4A55606091J510948J538783J601249J652181J597852J554325J639858J700386
$$ plain form
705.7 168401673 170132220 171922430 173723087 175523266 177346542 179235458 181228116 183265492
722 183265492 185302183 187396526 189539596 191753387 194054112 196351111 198671937 201096982 203602970
740.4 203602970 206195951 208915263 211659253 214354381 217061594 219898060 222860664 225852534
756.7 225852534 228875324 231971011 235132992 238310322 241545871 244882256 248279497 251719654
773 251719654 255232513 258830875 262503147 266200155 269887060 273593605 277320355 281026632 284680396
791.4 284680396 288337082 291982323 295607835 299277872 302973390 306616426 310168236 313729942
807.7 313729942 317331284 320892036 324405044 327883899 331316739 334780246 338394165 342159867
824 342159867 345931560 349685609 353546292 357535362 361599684 365667135 369745910 373916298 378177494
$$ packed form
705.7A68401673J730547J790210J800657J800179J823276J888916J992658K037376
722A83265492K036691K094343K143070K213791K300725K296999K320826K425045K505988
740.4B03602970K592981K719312K743990K695128K707213K836466K962604K991870
756.7B25852534L022790L095687L161981L177330L235549L336385L397241L440157
773B51719654L512859L598362L672272L697008L686905L706545L726750L706277L653764
791.4B84680396L656686L645241L625512L670037L695518L643036L551810L561706
807.7C13729942L601342L560752L513008L478855L432840L463507L613919L765702
824C42159867L771693L754049L860683L989070M064322M067451M078775M170388M261196
$$ plain form
842.4 378177494 382405281 386565357 390677273 394691974 398635775 402561814 406476229 410309464
858.7 410309464 413978547 417450279 420800030 424106210 427295446 430302024 433169991 435963243
875 435963243 438724130 441447049 444051892 446505994 448860973 451201409 453497708 455611497 457539022
893.4 457539022 459406942 461322665 463231564 464955091 466482759 467991471 469526291 470999300
909.7 470999300 472361922 473637402 474891961 476090342 477144361 478077203 479002535 479980409 480954677
928 480954677 481850505 482630104 483316988 483998746 484708786 485350281 485844076 486258030 486736983 487291366
948.4 487291366 487768233 488118351 488410830 488680214 488946140 489196688 489362270 489469916 489585221 489664078
968.8 489664078 489712685 489772916 489781737 489696980 489597768 489491105 489316702 489143610 489068478 489073813 489051878
$$ packed form
842.4C78177494M227787M160076M111916M014701L943801L926039L914415L833235
858.7D10309464L669083L471732L349751L306180L189236L006578K867967K793252
875D35963243K760887K722919K604843K454102K354979K340436K296299K113789J927525
893.4D57539022J867920J915723J908899J723527J527668J508712J534820J473009
909.7D70999300J362622J275480J254559J198381J054019R32842R25332R77874R74268
928D80954677Q95828P79599O86884O81758P10040O41495M93795M13954M78953N54383
948.4D87291366M76867L50118K92479K69384K65926K50548J65582J07646J15305P8857
968.8D89664078M8607O0231Q821q4757r9212j06663j74403j73092p5132N335k1935
$$ plain form
991.3 489051878 488910675 488692552 488499612 488333583 488139659 487872839 487553418 487240881 486909002 486528069
1011.6 486528069 486149579 485801637 485488534 485249132 485080987 484946847 484833658 484736145 484603643 484382004
1032 484382004 484106332 483850539 483620584 483352840 483030528 482722461 482476532 482259482 482074916 481962770
1052.4 481962770 481908977 481880903 481812716 481644630 481418163 481176496 480939716 480720699 480459690 480186909
1072.8 480186909 480011046 479914069 479809016 479683936 479537725 479336172 479098350 478837669 478570849 478329957
1093.2 478329957 478092223 477857769 477640241 477431178 477233917 477036029 476815253 476568282 476356387 476239502
1113.6 476239502 476134360 475979626 475828737 475689948 475567818 475509286 475502461 475471228 475385040 475314528 475287437
1136.1 475287437 475238681 475128412 474956423 474729836 474466294 474213690 474021882 473865390 473705739 473575979
$$ packed form
991.3D89051878j41203k18123j92940j66029j93924k66820l19421l12537l31879l80933
1011.6D86528069l78490l47942l13103k39402j68145j34140j13189r7513j32502k21639
1032D84382004k75672k55793k29955k67744l22312l08067k45929k17050j84566j12146
1052.4D81962770n3793k8074o8187j68086k26467k41667k36780k19017k61009k72781
1072.8D80186909j75863r6977j05053j25080j46211k01553k37822k60681k66820k40892
1093.2D78329957k37734k34454k17528k09063j97261j97888k20776k46971k11895j16885
1113.6D76239502j05142j54734j50889j38789j22130n8532o825l1233q6188p0512k7091
1136.1D75287437m8756j10269j71989k26587k63542k52604j91808j56492j59651j29760
$$ plain form
1156.5 473575979 473468870 473347127 473259807 473232508 473221421 473204970 473179817 473177582 473203540 473195553 473130882
1178.9 473130882 473030210 472943962 472907990 472884834 472822726 472699642 472545028 472456217 472417623 472306430 472150952
1201.3 472150952 472043782 471968353 471889824 471834540 471769929 471655548 471547484 471490264 471470267 471431881 471324354
1223.8 471324354 471190810 471143991 471180797 471187413 471122712 471058071 471054852 471113145 471173644 471164763 471133828 471163690
1248.2 471163690 471253097 471356124 471428365 471436292 471412033 471416861 471492559 471661299 471874774 472061753 472235918
1270.7 472235918 472458810 472683012 472852588 473001242 473156482 473347455 473585457 473788470 473910719 474006295
1291.1 474006295 474142164 474350631 474571437 474764109 474962980 475191414 475437731 475678265 475901335 476119250
1311.5 476119250 476328462 476519108 476719201 476909608 477051049 477153063 477231085 477278739 477261275 477097273
$$ packed form
1156.5D73575979j07109j21743q7320k7299j1087j6451k5153k235K5958p987o4671
1178.9D73130882j00672q6248l5972k3156o2108j23084j54614q8811l8594j11193j55478
1201.3D72150952j07170p5429p8529n5284o4611j14381j08064n7220j9997l8386j07527
1223.8D71324354j33544m6819L6806O616o4701o4641l219N8293O0499q881l0935K9862
1248.2D71163690Q9407J03027P2241P927k4259M828P5698J68740K13475J86979J74165
1270.7D72235918K22892K24202J69576J48654J55240J90973K38002K03013J22249R5576
1291.1D74006295J35869K08467K20806J92672J98871K28434K46317K40534K23070K17915
1311.5D76119250K09212J90646K00093J90407J41441J02014P8022M7654j7464j64002
$$ plain form
1331.9 477097273 476780295 476421297 475965291 475193530 474142760 472916424 471492797 470053554 469002366
1350.2 469002366 468764961 469474524 470924497 472740263 474503666 475856781 476773381 477450103 477861702
1368.6 477861702 478038341 477984816 477597386 477107793 476655781 476095527 475648195 475826532 476613730 477580637
1389 477580637 478606492 479558080 480198413 480608165 480902821 481239974 481642485 481844217 481920511 482053906
1409.4 482053906 482162952 482318997 482667506 482869685 482530564 482289344 482342571 482410431 482535362 482548654
1429.8 482548654 482563108 482783198 482685685 482169449 482052594 482208848 482345343 482396454 482209980 482027233
1450.2 482027233 482149750 482517153 482331306 481253594 480820209 480937093 480689913 480227381 480334580
1468.5 480334580 480666518 480410218 479718208 479248792 478942961 478646696 478329539 478119195 477815688 476960361
$$ packed form
1331.9D77097273l16978l58998m56006p71761j050770j226336j423627j439243j051188
1350.2D69002366k37405P09563J449973J815766J763403J353115R16600O76722M11599
1368.6D77861702J76639n3525l87430m89593m52012n60254m47332J78337P87198R66907
1389D77580637J025855R51588O40333M09752K94656L37153M02511K01732P6294J33395
1409.4D82053906J09046J56045L48509K02179l39121k41220N3227O7860J24931J3292
1429.8D82548654J4454K20090r7513n16236j16855J56254J36495N1111j86474j82747
1450.2D82027233J22517L67403j85847j077712m33385J16884k47180m62532J07199
1468.5D80334580L31938k56300o92010m69416l05831k96265l17157k10344l03507q55327
$$ plain form
1488.9 476960361 475826979 475254297 474886417 473825186 472511441 471780837 471712828 471281677 469122082
1507.3 469122082 467209518 466311723 465512276 464459211 463207513 461813062 459687680 457365066 455491304
1525.6 455491304 453455597 451672584 449748695 446905047 444616020 442863107 439105690 434054613
1542 434054613 430140078 426603228 423098832 419012189 414585978 410181612 405798495 398331732 387779355
1560.3 387779355 381297976 375368804 368001550 358891219 347794980 337989211 327822894 313348502
1576.6 313348502 299228102 286811829 273037583 258019120 242334098 226063415 209333256
1590.9 209333256 192409188 175265744 158404812 142317683 126907438 112317070 99093482
1605.2 99093482 87280631 76730594 67869708 60849786 54821990 49288481 45490261 42995844
$$ packed form
1488.9D76960361j133382n72682l67880j061231j313745p30604o8009m31151k159595
1507.3D69122082j912564q97795p99447j053065j251698j394451k125382k322614j873762
1525.6D55491304k035707j783013j923889k843648k289027j752913l757417n051077
1542D34054613l914535l536850l504396m086643m426211m404366m383117p466763j0552377
1560.3C87779355o481379n929172p367254r110331j1096239r805769j0166317j4474392
1576.6C13348502j4120400j2416273j3774246j5018463j5685022j6270683j6730159
1590.9B09333256j6924068j7143444j6860932j6087129j5410245j4590368j3223588
1605.2I9093482j1812851j0550037q860886p019922o027796n533509l798220k494417
$$ plain form
1621.5 42995844 41164417 40109012 39761111 39966103 40500052 41568652 43795891 46537604 49033087
1639.9 49033087 51776920 54907214 59317142 64766809 69137335 74901268 84592797 92502922
1656.2 92502922 99349074 107673094 118192174 129798621 140619114 152875021 167630702 181375295
1672.5 181375295 195598185 211287811 225534633 238743648 253295600 271315873 287111312
1686.8 287111312 300009042 313159645 325389743 338038355 351265401 363328367 375702828
1701.1 375702828 386187792 395326883 404676616 413165212 420933574 428280115 435248971 442135155
1717.4 442135155 448396593 453766197 458739311 463552207 467999548 472252160 476154357 479681253
1733.7 479681253 483057141 486214340 489170671 491945088 494622767 497145563 499450028 501415372
$$ packed form
1621.5D2995844j831427j055405l47901K04992N33949J068600K227239K741713K495483
1639.9D9033087K743833L130294M409928N449667M370526N763933R691529P910125
1656.2I2502922O846152Q324020J0519080J1606447J0820493J2255907J4755681J3744593
1672.5A81375295J4222890J5689626J4246822J3209015J4551952J8020273J5795439
1686.8B87111312J2897730J3150603J2230098J2648612J3227046J2062966J2374461
1701.1C75702828J0484964R139091R349733Q488596P768362P346541O968856O886184
1717.4D42135155O261438N369604M973114M812896M447341M252612L902197L526896
1733.7D79681253L375888L157199K956331K774417K677679K522796K304465J965344
$$ plain form
1750 501415372 503327966 505345106 507265151 509018183 510602772 511987269 513432205 515000939 516437829
1768.4 516437829 517594755 518380702 519308388 520479858 521574438 522515476 523411095 524264276 525138378
1786.7 525138378 526101828 526756287 527072728 527649403 528474927 529095054 529497564 529933751 530466378 530971050
1807.1 530971050 531323433 531533659 531761467 532075942 532303691 532491386 532754183 532936394 532961190 532997847
1827.5 532997847 532839358 532630920 532707930 532721996 532573998 532548368 532539308 532041609 531431019 531173885
1847.9 531173885 530939400 530629098 530243754 529770017 529262602 528758168 528251767 527795792 527254879 526350439
1868.3 526350439 525358140 524686158 524075747 523323655 522500813 521622539 520711422 519795477 518889010 517825842
1888.7 517825842 516668737 515647292 514563382 513361216 512219965 511098683 509904683 508661628
$$ packed form
1750E01415372J912594K017140J920045J753032J584589J384497J444936J568734J436890
1768.4E16437829J156926P85947R27686J171470J094580R41038Q95619Q53181Q74102
1786.7E25138378R63450O54459L16441N76675Q25524O20127M02510M36187N32627N04672
1807.1E30971050L52383K10226K27808L14475K27749J87695K62797J82211K4796L6657
1827.5E32997847j58489k08438P7010J4066j47998k5630r060m97699o10590k57134
1847.9E31173885k34485l10302l85344m73737n07415n04434n06401m55975n40913r04440
1868.3E26350439r92299o71982o10411p52092q22842q78274r11117r15945r06467j063168
1888.7E17825842j157105j021445j083910j202166j141251j121282j194000j243055
$$ plain form
1905 508661628 507365048 505969882 504557133 503262103 501985013 500466943 498878866 497426510 495877206
1923.4 495877206 494324684 492878586 491377771 489777118 488104343 486449361 484900177 483397514
1939.7 483397514 481686324 479812592 478071392 476415485 474740058 473034322 471293151 469534457
1956 469534457 467746586 465924919 464111358 462306887 460415602 458446294 456535339 454631120 452638447
1974.4 452638447 450608373 448582619 446503490 444334209 442113429 439830154 437482893 434994191
1990.7 434994191 432262659 429448128 426601946 423528045 420150429 416485667 412512183 408181161
2007 408181161 403456628 398309201 392724484 386640102 379962832 372806013 365271658 357258528 348686755
2025.4 348686755 339509457 329619735 318874121 307075232 293950737 279252231 262705952 244076043
$$ packed form
1905E08661628j296580j395166j412749j295030j277090j518070j588077j452356j549304
1923.4D95877206j552522j446098j500815j600653j672775j654982j549184j502663
1939.7D83397514j711190j873732j741200j655907j675427j705736j741171j758694
1956D69534457j787871j821667j813561j804471j891285j969308j910955j904219j992673
1974.4D52638447k030074k025754k079129k169281k220780k283275k347261k488702
1990.7D34994191k731532k814531k846182l073901l377616l664762l973484m331022
2007D08181161m724533n147427n584717o084382o677270p156819p534355q013130q571773
2025.4C48686755r177298r889722j0745614j1798889j3124495j4698506j6546279j8629909
$$ plain form
2041.7 244076043 223484069 201242834 177757546 153727278 130026489 107536763 87042436
2056 87042436 69096185 54016326 41885026 32452621 25346939 20206187 16627008 14248710
2072.3 14248710 12822748 12173002 12228574 13043443 14759541 17588718 21812281 27882939 36446188
2090.6 36446188 48209094 63890345 84114619 109085806 138333425 170644104 204229206
2104.9 204229206 237120956 267632514 294704825 317953736 337471575 353652269 367019683
2119.2 367019683 378064632 387241781 394969106 401571423 407298267 412317187 416724086 420645803
2135.5 420645803 424187571 427380502 430263072 432909489 435375065 437688440 439861089 441888273
2151.8 441888273 443751156 445457608 447074085 448593527 449945718 451128542 452180445 453139156
$$ packed form
2041.7B44076043k0591974k2241235k3485288k4030268k3700789k2489726k0494327
2056H7042436j7946251j5079859j2131300r432405p105682n140752l579179k378298
2072.3A4248710j425962o49746N5572Q14869J716098K829177M223563O070658Q563249
2090.6C6446188J1762906J5681251K0224274K4971187K9247619L2310679L3585102
2104.9B04229206L2891750L0511558K7072311K3248911J9517839J6180694J3367414
2119.2C67019683J1044949R177149P727325O602317N726844N018920M406899L921717
2135.5D20645803L541768L192931K882570K646417K465576K313375K172649K027184
2151.8D41888273J862883J706452J616477J519442J352191J182824J051903R58711
$$ plain form
2168.1 453139156 454059839 454983145 455960751 457086325 458377868 459787697 461286396 462821931 464343458
2186.5 464343458 465870917 467397898 468844593 470159560 471339345 472407579 473417819 474412262
2202.8 474412262 475398868 476359099 477266610 478152961 479043186 479892015 480702162 481507391 482286245 483054489
2223.2 483054489 483873725 484713882 485508800 486255199 486977130 487716466 488487840 489260942 490011394 490744770
2243.6 490744770 491479605 492208898 492923439 493649215 494381577 495056152 495689362 496356755 497050822 497731149
2264 497731149 498391360 499056071 499725401 500349581 500930607 501527131 502157390 502807796 503473520 504129112
2284.4 504129112 504712880 505216897 505692184 506173193 506666124 507160366 507647216 508104146 508520484 508899689
2304.8 508899689 509233713 509541750 509867251 510197520 510494053 510743916 510933101 511078656 511242807 511449218
$$ packed form
2168.1D53139156R20683R23306R77606J125574J291543J409829J498699J535535J521527
2186.5D64343458J527459J526981J446695J314967J179785J068234J010240R94443
2202.8D74412262R86606R60231R07511Q86351Q90225Q48829Q10147Q05229P78854P68244
2223.2D83054489Q19236Q40157P94918P46399P21931P39336P71374P73102P50452P33376
2243.6D90744770P34835P29293P14541P25776P32362O74575O33210O67393O94067O80327
2264D97731149O60211O64711O69330O24180N81026N96524O30259O50406O65724O55592
2284.4E04129112N83768N04017M75287M81009M92931M94242M86850M56930M16338L79205
2304.8E08899689L34024L08037L25501L30269K96533K49863J89185J45555J64151K06411
$$ plain form
2325.2 511449218 511614144 511720598 511890054 512164354 512416840 512564838 512633979 512733042 512958646 513478756
2345.6 513478756 514444530 515362680 515649199 515291512 514780402 514481544 514430344 514579713 514913976 515358448
2366 515358448 515838087 516426921 517103076 517764330 518419147 519087672 519737601 520297408 520741880 521094918
2386.4 521094918 521367431 521565735 521730006 521889746 522022486 522133768 522249401 522369742 522497296 522607684
2406.8 522607684 522691965 522785664 522888541 522978961 523050249 523102582 523145616 523196876 523273885 523373008 523437798
2429.2 523437798 523442626 523466170 523559034 523655713 523672283 523633718 523628473 523665726 523666024 523623943 523606896 523592472
2453.7 523592472 523546338 523503423 523459196 523363650 523203611 522986948 522727072 522432327 522097230 521728396
2474.1 521728396 521314025 520848334 520364046 519902945 519492984 519149244 518911898 518798590 518778920 518841624
$$ packed form
2325.2E11449218J64926J06454J69456K74300K52486J47998O9141R9063K25604N20110
2345.6E13478756R65774R18150K86519l57687n11110k98858n1200J49369L34263M44472
2366E15358448M79639N88834O76155O61254O54817O68525O49929N59807M44472L53038
2386.4E21094918K72513J98304J64271J59740J32740J11282J15633J20341J27554J10388
2406.8E22607684Q4281R3699J02877R0420P1288N2333M3034N1260P7009R9123O4790
2429.2E23437798M828K3544R2864R6679J6570l8565n245L7253K98m2081j7047j4424
2453.7E23592472m6134m2915m4227r5546j60039k16663k59876k94745l35097l68834
2474.1E21728396m14371m65691m84288m61101m09961l43740k37346j13308j9670O2704
$$ plain form
2494.5 518841624 518975258 519167006 519441783 519779325 520113528 520419061 520707905 520995498 521249056 521425664
2514.9 521425664 521527588 521586835 521645665 521692216 521712899 521734536 521743834 521732211 521724105 521693528 521622241 521523476
2539.3 521523476 521394789 521283150 521226346 521152198 521012843 520866632 520757079 520672798 520579934 520468533
2559.7 520468533 520334065 520169139 520020425 519892454 519726157 519495726 519242883 519009113 518788517 518565774
2580.1 518565774 518317521 518038690 517750263 517449319 517127275 516802490 516451538 516022742 515518963 514933228
2600.5 514933228 514225900 513408065 512475789 511384904 510132909 508683443 506979883 505043149 502907574
2618.9 502907574 500560105 498034090 495435596 492826700 490272760 487902761 485815138 484108031
2635.2 484108031 482898831 482246399 482157797 482600480 483543962 484940112 486686945 488712609 490962207
$$ packed form
2494.5E18841624J33634J91748K74777L37542L34203L05533K88844K87593K53558J76608
2514.9E21425664J01924N9247N8830M6551K0683K1637R298j1623q106l0577p1287r8765
2539.3E21523476j28687j11639n6804p4148j39355j46211j09553q4281r2864j11401
2559.7E20468533j34468j64926j48714j27971j66297k30431k52843k33770k20596k22743
2580.1E18565774k48253k78831k88427l00944l22044l24785l50952m28796n03779n85735
2600.5E14933228p07328q17835r32276j090885j251995j449466j703560j936734k135575
2618.9E02907574k347469k526015k598494k608896k553940k369999k087623j707107
2635.2D84108031j209200o52432q8602M42683R43482J396150J746833K025664K249598
$$ plain form
2653.5 490962207 493334562 495694131 497933477 500031233 501980245 503707290 505162477 506390989
2669.9 506390989 507432461 508278430 508952320 509486914 509868681 510124266 510314286 510436475 510469735 510443628
2690.3 510443628 510399818 510341346 510264456 510154784 510004938 509857416 509706616 509510875 509288609 509063363
2710.7 509063363 508839071 508623183 508387923 508101225 507807493 507563055 507331908 507052243 506739855 506459534
2731.1 506459534 506241322 506053329 505851984 505607247 505322874 505057812 504837155 504629195 504407823 504160166
2751.4 504160166 503882527 503621936 503406346 503178656 502904475 502603710 502287686 501969278 501659274 501313448
2771.8 501313448 500935495 500578046 500201106 499791652 499401152 499014020 498597354 498144478 497657627 497167408
2792.2 497167408 496671170 496151686 495602310 495002568 494373351 493753642 493193567 492702216 492183685 491582751
$$ packed form
2653.5D90962207K372355K359569K239346K097756J949012J727045J455187J228512
2669.9E06390989J041472Q45969O73890N34594L81767K55585J90020J22189L3260k6107
2690.3E10443628m3810n8472p6890j09672j49846j47522j50800j95741k22266k25246
2710.7E09063363k24292k15888k35260k86698k93732k44438k31147k79665l12388k80321
2731.1E06459534k18212j87993k01345k44737k84373k65062k20657k07960k21372k47657
2751.4E04160166k77639k60591k15590k27690k74181l00765l16024l18408l10004l45826
2771.8E01313448l77953l57449l76940m09454l90500l87132m16666m52876m86851m90219
2792.2D97167408m96238n19484n49376n99742o29217o19709n60075m91351n18531o00934
$$ plain form
2812.6 491582751 490961522 490404129 489921451 489449114 488955885 488464624 487986684 487544686 487139463 486701638
2833 486701638 486188352 485678554 485226482 484690964 483969361 483156502 482348651 481605768 480995357 480513602
2853.4 480513602 480093330 479684830 479263961 478820145 478325576 477719069 476995289 476221710 475468248 474763751
2873.8 474763751 474042326 473264724 472482741 471686214 470835179 469937056 469024420 468113393 467181951 466241181
2894.2 466241181 465323806 464417815 463487417 462523043 461555928 460585773 459573090 458500504 457357466
2912.6 457357466 456166595 454995990 453859419 452714711 451601952 450614750 449737161 448875546 447964907
2930.9 447964907 447029054 446133345 445250988 444324255 443345159 442323416 441274434 440154850 438917428
2949.3 438917428 437601835 436250299 434892595 433533698 432126641 430674791 429273576 427957237
$$ packed form
2812.6D91582751o21229n57393m82678m72337m93229m91261m77940m41998m05223m37825
2833D86701638n13286n09798m52072n35518p21603q12859q07851p42883o10411m81755
2853.4D80513602m20272m08500m20869m43816m94569o06507p23780p73579p53462p04497
2873.8D74763751p21425p77602p81983p96527q51035q98123r12636r11027r31442r40770
2894.2D66241181r17375r05991r30398r64374r67115r70155j012683j072586j143038
2912.6D57357466j190871j170605j136571j144708j112759r87202q77589q61615r10639
2930.9D47964907r35853q95709q82357r26733r79096j021743j048982j119584j237422
2949.3D38917428j315593j351536j357704j358897j407057j451850j401215j316339
$$ plain form
2965.6 427957237 426637471 425279498 423908055 422492683 421018720 419543713 418057293 416477799
2981.9 416477799 414789468 413030446 411270171 409574240 407874107 406048417 404177547 402355552
2998.2 402355552 400500953 398564816 396583557 394610703 392647862 390668720 388655514 386539131
3014.5 386539131 384338111 382154405 379964471 377724886 375442147 373113334 370791346 368483812
3030.9 368483812 366142601 363743156 361238778 358708322 356260270 353796631 351218373 348574758
3047.2 348574758 345939070 343274057 340522677 337736696 334958732 332191944 329405159 326557249
3063.5 326557249 323691994 320807368 317836106 314805239 311783344 308809459 305828154 302716821
3079.8 302716821 299486190 296225429 292944491 289656520 286377192 283012420 279530883 276056051
$$ packed form
2965.6D27957237j319766j357973j371443j415372j473963j475007j486420j579494
2981.9D16477799j688331j759022j760275j695931j700133j825690j870870j821995
2998.2D02355552j854599j936137j981259j972854j962841j979142k013206k116383
3014.5C86539131k201020k183706k189934k239585k282739k328813k321988k307534
3030.9C68483812k341211k399445k504378k530456k448052k463639k578258k643615
3047.2C48574758k635688k665013k751380k785981k777964k766788k786785k847910
3063.5C26557249k865255k884626k971262l030867l021895k973885k981305l111333
3079.8C02716821l230631l260761l280938l287971l279328l364772l481537l474832
$$ plain form
3096.1 276056051 272623569 269147128 265605628 262047827 258502662 254917830 251207083 247462392
3112.4 247462392 243789420 240100309 236344323 232514411 228561535 224550858 220596001 216687739
3128.8 216687739 212739021 208695695 204653129 200679287 196671709 192571923 188428760 184317335
3145.1 184317335 180264562 176247686 172217891 168109268 163953334 159847751 155783564 151711345
3161.4 151711345 147643402 143623486 139666617 135739475 131835982 127986372 124185041 120407641
3177.7 120407641 116705425 113083974 109487951 105956793 102540649 99212892 95935270 92733510
3194 92733510 89658633 86706348 83809502 80963850 78225143 75605750 73097035 70673279 68320259
3212.4 68320259 66056609 63908733 61883394 59936155 58043294 56260828 54591555 52965231
$$ packed form
3096.1B76056051l432482l476441l541500l557801l545165l584832l710747l744691
3112.4B47462392l672972l689111l755986l829912l952876m010677l954857l908262
3128.8B16687739l948718m043326m042566l973842m007578m099786m143163m111425
3145.1A84317335m052773m016876m029795m108623m155934m105583m064187m072219
3161.4A51711345m067943m019916l956869l927142l903493l849610l801331l777400
3177.7A20407641l702216l621451l596023l531158l416144l327757l277622l201760
3194I2733510l074877k952285k896846k845652k738707k619393k508715k423756k353020
3212.4F8320259k263650k147876k025339j947239j892861j782466j669273j626324
$$ plain form
3228.7 52965231 51379845 49883518 48476957 47130775 45810103 44498324 43262161 42146161
3245 42146161 41084260 40006272 38934685 37948474 37055653 36185909 35285987 34366339 33467539 32585610
3265.4 32585610 31728968 30915713 30101631 29302211 28520934 27696710 26879715 26115378 25345456 24556214
3285.8 24556214 23785781 23000456 22175889 21396592 20684505 19986957 19302024 18624121 17917717 17194094
3306.2 17194094 16492758 15785972 15049237 14327938 13669713 13084164 12518507 11904614 11263011 10658661
3326.6 10658661 10107074 9598699 9129788 8683296 8224302 7741389 7257405 6818368 6429291 6066774
3347 6066774 5739248 5407116 5035266 4668993 4371984 4133303 3883806 3647589 3511294 3427655
3367.4 3427655 3270912 2979362 2646942 2430754 2304469 2179012 2032094 1866319 1716617 1639155
$$ packed form
3228.7E2965231j585386j496327j406561j346182j320672j311779j236163j116000
3245D2146161j061901j077988j071587r86211q92821q69744q99922r19648q98800q81929
3265.4C2585610q56642q13255q14082p99420p81277q24224q16995p64337p69922p89242
3285.8B4556214p70433p85325q24567p79297p12087o97548o84933o77903p06404p23623
3306.2A7194094p01336p06786p36735p21299o58225n85549n65657o13893o41603o04350
3326.6A0658661n51587n08375m68911m46492m58994m82913m83984m39037l89077l62517
3347F066774l27526l32132l71850l66273k97009k38681k49497k36217j36295q3639
3367.4C427655j56743k91550l32420k16188j26285j25457j46918j65775j49702p7462
$$ plain form
3387.8 1639155 1654656 1658895 1531144 1346380 1304346 1378055 1339123 1157831 1000016 914369 856372
3410.2 856372 813218 721981 586961 507733 435857 340070 349253 475519 556227 535393 545158 614620
3434.7 614620 600411 453133 301545 221793 203789 236851 275951 295377 247401 150902 135975 233486
3459.2 233486 240076 231006 335018 562456 621212 457343 286633 265956 297493 406149 448441
3481.6 448441 435086 415608 381878 376276 437971 514104 592033 632782 629703 664743 642134 555422
3506.1 555422 564809 677780 821893 879641 826314 795547 891404 1111839 1250194 1222429 1217075 1262487
3530.6 1262487 1326523 1517006 1741637 1865107 2021303 2298928 2563143 2589735 2464379 2463022 2630032
3553 2630032 2826002 2996592 3200064 3401178 3479044 3545784 3881481 4320253 4601567 4829836 5118113
$$ packed form
3387.8A639155J5501M239j27751j84764m2034P3709l8932j81292j57815q5647n7997
3410.2H56372m3154r1237j35020p9228p1876r5787R183J26266Q0708k0834R765O9462
3434.7F14620j4209j47278j51588p9752j8004L3062L9100J9426m7976r6499j4927R7511
3459.2B33486O590r070J04012K27438N8756j63869j70710k0677L1537J08656M2292
3481.6D48441j3355j9478l3730n602O1695P6133P7929M0749l079L5040k2609q6712
3506.1E55422R387J12971J44113N7748n3327l0767R5857K20435J38355k7765n354M5412
3530.6A262487O4036J90483K24631J23470J56196K77625K64215K6592j25356j357J67010
3553B630032J95970J70590K03472K01114P7866O6740L35697M38772K81314K28269K88277
$$ plain form
3575.4 5118113 5461712 5884554 6364812 6821709 7309495 7869275 8403494 8899532 9522753 10326063
3595.8 10326063 11243735 12228766 13228497 14167828 15115650 16407125 18053377 19834790 21706285
3614.2 21706285 23593616 25880398 28812418 31679947 34264077 37098128 41267637 46441678
3630.5 46441678 51066868 55801507 61123658 66897519 73178045 79754390 86370833 93567818
3646.8 93567818 102605097 112567745 121133111 129328683 138718382 148238122 157255381 166241229
3663.1 166241229 175077185 183635801 192641720 201976895 210286021 218655124 227265015 234833673
3679.4 234833673 241839141 248596415 254968941 261140704 267233223 272940874 278125435 282964975
3695.8 282964975 287583381 291894585 295985907 300017953 303873837 307297587 310239434 313054562
$$ packed form
3575.4E118113L43599M22842M80258M56897M87786N59780N34219M96038O23221Q03310
3595.8A0326063R17672R85031R99731R39331R47822J291475J646252J781413J871495
3614.2B1706285J887331K286782K932020K867529K584130K834051M169509N174041
3630.5D6441678M625190M734639N322151N773861O280526O576345O616443P196985
3646.8I3567818R037279R962648Q565366Q195572R389699R519740R017259Q985848
3663.1A66241229Q835956Q558616R005919R335175Q309126Q369103Q609891P568658
3679.4B34833673P005468O757274O372526O171763O092519N707651N184561M839540
3695.8B82964975M618406M311204M091322M032046L855884L423750K941847K815128
$$ plain form
3712.1 313054562 316124916 319117397 321742147 324120194 326333046 328305274 330182731 332328737
3728.4 332328737 334443510 336179763 337573558 338921398 340691775 342696786 344118893 344931841
3744.7 344931841 346316010 347599000 348084807 348960161 350552499 351896614 352707773 353612393 354669869
3763.1 354669869 355541378 356304765 356926888 357570082 358510315 359490037 360224456 360693038 361191779 361709148
3783.5 361709148 362155825 362713069 363334805 364003927 364585996 364915252 365299523 365508556 365385920 365765363
3803.9 365765363 366068006 366008252 366426110 367189258 367599934 367558509 367733270 367538124 367113441 367436349
3824.3 367436349 367869616 368187129 368430197 368555635 368722349 368592173 368086308 367929429 368086100 368240654
3844.6 368240654 368609726 369269282 369488895 368195206 366984040 367474258 368206382 368502289 368380189
$$ packed form
3712.1C13054562L070354K992481K624750K378047K212852J972228J877457K146006
3728.4C32328737K114773J736253J393795J347840J770377K005011J422107Q12948
3744.7C44931841J384169J282990M85807Q75354J592338J344115Q11159R04620J057476
3763.1C54669869Q71509P63387O22123O43194R40233R79722P34419M68582M98741N17369
3783.5C61709148M46677N57244O21736O69122N82069L29256L84271K09033j22636L79443
3803.9C65765363L02643n9754M17858P63148M10676m1425J74761j95146m24683L22908
3824.3C67436349M33267L17513K43068J25438J66714j30176n05865j56879J56671J54554
3844.6C68240654L69072O59556K19613j293689j211166M90218P32124K95907j22100
$$ plain form
3863 368380189 368281633 368402511 368039072 367467254 367365211 367578328 367913008 367868364 367704034 367690146
3883.4 367690146 367391944 367351472 367481947 367234826 367266238 367722631 367934704 367798805 367514819 367096812
3903.8 367096812 366957814 367256403 367533535 367728055 367990255 368105203 368011683 368037999 368225485 368327081
3924.2 368327081 368406236 368591368 368707508 368720353 368837684 369056493 369310796 369523764 369612753 369806111
3944.6 369806111 370143712 370401025 370555192 370713264 370972276 371280402 371528268 371747911 372037292 372357875
3965 372357875 372614145 372855037 373130083 373354226 373506874 373688012 373988301 374402076 374766439 375001401
3985.4 375001401 375221550 375507772 375815153 376090527 376345187 376642615
3997.6 376642615
$$ packed form
3863C68380189r8556J20878l63439n71818j02043K13117L34680m4644j64330j3888
3883.4C67690146k98202m0472J30475k47121L1412M56393K12073j35899k83986m18007
3903.8C67096812j38998K98589K77132J94520K62200J14948r3520K6316J87486J01596
3924.2C68327081P9155J85132J16140J2845J17331K18809K54303K12968Q8989J93358
3944.6C69806111L37601K57313J54167J58072K59012L08126K47866K19643K89381L20583
3965C72357875K56270K40892K75046K24143J52648J81138L00289M13775L64363K34962
3985.4C75001401K20149K86222L07381K75374K54660K97428
3997.6C76642615
##END=$$ End of the data block
