##TITLE=NYLON 0422469-8 BJ15vy06-acido $$ Begin of the data block
##JCAMP-DX=5.00 $$ ACD/SpecManager v 10.08
##SPECTROMETER/DATA SYSTEM=Alpha
##DATE=13 May 2014 09:34:16
##DATA TYPE=INFRARED SPECTRUM
##DATA CLASS=XYDATA
##ORIGIN=
##OWNER=
##NPOINTS=1765
##FIRSTX=399.75695801
##LASTX=3997.56933594
##MAXX=3997.56933594
##MINX=399.75695801
##MAXY=0.83662587
##MINY=0.01748973
##XFACTOR=1.0000000000
##YFACTOR=1.000000000000000e-9
##FIRSTY=0.80982238
##DELTAX=2.03957629
##XUNITS=1/CM
##YUNITS=ARBITRARY UNITS
##XYDATA=(X++(Y..Y))
$$ plain form
399.8 809822381 815205097 819884121 822831452 824258983 825706601 828127623 830311000 830965161 830905139
418.1 830905139 832192719 834245741 835285783 835285187 835284591 835913777 836599231 836399496 835549951 835392535 836162269
440.5 836162269 836625874 836071670 835330427 835174382 835275769 834766388 833415389 832169712 832016230
458.9 832016230 832256854 831635535 830365241 829488397 829174817 828447402 827018619 825729847 825061202
477.3 825061202 824542880 823168457 820799947 818316638 816087306 813350379 809475422 804660022 799260020
495.6 799260020 793056071 785073757 774203062 760585368 744439960 725305855 704732597 685981274
511.9 685981274 673315346 671334207 681869388 700223684 718192279 731302381 739430666 744144440
528.3 744144440 747540414 751567543 757410407 765214145 774171829 783265531 791944444 799872458
$$ packed form
399.8H09822381N382716M679024K947331J427531J447618K421022K183377O54161o0022
418.1H30905139J287580K053022J040042n96TO29186O85454j99735q49545j57416P69734
440.5H36162269M63605n54204p41243j56045J01387n09381j350999j245677j53482
458.9H32016230K40624o21319j270294q76844l13580p27415j428783j288772o68645
477.3H25061202n18322j374423k368510k483309k229332k736927l874957m815400n400002
495.6G99260020o203949p982314j0870695j3617694j6145408j9134105k0573258j8751323
511.9F85981274j2665928j981139J0535181J8354296J7968595J3110102Q128285M713774
528.3G44144440L395974M027129N842864P803738Q957684R093702Q678913P928014
$$ plain form
544.6 799872458 806446433 811062694 813825309 815280080 815669537 815025330 813731611 812604964 812419295
562.9 812419295 813075304 813802898 814307868 815139532 816818893 818955839 820667207 821829438 823072612
581.3 823072612 824488997 825630367 826228380 826502502 826959193 827723801 828320026 828425825 828356445 828444898
601.7 828444898 828483403 828106642 827477932 826970279 826708019 826484621 826061428 825573325 825395525 825606048
622.1 825606048 825788617 825609744 825193167 824848413 824515104 823858559 822734654 821500003 820514917
640.4 820514917 819610000 818333805 816508710 814385116 812008202 809089899 805257380 800553441 795311511
658.8 795311511 789613187 783474326 777549803 770391881 760385096 752053440 744328201 734421015
675.1 734421015 722090602 706986904 688350499 666153491 642266989 620894790 608297944
$$ packed form
544.6G99872458O573975M616261K762615J454771L89457o44207j293719j126647j85669
562.9H12419295O56009P27594N04970Q31664J679361K136946J711368J162231J243174
581.3H23072612J416385J141370N98013K74122M56691P64608N96225J05799o9380Q8453
601.7H28444898L8505l76761o28710n07653k62260k23398m23193m88103j77800K10523
622.1H25606048J82569j78873m16577l44754l33309o56545j123905j234651r85086
640.4H20514917r04917j276195j825095k123594k376914k918303l832519m703939n241930
658.8G95311511n698324o138861n924523p157922j0006785q331656p725239r907186
675.1G34421015j2330413j5103698j8636405k2197008k3886502k1372199j2596846
$$ plain form
689.4 608297944 610276639 628524303 658907890 694113553 727488518 755266011 776474714 792068839
705.7 792068839 803584814 812175214 818370461 822465777 824967861 826329172 826284468 823905528 817737937
724 817737937 804738760 779058278 737300396 688708901 650771797 638502359 660447657 706733584
740.4 706733584 752853572 784906030 804692507 817239821 825237751 829916060 832318783 833621681
756.7 833621681 834692121 835519850 835796952 835751295 835840106 835967183 835686386 834821403 833751023 832924902
777.1 832924902 832203507 831127822 829639852 828191698 827008009 825778365 824142814 822275221 820766807
795.4 820766807 819857180 819150209 818287849 817492664 817149997 817190111 817095220 816591561 816036701 815904617
815.8 815904617 816041291 815880656 815342069 814925253 814866960 814721048 814004481 812826157 811731398 810864270
$$ packed form
689.4F08297944J978695J8247664L0383587L5205663L3374965K7777493K1208703J5594125
705.7G92068839J1515975Q590400O195247M095316K502084J361311m4704k378940o167591
724H17737937j2999177k5680482m1757882m8591495l7937104j2269438K1945298M6285927
740.4G06733584M6119988L2052458J9786477J2547314P997930M678309K402723J302898
756.7H33621681J070440Q27729K77102m5657Q8811J27077k80797q64983j070380q26121
777.1H32924902p21395j075685j487970j448154j183689j229644j635551j867593j508414
795.4H20766807r09627p06971q62360p95185l42667M0114r4891n03659n54860j32084
815.8H15904617J36674j60635n38587m16816n8293j45912p16567j178324j094759q67128
$$ plain form
836.2 810864270 809708714 807858348 805628598 803592861 801684916 799377799 796488881 793398023
852.5 793398023 790492594 787624300 784264863 780273259 776086509 771937370 767413855 762020707
868.9 762020707 755861163 749334693 742469072 734715104 725512385 714651406 701971471 687394023
885.2 687394023 671691418 657116234 645667076 635963440 623348296 603962779 579535842 559779763
901.5 559779763 554276884 557621062 551566720 529143035 503295422 482882529 463251859 441804409
917.8 441804409 421216846 403837562 390881658 382934898 380184233 382565081 389812440 401439637
934.1 401439637 416814923 435123324 455490977 477042645 498829633 519822180 539121151
948.4 539121151 556202829 570914805 583391309 594003379 603371739 612318218 621672332 631910801
$$ packed form
836.2H10864270j155556j850366k229750k035737j907945k307117k888918l090858
852.5G93398023k905429k868294l359437l991604m186750m149139m523515n393148
868.9G62020707o159544o526470o865621p753968r202719j0860979j2679935j4577448
885.2F87394023j5702605j4575184j1449158r703636j2615144j9385517k4426937j9756079
901.5E59779763n502879L344178o054342k2423685k5847613k0412893j9630670k1447450
917.8D41804409k0587563j7379284j2955904p946760k750665K380848P247359J1627197
934.1D01439637J5375286J8308401K0367653K1551668K1786988K0992547J9298971
948.4E39121151J7081678J4711976J2476504J0612070R368360Q946479R354114J0238469
$$ plain form
964.7 631910801 643065333 654876888 667047024 679252386 691008747 701862395 711634994 720483661
981 720483661 728597045 735906780 742278934 747893035 753122687 758089900 762553990 766331255 769639730
999.4 769639730 772789001 775748193 778220356 780167401 781926811 783782005 785621583 787175775
1015.7 787175775 788488388 789829016 791288614 792576849 793327212 793515861 793283224 792418838 790311873
1034.1 790311873 786312878 779539287 768730223 755577266 748395145 754714549 770433009 785316229
1050.4 785316229 794643760 799326003 801402867 802464783 803282082 803795218 803802967 803504765 803271711
1068.7 803271711 803184927 802914977 802266836 801571965 801272929 801292717 801249266 801267385 801973462 803529799
1089.1 803529799 805296600 806562781 807199836 807600796 808005035 808150411 807727337 806941330 806229472
$$ packed form
964.7F31910801J1154532J1811555J2170136J2205362J1756361J0853648R772599Q848667
981G20483661Q113384P309735O372154N614101N229652M967213M464090L777265L308475
999.4G69639730L149271K959192K472163J947045J759410J855194J839578J554192
1015.7G87175775J312613J340628J459598J288235P50363J88649k32637q64386k106965
1034.1G90311873l998995o773591j0809064j3152957p182121O319404J5718460J4883220
1050.4G85316229R327531M682243K076864J061916Q17299N13136P749k98202k33054
1068.7H03271711q6784k69950o48141o94871k99036J9788m3451J8119P06077J556337
1089.1H03529799J766801J266181O37055M00960M04239J45376m23074p86007p11858
$$ plain form
1107.5 806229472 805608332 804639578 803027868 801076293 799185038 797190130 794574320 791222215 787575245
1125.8 787575245 784013093 780370653 776217461 771493375 766574025 761616349 756136656 749446630
1142.2 749446630 741082728 730957747 720607042 713757455 712231457 712975144 712083995 708281755
1158.5 708281755 701811969 693167984 682916403 671368957 658222795 642845988 624699354 603167176
1174.8 603167176 577059150 544457316 503280580 451812357 389376074 319289565 251980871
1189.1 251980871 200768873 172717482 167203769 180795759 209678918 253972948 319051713
1203.3 319051713 403940469 494150072 572364032 630606294 670294046 696401477 713357449
1217.6 713357449 723987341 730414331 734620929 737503707 738456428 736682117 732279003 725915611
$$ packed form
1107.5H06229472o21140r68754j611710j951575j891255j994908k615810l352105l646970
1125.8G87575245l562152l642440m153192m724086m919350m957676n479693o690026
1142.2G49446630q363902j0124981j0350705o849587j525998P43687q91149l802240
1158.5G08281755o469786q643985j0251581j1547446j3146162j5376807j8146634k1532178
1174.8F03167176k6108026l2601834m1176736n1468223o2436283p0086509o7308694
1189.1B51980871n1211998k8051391n513713J3591990K8883159M4294030O5078765
1203.3C19051713Q4888756R0209603P8213960N8242262L9687752K6107431J6955972
1217.6G13357449J0629892O426990M206598K882778R52721j774311m403114o363392
$$ plain form
1233.9 725915611 717839062 707525313 694076359 676723421 655300796 630875170 605684161
1248.2 605684161 582336664 563530624 550709784 541453838 529517829 508452892 474971533
1262.5 474971533 429283679 374028444 314196289 256750196 208718792 173845112 151305422
1276.8 151305422 139188647 137759969 148469836 170481473 199537545 231917664 268247604
1291 268247604 309416443 349920988 381377548 400992036 413688123 427955121 448942035 472965807
1307.4 472965807 489892572 492670953 484601825 478231370 486099362 511677504 548280358 586725891
1323.7 586725891 621287584 649784803 672319412 690013766 704075158 715293646 724024594
1338 724024594 730159938 733137012 732004941 725137889 710319161 686731696 657432497 630171776
$$ packed form
1233.9G25915611q076549j0313749j3448954j7352938k1422625k4425626k5191009
1248.2F05684161k3347497j8806040j2820840r255946j1936009k1064937l3481359
1262.5D74971533m5687854n5255235n9832155n7446093m8031404l4873680k2539690
1276.8A51305422j2116775j428678J0709867K2011637K9056072L2380119L6329940
1291B68247604M1168839M0504545L1456560J9614488J2696087J4266998K0986914K4023772
1307.4D72965807J6926765K778381q069128o370455P867992K5578142L6602854L8445533
1323.7E86725891L4561693K8497219K2534609J7694354J4061392J1218488Q730948
1338G24024594O135344K977074j132071o867052j4818728k3587465k9299199k7260721
$$ plain form
1354.3 630171776 614928007 617071092 633706987 657744586 680884123 698594332 711588562
1368.5 711588562 720657468 726597607 730274439 731910288 731539369 729264438 725436866 720231295
1384.9 720231295 712777078 702319086 689269304 671566606 646447539 613711178 570749462
1399.1 570749462 516364396 448973894 369800270 309659302 302116454 340761304 386281669
1413.4 386281669 409828573 408660829 387060136 356571794 325929731 299991310 286248595
1427.7 286248595 288282424 305755407 334726930 377249926 429313809 474788576 514680028
1442 514680028 551870763 585671723 616538703 641154289 656967402 661898494 642760932 585409880
1458.3 585409880 520237565 478004545 486672044 549568415 617383599 667142034 703952074
$$ packed form
1354.3F30171776j5243769K143085J6635895K4037599K3139537J7710209J2994230
1368.5G11588562R068906N940139L676832J635849l70919k274931l827572n205571
1384.9G20231295p454217j0457992j3049782j7702698k5119067l2736361m2961716
1399.1E70749462n4385066o7390502p9173624o0140968p542848L8644850M5520365
1413.4C86281669K3546904j167744k1600693l0488342l0642063k5938421j3742715
1427.7B86248595K033829J7472983K8971523M2522996N2063883M5474767L9891452
1442E14680028L7190735L3800960L0866980K4615586J5813113M931092j9137562n7351052
1458.3E85409880o5172315m2233020Q667499O2896371O7815184M9758435L6810040
$$ plain form
1472.6 703952074 728224814 742343485 751713514 758849084 764940977 770166636 774698853 778898537
1488.9 778898537 783036232 786705256 789945900 793247879 796424270 799292564 801771343 804110348
1505.2 804110348 806786239 809331238 811414599 813231647 814691901 815862834 816852033 817800820 818760037
1523.6 818760037 819443345 819872379 820136786 820137560 819857895 819606662 819177985 818308055 817683458 817389905
1543.9 817389905 816872060 815947235 814627051 813029706 811127126 808802187 805278003 801513195 799521089
1562.3 799521089 797767282 795794785 793904543 792297661 791220486 790020645 788321555 786928654
1578.6 786928654 785695732 783994019 781761646 779107273 776116729 772829771 769281030 765445411
1594.9 765445411 761451483 757384658 753141463 748593330 743762255 738518000 732698083 726489186
$$ packed form
1472.6G03952074K4272740J4118671R370029P135570O091893N225659M532217M199684
1488.9G78898537M137695L669024L240644L301979L176391K868294K478779K339005
1505.2H04110348K675891K544999K083361J817048J460254J170933R89199R48787R59217
1523.6H18760037O83308M29034K64407P74k79665k51233m28677q69930o24597k93553
1543.9H17389905n17845r24825j320184j597345j902580k324939l524184l764808j992106
1562.3G99521089j753807j972497j890242j606882j077175j199841j699090j392901
1578.6G86928654j232922j701713k232373k654373k990544l286958l548741l835619
1594.9G65445411l993928m066825m243195m548133m831075n244255n819917o208897
$$ plain form
1611.3 726489186 720047951 712335467 702889323 694651723 686992824 677981079 669083953 660968304
1627.6 660968304 652960837 645374894 636819005 624871254 612603784 602004886 591187298 579535246
1643.9 579535246 565375745 550201595 538686454 524927616 504855037 489407122 476159483
1658.2 476159483 460188448 440099746 417932034 396394908 370616198 338233948 306403548
1672.4 306403548 271185637 230640545 193160370 158558190 121906057 80941342 51498756
1686.7 51498756 35193488 24668086 19238161 17489733 18111655 20383541 24623131 29520474
1703 29520474 35712607 43887723 53248778 63900888 77266745 95836446 124058977 158109471
1719.3 158109471 191229180 227182418 265553296 302172810 335833341 365977526 396949708
$$ packed form
1611.3G26489186o441235p712484r446144q237600p658899r011745q897126q115649
1627.6F60968304q007467p585943q555889j1947751j2267470j0598898j0817588j1652052
1643.9E79535246j4159501j5174150j1515141j3758838k0072579j5447915j3247639
1658.2D76159483j5971035k0088702k2167712k1537126k5778710l2382250l1830400
1672.4C06403548l5217911m0545092l7480175l4602180l6652133m0964715k9442586
1686.7E1498756j6305268j0525402n429925j748428O21922K271886M239590M897343
1703B9520474O192133Q175116R361055J0652110J3365857J8569701K8222531L4050494
1719.3A58109471L3119709L5953238L8370878L6619514L3660531L0144185L0972182
$$ plain form
1733.6 396949708 425774127 446840137 466443092 485793710 502415836 517223597 530618191
1747.9 530618191 543379486 554896772 564005911 571692526 578665853 584739923 590342879 595336258
1764.2 595336258 599528432 603556871 607375741 611168325 614696443 617809653 620986998 624523222
1780.5 624523222 628263831 632045329 635856330 639284492 642317474 644953370 646980166 648353577
1796.9 648353577 649265289 649783552 649959028 649779022 649165869 648318946 647791803 648630679 651542664
1815.2 651542664 656540275 662650824 668648124 674085796 679151475 683709264 687805533 691512764
1831.5 691512764 694598854 697358251 699953794 702289522 704251289 706085682 707984746 709774554
1847.8 709774554 711348832 712755859 714178801 715716362 717307210 718795359 720208824 721628428
$$ packed form
1733.6C96949708K8824419K1066010J9602955J9350618J6622126J4807761J3394594
1747.9E30618191J2761295J1517286R109139P686615O973327O074070N602956M993379
1764.2E95336258M192174M028439L818870L792584L528118L113210L177345L536224
1780.5F24523222L740609L781498L811001L428162L032982K635896K026796J373411
1796.9F48353577R11712N18263J75476j80006o13153q46923n27143Q38876K911985
1815.2F51542664M997611O110549N997300N437672N065679M557789M096269L707231
1831.5F91512764L086090K759397K595543K335728J961767J834393J899064J789808
1847.8G09774554J574278J407027J422942J537561J590848J488149J413465J419604
$$ plain form
1864.2 721628428 723082781 724531829 725936651 727227867 728494287 729833663 731117845 732258856
1880.5 732258856 733325005 734474778 735646009 736725330 737712026 738687873 739720523 740799844 741786182
1898.8 741786182 742638469 743514776 744480431 745457828 746318042 747099578 747881114 748617351 749181926 749592781
1919.2 749592781 749899983 750130892 750323951 750352919 750196099 749983191 749841392 749810457 749899387 750083208
1939.6 750083208 750423312 751071215 752005756 753055930 754118204 755267203 756590545 758057654 759532690
1958 759532690 760962546 762398839 763858438 765243411 766458988 767512560 768481135 769425392 770269632
1976.3 770269632 770911634 771375656 771808326 772277236 772725701 773052692 773266613 773484349 773716807 773845732
1996.7 773845732 773814678 773703396 773582697 773446023 773228228 772914946 772601366 772420883 772410095 772518575
$$ packed form
1864.2G21628428J454353J449048J404822J291216J266420J339376J284182J141011
1880.5G32258856J066149J149773J171231J079321R86696R75847J032650J079321R86338
1898.8G41786182Q52287Q76307R65655R77397Q60214P81536TP36237N64575M10855
1919.2G49592781L07202K30909J93059K8968j56820k12908j41799l0935Q8930J83821
1939.6G50083208L40104O47903R34541J050174J062274J148999J323342J467109J475036
1958G59532690J429856J436293J459599J384973J215577J053572R68575R44257Q44240
1976.3G70269632O42002M64022M32670M68910M48465L26991K13921K17736K32458J28925
1996.7G73845732l1054j11282j20699j36674k17795l13282l13580j80483j0788J08480
$$ plain form
2017.1 772518575 772745967 773156941 773774445 774529397 775296867 775964439 776559353 777182579 777841151 778444111
2037.5 778444111 778946817 779419959 779937029 780444622 780827641 781072795 781293631 781566083 781797051 781881332
2057.9 781881332 781852663 781841934 781888306 781880140 781748414 781574190 781476140 781451702 781355321 781110406 780820489
2080.3 780820489 780587137 780333936 779862165 779130399 778308690 777548969 776824415 776050746 775272131 774668932
2100.7 774668932 774343848 774140477 773862958 773557186 773397028 773357034 773268878 773086607 772937834 772971213
2121.1 772971213 773200154 773498297 773796380 774175644 774657607 775099754 775336683 775376260 775341570 775268257
2141.5 775268257 775044918 774582803 773951113 773264945 772538006 771696627 770757198 769886374 769205570 768617868
2161.9 768617868 767982483 767321706 766777635 766456246 766346633 766338408 766348362 766430438 766639292 766929924
$$ packed form
2017.1G72518575K27392M10974O17504P54952P67470O67572N94914O23226O58572O02960
2037.5G78444111N02706M73142N17070N07593L83019K45154K20836K72452K30968Q4281
2057.9G81881332k8669j0729M6372q166j31726j74224r8050k4438r6381k44915k89917
2080.3G80820489k33352k53201m71771p31766q21709p59721p24554p73669p78615o03199
2100.7G74668932l25084k03371k77519l05772j60158l9994q8156j82271j48773L3379
2121.1G72971213K28941K98143K98083L79264M81963M42147K36929L9577l4690p3313
2141.5G75268257k23339m62115o31690o86168p26939q41379r39429q70824o80804n87702
2161.9G68617868o35385o60777n44071l21389j09613q225R954Q2076K08854K90632
$$ plain form
2182.3 766929924 767246366 767626107 768127143 768727601 769305766 769740701 770027697 770204067 770232797 770059943
2202.7 770059943 769764125 769481719 769270957 769052505 768665552 768024802 767137408 765983999 764525473
2221.1 764525473 762853920 761229873 759947419 759220302 759123266 759556413 760360479 761349082 762288690
2239.4 762288690 763002813 763432622 763572037 763406336 762924314 762101114 760928512 759413600 757554710
2257.8 757554710 755360246 752872646 750181973 747417510 744730473 742297173 740322530 738978863
2274.1 738978863 738315582 738246202 738645494 739449084 740607560 741938293 743181825 744183123 744921386
2292.5 744921386 745424688 745667279 745595276 745230675 744612455 743732870 742595553 741251588 739837706
2310.8 739837706 738517642 737330675 736244738 735295594 734531403 733951926 733552158 733317256 733152747
$$ packed form
2182.3G66929924L16442L79741N01036O00458N78165M34935K86996J76370K8730j72854
2202.7G70059943k95818k82406k10762k18452l86953o40750q87394j153409j458526
2221.1G64525473j671553j624047j282454p27117r7036M33147Q04066R88603R39608
2239.4G62288690P14123M29809J39415j65701m82022q23200j172602j514912j858890
2257.8G57554710k194464k487600k690673k764463k687037k433300j974643j343667
2274.1G38978863o63281o9380L99292Q03590J158476J330733J243532J001298P38263
2292.5G44921386N03302K42591p2003l64601o18220q79585j137317j343965j413882
2310.8G39837706j320064j186967j085937r49144p64191n79477l99768k34902j64509
$$ plain form
2329.2 733152747 732912540 732509315 731854200 730960011 730020463 729124546 728154778 727073014 726139367
2347.5 726139367 725445986 724805892 724102557 723378479 722653985 721942663 721296847 720687568 720040739 719349146
2367.9 719349146 718602777 717747808 716723025 715490818 714084864 712593079 711019278 709280908 707360148
2386.3 707360148 705288053 703034997 700528443 697744906 694752455 691718757 688816547 686206520
2402.6 686206520 684118330 682751298 682127237 682048619 682188570 682266057 682165027 681835949 681203663 680248559
2423 680248559 679036498 677620173 676001072 674156725 672078788 669824183 667471290 665078402 662687957
2441.3 662687957 660364866 658185244 656160474 654213309 652238131 650195301 648079336 645830214
2457.7 645830214 643343925 640548527 637461483 634156466 630648434 626864374 622744679 618315458
$$ packed form
2329.2G33152747k40207m03225o55115q94189r39548q95917r69768j081764r33647
2347.5G26139367o93381o40094p03335p24078p24494p11322o45816o09279o46829o91593
2367.9G19349146p46369q54969j024783j232207j405954j491785j573801j738370j920760
2386.3G07360148k072095k253056k506554k783537k992451l033698k902210k610027
2402.6F86206520k088190j367032o24061p8618J39951P7487j01030l29078o32286r55104
2423F80248559j212061j416325j619101j844347k077937k254605k352893k392888k390445
2441.3F62687957k323091k179622k024770j947165j975178k042830k115965k249122
2457.7F45830214k486289k795398l087044l305017l508032l784060m119695m429221
$$ plain form
2474 618315458 613617778 608625948 603352129 597949028 592680275 587888181 583932102 581002355 579050243
2492.3 579050243 577840209 576984882 576051414 574669242 572667241 570101798 567134559 564006627 561041892
2510.7 561041892 558565021 556811333 555792034 555248499 554853201 554345787 553510189 552157819 550115049
2529 550115049 547280550 543658435 539295256 534276545 528746009 522917628 517098665 511629224 506738901
2547.4 506738901 502435982 498613685 495198399 492137760 489420563 487112045 485319912 484114587
2563.7 484114587 483488083 483378828 483650297 484079242 484422207 484447479 483943820 482798666 481005490
2582.1 481005490 478626877 475813776 472798526 469895869 467485458 465921879 465408534 465924948 467250258
2600.4 467250258 469035894 470863521 472346544 473234653 473452330 473087192 472272992 471094191 469566315
$$ packed form
2474F18315458m697680m991830n273819n403101n268753m792094l956079k929747j952112
2492.3E79050243j210034q55327r33468j382172k002001k565443k967239l127932k964735
2510.7E61041892k476871j753688j019299n43535l95298n07414q35598j352370k042770
2529E50115049k834499l622115m363179n018711n530536n828381n818963n469441m890323
2547.4E06738901m302919l822297l415286l060639k717197k308518j792133j205325
2563.7D84114587o26504j09255K71469M28945L42965K5272n03659j145154j793176
2582.1D81005490k378613k813101l015250k902657k410411j563579n13345N16414J325310
2600.4D67250258J785636J827627J483023Q88109K17677l65138q14200j178801j527876
$$ plain form
2618.8 469566315 467679739 465465218 462980181 460295588 457486898 454621017 451808780 449177444
2635.1 449177444 446785361 444640845 442750305 441118866 439695090 438367248 437031418 435666174
2651.4 435666174 434281528 432827860 431280643 429701000 428185016 426826477 425707728 424886882
2667.7 424886882 424448907 424544990 425347656 427039713 429757327 433449656 437884510 442766905 447722912
2686.1 447722912 452296168 456119120 459070057 461220682 462700218 463646263 464212328 464510232 464538634
2704.5 464538634 464264959 463693202 462841421 461766809 460579276 459363282 458195150 457188994 456451803
2722.8 456451803 456071109 456029415 456222504 456531525 456784248 456757188 456211299 455026209 453292191 451226711
2743.2 451226711 449060321 446944982 445023447 443555146 442797780 442851633 443665475 445129544 447090954
$$ packed form
2618.8D69566315j886576k214521k485037k684593k808690k865881k812237k631336
2635.1D49177444k392083k144516j890540j631439j423776j327842j335830j365244
2651.4D35666174j384646j453668j547217j579643j515984j358539j118749q20846
2667.7D24886882m37975R6083Q02666J692057K717614L692329M434854M882395M956007
2686.1D47722912M573256L822952K950937K150625J479536R46045N66065K97904K8402
2704.5D64538634k73675n71757q51781j074612j187533j215994j168132j006156p37191
2722.8D56451803l80694m1694J93089L09021K52723k7060n45889j185090j734018k065480
2743.2D51226711k166390k115339j921535j468301p57366N3853Q13842J464069J961410
$$ plain form
2761.6 447090954 449295610 451442003 453306913 454800397 455942184 456787169 457329601 457595021 457699776
2779.9 457699776 457681447 457526028 457283348 456936836 456343800 455410540 454140306 452521771 450482190
2798.3 450482190 448007286 445356786 442953706 441074938 439776331 438912749 438167125 437200189 435816526
2816.6 435816526 433999866 431831121 429401457 426778644 424018979 421180367 418288827 415367573
2832.9 415367573 412470222 409609586 406746358 403851748 400943995 398028761 395048380 391962528
2849.3 391962528 388806462 385657042 382559359 379472524 376280695 372793138 368754745 363941699
2865.6 363941699 358203232 351476938 343828410 335629046 328138769 323546916 323418140 327086031
2881.9 327086031 332172573 336504638 339192837 340342909 340371370 339604288 338171154 336132765 333647609
$$ packed form
2761.6D47090954K204656K146393J864910J493484J141787Q44985N42432K65420J04755
2779.9D57699776j8329j55419k42680l46512n93036r33260j270234j618535k039581
2798.3D50482190k474904k650500k403080j878768j298607q63582p45624r66936j383663
2816.6D35816526j816660k168745k429664k622813k759665k838612k891540k921254
2832.9D15367573k897351k860636k863228k894610k907753k915234k980381l085852
2849.3C91962528l156066l149420l097683l086835l191829l487557m038393m813046
2865.6C63941699n738467o726294p648528q199364p490277m591853j28776L667891
2881.9C27086031N086542M332065K688199J150072K8461p67082j433134k038389k485156
$$ plain form
2900.2 333647609 330851376 327716798 324179441 320221156 315723211 310398370 304185778 298215926
2916.6 298215926 295059234 296375334 300609410 304757327 307423323 308843821 309377462 309008747 307526439
2934.9 307526439 304619014 299889505 293032557 283967257 272919089 260774404 249707088 242687836
2951.2 242687836 240661263 240802243 238919765 233798921 229444459 232128978 244372353 262706190
2967.6 262706190 281384826 296819448 308251828 316210926 321602881 325189441 327318311 328353584
2983.9 328353584 328818589 329131156 329568684 330140769 330698550 331360042 332173258 332931995 333568335 333997101
3004.3 333997101 334106892 333996475 333699942 333012044 331780374 330171049 328521639 327028126 325797230
3022.6 325797230 324804366 323917359 323247999 322913885 322804213 322689086 322565228 322865009 323674530 324554801
$$ packed form
2900.2C33647609k796233l134578l537357l958285m497945n324841o212592n969852
2916.6B98215926l156692J316100M234076M147917K665996J420498N33641l68715j482308
2934.9C07526439k907425m729509o856948r065300j1048168j2144685j1067316p019252
2951.2B42687836k026573J40980j882478n120844m354462K684519J2243375J8333837
2967.6B62706190J8678636J5434622J1432380P959098N391955L586560K128870J035273
2983.9C28353584M65005L12567M37528N72085N57781O61492Q13216P58737O36340M28766
3004.3C33997101J09791j10417k96533o87898j231670j609325j649410j493513j230896
3022.6C25797230r92864q87007o69360l34114j09672j15127j23858K99781Q09521Q80271
$$ plain form
3043 324554801 325323820 326205701 327438742 328954786 330592930 332374752 334285676 336327225 338619977
3061.4 338619977 341196179 343922347 346470863 348621815 350534976 352429956 354363024 356151760
3077.7 356151760 357463956 358304739 358925730 359416902 359945595 360617369 361249387 361910909 362937987
3096 362937987 364404231 366033614 367625028 369383276 371561468 373990119 376320362 378701180 381484717
3114.4 381484717 384461969 387254328 389765859 392095983 394537687 397304058 400289178 403267324
3130.7 403267324 406203657 409248054 412475467 415688574 418595284 421299160 424084336 426977456
3147 426977456 429967135 432993084 435727924 438034803 440221369 442491740 444785535 447046757 449268311
3165.4 449268311 451428831 453513086 455556989 457608372 459688336 461785048 463870019 465915114
$$ packed form
3043C24554801P69019Q81881J233041J516044J638144J781822J910924K041549K292752
3061.4C38619977K576202K726168K548516K150952J913161J894980J933068J788736
3077.7C56151760J312196Q40783O20991M91172N28693O71774O32018O61522J027078
3096C62937987J466244J629383J591414J758248K178192K428651K330243K380818K783537
3114.4C81484717K977252K792359K511531K330124K441704K766371K985120K978146
3130.7D03267324K936333L044397L227413L213107K906710K703876K785176K893120
3147D26977456K989679L025949K734840K306879K186566K270371K293795K261222K221554
3165.4D49268311K160520K084255K043903K051383K079964K096712K084971K045095
$$ plain form
3181.7 465915114 467921495 469926924 471942216 473931700 475898832 477864504 479840845 481865168
3198 481865168 483952165 486093462 488270998 490455747 492620558 494789690 497023880 499310702 501603961
3216.4 501603961 503888607 506155133 508417428 510688663 512953818 515238285 517622173 520045400
3232.7 520045400 522258759 524259448 526319623 528518856 530803800 533200979 535603344 537838578
3249 537838578 540004432 542291582 544687927 547058940 549375951 551698565 554048657 556426048 558854043
3267.4 558854043 561316192 563649535 565765798 567779183 569788992 571808338 573799253 575717211
3283.7 575717211 577572703 579429388 581312418 583136678 584827065 586396158 587859988 589239359
3300 589239359 590577841 591862977 593000948 593923450 594660044 595272720 595781147 596142173 596301734
$$ packed form
3181.7D65915114K006381K005429K015292J989484J967132J965672J976341K024323
3198D81865168K086997K141297K177536K184749K164811K169132K234190K286822K293259
3216.4E01603961K284646K266526K262295K271235K265155K284467K383888K423227
3232.7E20045400K213359K000689K060175K199233K284944K397179K402365K235234
3249E37838578K165854K287150K396345K371013K317011K322614K350092K377391K427995
3267.4E58854043K462149K333343K116263K013385K009809K019346J990915J917958
3283.7E75717211J855492J856685J883030J824260J690387J569093J463830J379371
3300E89239359J338482J285136J137971R22502P36594O12676N08427L61026J59561
$$ plain form
3318.4 596301734 596240520 595973551 595568538 595062137 594431579 593726277 593077958 592605054 592355967 592318058
3338.8 592318058 592451572 592734277 593123734 593494892 593753636 593977749 594270051 594518721 594545364 594345093
3359.1 594345093 594046354 593708932 593221247 592553020 591945827 591537893 591154635 590652823 590041518 589398444
3379.5 589398444 588856518 588418543 587942183 587339878 586633027 586038709 585744858 585538805 585111618 584570527
3399.9 584570527 584268391 584199011 584084988 583862364 583630502 583486795 583510518 583609283 583626211 583658159
3420.3 583658159 583851457 584126234 584359050 584589303 584939301 585419476 585976422 586684883 587564230 588511646
3440.7 588511646 589496970 590513766 591601610 592802286 594064116 595349729 596672952 598020315
3457 598020315 599400997 600873470 602427244 603963852 605446756 606961966 608570635 610230982 611835718
$$ packed form
3318.4E96301734o1214k66969m05013n06401o30558p05302o48319m72904k49087l7909
3338.8E92318058J33514K82705L89457L71158K58744K24113K92302K48670K6643k00271
3359.1E94345093k98739l37422m87685o68227o07193m07934l83258n01812o11305o43074
3379.5E89398444n41926m37975m76360o02305p06851n94318k93851k06053m27187n41091
3399.9E84570527l02136o9380j14023k22624k31862j43707K3723R8765J6928L1948
3420.3E83658159J93298K74777K32816K30253L49998M80175N56946P08461Q79347R47416
3440.7E88511646R85324J016796J087844J200676J261830J285613J323223J347363
3457E98020315J380682J472473J553774J536608J482904J515210J608669J660347J604736
$$ plain form
3475.4 611835718 613366902 614910901 616512060 618150949 619816363 621486247 623100758 624672830
3491.7 624672830 626282156 627946138 629593670 631205201 632829845 634478390 636122286 637788117
3508 637788117 639517128 641315222 643132210 644875884 646565616 648300171 650136054 651984155 653772473
3526.4 653772473 655602813 657514632 659436107 661376357 663337231 665261030 667225420 669254839
3542.7 669254839 671203673 673044622 674874485 676752865 678775787 680888057 682908893 684866130
3559 684866130 686868191 688850343 690808833 693008900 695374310 697591186 699759841 702044308 704391539
3577.4 704391539 706775606 709197998 711562216 713909626 716452718 719069242 721484303 723908663
3593.7 723908663 726497412 729057491 731529593 734021425 736460447 738700569 740881562 743120730
$$ packed form
3475.4F11835718J531184J543999J601159J638889J665414J669884J614511J572072
3491.7F24672830J609326J663982J647532J611531J624644J648545J643896J665831
3508F37788117J729011J798094J816988J743674J689732J734555J835883J848101J788318
3526.4F53772473J830340J911819J921475J940250J960874J923799J964390K029419
3542.7F69254839J948834J840949J829863J878380K022922K112270K020836J957237
3559F84866130K002061J982152J958490K200067K365410K216876K168655K284467K347231
3577.4G04391539K384067K422392K364218K347410K543092K616524K415061K424360
3593.7G23908663K588749K560079K472102K491832K439022K240122K180993K239168
$$ plain form
3610 743120730 745394051 747695744 749811113 751830101 754076600 756290376 758173227 759679675 761178493
3628.4 761178493 763046801 764822245 766387343 767835200 769155800 770447433 771721125 772750556
3644.7 772750556 773427427 774245024 775565028 776761591 777611136 778497219 779413640 780126572 780717075
3663 780717075 781201124 781386077 781467855 781866431 782188356 782359660 782828808 783415914 784026504 784655631
3683.4 784655631 785142303 785510540 785963655 786588192 787256896 787793458 788092494 788242996 788524568 788966596
3703.8 788966596 789234459 789207220 789067090 789223254 789724529 790112317 790232837 790261686 790359795 790492892
3724.2 790492892 790674031 790852904 790831566 790695786 790694594 790899932 791213989 791298509 790954828 790692568
3744.6 790692568 790826082 790756822 790660083 791084349 791554630 791608214 791526496 791695774 791915596 791959226
$$ packed form
3610G43120730K273321K301693K115369K018988K246499K213776J882851J506448J498818
3628.4G61178493J868308J775444J565098J447857J320600J291633J273692J029431
3644.7G72750556O76871Q17597J320004J196563Q49545Q86083R16421P12932N90503
3663G80717075M84049J84953Q1778L98576L21925J71304M69148N87106O10590O29127
3683.4G84655631M86672L68237M53115O24537O68704N36562K99036J50502K81572M42028
3703.8G88966596K67863k7239j40130J56164N01275L87788J20520K8849R8109J33097
3724.2G90492892J81139J78873k1338j35780j192K05338L14057Q4520l43681k62260
3744.6G90692568J33514o9260r6739M24266M70281N3584q1718J69278K19822M3630
$$ plain form
3765 791959226 791833043 791724443 791910887 792180240 792241096 792182028 792197287 792306244 792374909 792405367 792447090
3787.5 792447090 792534113 792662263 792665005 792518198 792306304 792000055 791939616 792130530 792100072 792128503 792354286
3809.9 792354286 792413831 792225003 792017877 791799963 791497111 791538298 791769862 791807771 791805387 791835010 791830957
3832.3 791830957 791726887 791474223 791262209 791297019 791474283 791665137 791739285 791599274 791149855 790551543
3852.7 790551543 790484726 790751040 790860713 790867627 790939033 791178823 791322410 791275978 791392148 791642427
3873.1 791642427 791854382 791925132 791859210 791912496 791961789 791962981 792078137 792114377 792183757 792430103 792504489
3895.5 792504489 792273521 791957200 791776419 791866124 792195380 792493403 792641044 792693138 792601228 792377651
3915.9 792377651 792257667 792342484 792409718 792355239 792292714 792277813 792332888 792487323 792653382 792733788 792762339
$$ packed form
3765G91959226j26183j08600J86444K69353O0856n9068J5259J08957O8665L0458M1723
3787.5G92447090Q7023J28150K742j46807k11894l06249o0439J90914l0458K8431K25783
3809.9G92354286N9545j88828k07126k17914l02852M1187K31564L7909k384K9623m053
3832.3G91830957j04070k52664k12014L4810J77264J90854P4148j40011m49419n98312
3852.7G90551543o6817K66314J09673O914P1406K39790J43587m6432J16170K50279
3873.1G91642427K11955P0750o5922N3286M9293J192J15156L6240O9380K46346P4386
3895.5G92504489k30968l16321j80781Q9705L29256K98023J47641N2094r1910k23577
3915.9G92377651j19984Q4817O7234n4479o2525j4901N5075J54435J66059Q0406K8551
$$ plain form
3938.4 792762339 792760313 792740643 792715549 792625546 792553782 792589128 792586148 792465866 792307973 792161167 792066514
3960.8 792066514 792054951 792070508 792107761 792248189 792448461 792547464 792531371 792491972 792454064 792458475 792484760
3983.2 792484760 792395234 792177856 791953266 791731179 791445017 791086733 790646195
3997.5 790646195
$$ packed form
3938.4G92762339k026j9670k5094r0003p1764L5346k980j20282j57893j46806r4653
3960.8G92066514j1563J5557L7253J40428K00272R9003j6093l9399l7908M411K6285
3983.2G92484760q9526k17378k24590k22087k86162l58284m40538
3997.5G90646195
##END=$$ End of the data block
