##TITLE=NEUVIC S-60 $$ Begin of the data block
##JCAMP-DX=5.00 $$ ACD/SpecManager v 10.08
##SPECTROMETER/DATA SYSTEM=Alpha
##DATE=12 Nov 2015 10:23:56
##DATA TYPE=INFRARED SPECTRUM
##DATA CLASS=XYDATA
##ORIGIN=
##OWNER=
##NPOINTS=1667
##FIRSTX=599.64648438
##LASTX=3997.64306641
##MAXX=3997.64306641
##MINX=599.64648438
##MAXY=0.85116041
##MINY=0.03504501
##XFACTOR=1.0000000000
##YFACTOR=1.000000000000000e-9
##FIRSTY=0.65318596
##DELTAX=2.03961372
##XUNITS=1/CM
##YUNITS=ARBITRARY UNITS
##XYDATA=(X++(Y..Y))
599.6F53185964l8564504k6740729o644369J4629722L0286729L7076652L5311640K7831435
616G26372540J7798543P775247p10130p257104j0371744q769095m204869P12335M436433
634.3G25782156O299198O466984N814255M594922L129899K137542J438439J052856
650.6G56716251J194597J847982K949834M269659N560220O314099N881607P034004
667G91768253R877920P064700M324615L480196K656043K059102J651227J432419J334846
685.3H25649321J275897J284182J262903J342893J389682J041711Q32796Q49843O30081
703.7H35559309L63826K95937K49565K51114M10021M55439L84629L39269K96056K50221
724.1H38855386O7472j25646P9333L89874L04401k4855k65062l74674l67582j44482
$$ y = [653185964, 614621460, 587880731, 581236362, 595866084, 626152813, 663229465, 698541105, 726372540, 744171083, 751946330, 751236200, 743979096, 733607352, 724838257, 720633388, 721345723, 725782156, 732081354, 738548338, 744362593, 748957515, 752087414, 754224956, 755663395, 756716251, 757910848, 759758830, 762708664, 766978323, 772538543, 778852642, 784734249, 791768253, 801646173, 808710873, 813035488, 816515684, 819171727, 821230829, 822882056, 824314475, 825649321, 826925218, 828209400, 829472303, 830815196, 832204878, 833246589, 834079385, 834929228, 835559309, 835923135, 836219072, 836468637, 836719751, 837129772, 837585211, 837969840, 838309109, 838605165, 838855386, 838922858, 838797212, 838876545, 839266419, 839570820, 839545965, 839280903, 838906229, 838538647, 838394165]
744.5H38394165k1219j82688k86222l37481n13316o00576n47886n50866o79433q44956
764.9H33829522r23514j021683j206696j362265j584708k202273l359020n007982p323444
783.2H09837937j0606169j4285803j6640961j5857697j1337161m624724J539409N595267
799.5G43620098P640302Q172273P887722P399976O730616N794704M688978L587842
815.8G95522511K703607K124250J832604J679004J412689R97067N37574J68622J311
834.2H06979239q6784k39194m02629m36247m24087n44726o70434o20961n34415o67036
854.6H02352726q94844r86517j200437j854837k871096m064322n348205p076919r676516
873G68379033j2274444j2635947r123266l044664K311706N146563N770385N026937
$$ y = [838394165, 838372946, 838190258, 837904036, 837566555, 837053239, 836452663, 835904777, 835353911, 834674478, 833829522, 832906008, 831884325, 830677629, 829315364, 827730656, 825528383, 822169363, 817161381, 809837937, 799231768, 784945965, 768305004, 752447307, 741110146, 736485422, 738024831, 743620098, 751260400, 759432673, 767320395, 774720371, 781450987, 787245691, 791934669, 795522511, 798226118, 800350368, 802182972, 803861976, 805274665, 806271732, 806809306, 806977928, 806979239, 806892455, 806653261, 806250632, 805814385, 805390298, 804845572, 804175138, 803554177, 803019762, 802352726, 801457882, 800471365, 799270928, 797416091, 794544995, 790480673, 785132468, 778055549, 768379033, 756104589, 743468642, 734345376, 731300712, 733612418, 738758981, 744529366, 749556303]
889.3G49556303L645003K119064N94497q56578k020061k842486l554881m274547m970253
907.6G37396061n617141o140173o689667p389784p990063q536398r489954j0967314
923.9F74575567j2852549j5148461j7489374j9208252k0092428k0398080k0624876
938.2E48761547k1089554k0963013j8187255j0479659K427876J6937018K7396380L0234993
954.5E55038333K6472211K0180940J4794291J1475205R746253Q539021P111490N399227
970.9F58756971L556848J733959j9908j714588l243029m611730n828202o811678p620752
989.2F34197891q343578r248435j0774195j3018310j5921832j9545495k3878574k8837085
1005.5E04630387l4364164l9958984m4271022m5682251m2876065l5367459k4203181
$$ y = [749556303, 753201306, 755320370, 755914867, 755058289, 753038228, 750195742, 746640861, 742366314, 737396061, 731778920, 725638747, 718949080, 711559296, 703569233, 695032835, 685542881, 674575567, 661723018, 646574557, 629085183, 609876931, 589784503, 569386423, 548761547, 527671993, 506708980, 488521725, 478042066, 480469942, 497406960, 524803340, 555038333, 581510544, 601691484, 616485775, 627960980, 637707233, 646246254, 653357744, 658756971, 662313819, 664047778, 664027870, 662313282, 659070253, 654458523, 648630321, 641818643, 634197891, 625854313, 616605878, 605831683, 592813373, 576891541, 557346046, 533467472, 504630387, 470266223, 430307239, 386036217, 340353966, 297477901, 262110442, 237907261]
1019.8B37907261j1565656J80185R229973J4766708J6795695J6031712J3625682J0404646
1036.1C07376206O885439L792137J935452J947552L986687P650941J2094945J6208231
1052.4C61877590J8848926J9127906J6798228J2631297Q127540M474342J957208J30594
1068.8D43973631j294345k168238k520055k536326k253741j713127j065731m18544
1085.1D30003524J13785N31256R20654J205235J319677J286834J073212P13438K89112
1103.4D37456727k58952r75252j770496k513945l169328l529280l378392k753287j637936
1121.8D17469859O4701K534777N835354R761542J3927490J7848283K0939886K2779853
1138.1E11161745K3616671K4044931K4342537K4518549K4192334K2547841J9296527
$$ y = [237907261, 226341605, 226521790, 235751763, 250518471, 267314166, 283345878, 296971560, 307376206, 314261645, 318053782, 319989234, 321936786, 325923473, 333574414, 345669359, 361877590, 380726516, 399854422, 416652650, 429283947, 437411487, 441885829, 443843037, 443973631, 442679286, 440511048, 437990993, 435454667, 433200926, 431487799, 430422068, 430003524, 430117309, 430648565, 431569219, 432774454, 434094131, 435380965, 436454177, 437167615, 437456727, 437197775, 436222523, 434452027, 431938082, 428768754, 425239474, 421861082, 419107795, 417469859, 417534560, 420069337, 425904691, 435666233, 449593723, 467442006, 488381892, 511161745, 534778416, 558823347, 583165884, 607684433, 631876767, 654424608, 673721135]
1152.4F73721135J5070498J0724365O807447L593445J059949r14216k470970l866673
1168.7G03724980n309283o842435q382976r820819j1032104j1955977j2475669j2588382
1185F25317335j2610495j2912214j3678550j4881373j6427040j8241227k0288646k2490740
1201.3D93787050k4857253k7487039l0407816l3512742l6581754l9071292m0246815
1215.6B61622339l9722576l7270367l3031673k7774006k2289224j7105661j2630239
1229.9G1798593r074062o300252m161664k534106j214284o7655R36318J876499K846513
1248.2E4105900L726822M482895N203318O038427P196672Q923166J1269808J4243468
1264.6A15190476J8001601K2532076K7715191L2966703L7576616M1285902M3650896
$$ y = [673721135, 688791633, 699515998, 706323445, 709916890, 710976839, 710062623, 707591653, 703724980, 698415697, 691573262, 683190286, 673369467, 662337363, 650381386, 637905717, 625317335, 612706840, 599794626, 586116076, 571234703, 554807663, 536566436, 516277790, 493787050, 468929797, 441442758, 411034942, 377522200, 340940446, 301869154, 261622339, 221899763, 184629396, 151597723, 123823717, 101534493, 84428832, 71798593, 62724531, 56424279, 52262615, 49728509, 48514225, 48446570, 49382888, 51259387, 54105900, 57832722, 62315617, 67518935, 73557362, 80754034, 89677200, 100947008, 115190476, 133192077, 155724153, 183439344, 216406047, 253982663, 295268565, 338919461]
1278.8C38919461M4112742M2652011L9718210L5951615L1564653K6920080K2653460
1293.1E82492232J9021571J6059995J3694942J1867523J0613024R884358R290158Q467973
1309.4F81391776P455706O558120N717993N119205M822433M541099M223943L780961
1325.8G23611236L090858K039671N38766j642286m274190p380247j0861456j4145613
1342.1F90976739j8172920k3788452l0270934l6950886m3260336m8824042n1392854
1356.4D38316315m8568785m3688953m0428012l5392493k9546798k6183262k0335406
1370.6A94172606j0486335K875254J8149927L2707498M5237153N1801294N2711726
1384.9C87169123N2919596M6675325L3414512K5729120K2781432J8534720J5185952
$$ y = [338919461, 383032203, 425684214, 465402424, 501354039, 532918692, 559838772, 582492232, 601513803, 617573798, 631268740, 643136263, 653749287, 663633645, 672923803, 681391776, 688847482, 695405602, 701123595, 706242800, 711065233, 715606332, 719830275, 723611236, 726702094, 728741765, 729280531, 727638245, 723364055, 715983808, 705122352, 690976739, 672803819, 649015367, 618744433, 581793547, 538533211, 489709169, 438316315, 389747530, 346058577, 305630565, 270238072, 240691274, 214508012, 194172606, 183686271, 186561525, 204711452, 237418950, 282656103, 334457397, 387169123, 440088719, 486764044, 520178556, 545907676, 568689108, 587223828, 602409780]
1399.2F02409780J2758732J0629713R766341P183492L013074j382947n882799r932995
1415.5F28562391j4785886j9879222j9195378j7977833j7855347j5452444j2622655
1429.8E10793626q249581k875238L224760R849966J2838065J6052723J9411862K2039414
1446.1E83085597K4917960K3914098J9733131J6521335J8932223K2296965J4721394
1460.4G24122703R820700J0092675R280980N905211M007459M493355M592538L437102
1476.7G75752723K525568J990199J737714J242519J025199J845062K802015J929223
1493G90850222R29117J085520J431167Q55565j54733n43297O84321J661718Q50678
1511.4G97650278j24693o51777m03881l8326M29571O09278M40956M79936o5207n50688
$$ y = [602409780, 615168512, 625798225, 635564566, 642748058, 645761132, 644378185, 638495386, 628562391, 613776505, 593897283, 574701905, 556724072, 538868725, 523416281, 510793626, 502544045, 499668807, 502893567, 512743533, 525581598, 541634321, 561046183, 583085597, 608003557, 631917655, 651650786, 668172121, 687104344, 709401309, 724122703, 733943403, 744036078, 753317058, 759222269, 763229728, 767723083, 772315621, 775752723, 778278291, 780268490, 782006204, 783248723, 784273922, 786118984, 788920999, 790850222, 791779339, 792864859, 794296026, 795151591, 794996858, 794453561, 795137882, 796799600, 797650278, 797525585, 796873808, 796469927, 796431601, 796861172, 797470450, 797911406, 798391342, 798326135, 797775447]
1531.8G97775447l84628n58794j173019q00968N11706P99775M81964q0765m45008o65426
1552.2G95460284j077831j523852o54757J218795N56410k45452m90546k98739P3552
1570.5G93017864k25603k97845M75765N42402R7751j20043k81453m73321o82831r17256
1590.9G91135430j082539j221895j457274j760841k127826k418757k730011l083349
1607.2G75252938l440320l698766m021347m587054n095959m560769m367828m947543
1623.5G40533352m785955m473507m447937m347146m568934n079449m112899l174782
1639.9G05542743l525317l939867l841102k629995j409829l95059J062631P92802L06904
1658.2F91963911K82884N60164L37899o18696j428664j950622k405107l400027m828930
$$ y = [797775447, 797390819, 796832025, 795659006, 794858038, 795369744, 796169519, 796651483, 796570718, 796125710, 795460284, 794382453, 792858601, 792203844, 793422639, 793979049, 793733597, 793243051, 792944312, 793017864, 792792261, 792494416, 792970181, 793512583, 793610334, 793490291, 793208838, 792735517, 792052686, 791135430, 790052891, 788830996, 787373722, 785612881, 783485055, 781066298, 778336287, 775252938, 771812618, 768113852, 764092505, 759505451, 754409492, 749848723, 745480895, 740533352, 735747397, 731273890, 726825953, 722478807, 717909873, 712830424, 708717525, 705542743, 702017426, 698077559, 694236457, 691606462, 690196633, 689801574, 690864205, 691657007, 691963911, 692246795, 692806959, 693144858, 692526162, 691097498, 689146876, 686741769, 683341742, 678512812]
1676.6F78512812n765915o798744r085656j3367951j3194263j2779474j4905810j4714241
1692.9E87900758j6357661j8096148j8035114k2340656k2585481k6674807l4845144
1707.2D28965747l6059558l5932183l6347896l8439155m4354930m0580020l1145766
1721.5A66106239l0150697k9730394k4455674j8966884j3188853r052396m568815r47521
1737.8C5045005J327634L855217O772098J1500451K0716813M1206032O4856924P6188743
1754.1B61468917Q9375824R3886316P8066766O4992547M7073960L1147182K4576128
1768.4F90587640J9954681J7491758J3663411R158910P236838O534994N535185M857361
1784.7G75020778L901124K812028K492726L032505K463878J546085J241624J163542
$$ y = [678512812, 672746897, 665948153, 656862497, 643494546, 630300283, 617520809, 602614999, 587900758, 571543097, 553446949, 535411835, 513071179, 490485698, 463810891, 428965747, 392906189, 356974006, 320626110, 282186955, 237832025, 197252005, 166106239, 135955542, 106225148, 81769474, 62802590, 49613737, 40561341, 35992526, 35045005, 36372639, 40227856, 46999954, 58500405, 79217218, 120423250, 185280174, 261468917, 350844741, 444731057, 522797823, 587790370, 634864330, 666011512, 690587640, 710542321, 728034079, 741697490, 750856400, 758093238, 764628232, 770163417, 775020778, 778921902, 781733930, 784226656, 787259161, 789723039, 791269124, 792510748, 793674290]
1801G93674290J175702P60197L49820P0870K21491K31683J67549K31027M15981M48644
1821.4G97747254N23746R60708J228392J848698K241611J924575J680791J770973J501262
1839.8H11428010J109064J360655J701415J535534J194418R56058P73728O70433N24283
1858.1H21253598N40137N29170K77698P8321N54263J285732J197815R75132R28700
1876.5H27620566J038313J114428J074493R40978Q07226P82728Q13604P42375O68765
1894.8H35603476O80387N43356M43458L80755K94745J47521Q5950Q1777o0677j89126
1915.2H38011622j59919j11937j44840P6414L19361L71874L42309L18170K97844K42293
1935.6H39563191J10984j06991q4638J66297K83420K15113J43588P9929Q1063J79887
$$ y = [793674290, 794849992, 795610189, 795960009, 796030879, 796252370, 796484053, 796651602, 796882629, 797298610, 797747254, 798271000, 799231708, 800460100, 802308798, 804550409, 806474984, 808155775, 809926748, 811428010, 812537074, 813897729, 815599144, 817134678, 818329096, 819285154, 820058882, 820729315, 821253598, 821793735, 822322905, 822600603, 822678924, 823233187, 824518919, 825716734, 826691866, 827620566, 828658879, 829773307, 830847800, 831788778, 832596004, 833378732, 834192336, 834934711, 835603476, 836283863, 836827219, 837270677, 837651432, 837946177, 838093698, 838179648, 838261425, 838200748, 838011622, 837851703, 837739766, 837594926, 837671340, 837990701, 838362575, 838704884, 839023054, 839320898, 839563191, 839674175, 839567184, 839482546, 839648843, 839932263, 840147376, 840290964, 840370893, 840451956, 840631843]
1956H40631843L09467L20613J49846J3888O6877K45690K60294J05619j1802k9444o1214
1978.5H42001677q5235o2406j20461k51234m27603m90904l84927l94106n77807o91653
1998.8H38515341o98864o85454o74545o77646o46412n91814o06537o83189o20484m26591
2019.2H32203805l59475l59953k52664q9287M4584R8645J02342J57952K51055K60174
2039.6H32057178K05100K11298L24130M12762L37899K26259K16246K43843K42948K61962
2060H34739625K98620L25978L89456M24445L69966L15547K59161K31147K72631K35796
2080.4H37862372J45317J65998K06948J09792N5730R5785L3319j01865j63615j68979
2100.8H38240802k45273l66568l82722l31461m37975n86808n75364n01632m83573n10215
$$ y = [840631843, 840941310, 841261923, 841411769, 841425657, 841492534, 841738224, 841998518, 842104137, 842092335, 842062891, 842001677, 841916442, 841854036, 841733575, 841482341, 841054738, 840563834, 840178907, 839784801, 839206994, 838515341, 837816477, 837131023, 836456478, 835778832, 835132420, 834540606, 833934069, 833250880, 832630396, 832203805, 831844330, 831484377, 831231713, 831142426, 831187010, 831285655, 831387997, 831545949, 831797004, 832057178, 832262278, 832473576, 832797706, 833210468, 833548367, 833774626, 833990872, 834234715, 834477663, 834739625, 835038245, 835364223, 835753679, 836178124, 836548090, 836863637, 837122798, 837353945, 837626576, 837862372, 838007689, 838173687, 838380635, 838490427, 838546157, 838641942, 838675261, 838573396, 838409781, 838240802, 837995529, 837628961, 837246239, 836914778, 836476803, 835889995, 835314631, 834812999, 834329426, 833819211]
2121.2H33819211m92812m30762l95537m47392n22077n21899m61697m12524l84450l55303
2141.6H29394758k97904k49207k40386k45690k62737j77741n8830o5148n8592Q1659
2162H27820182K25901K67745K59757L12805L97980M24564M83990N68091O02127N99265
2182.4H31962407N85556N54502N12182N06163N29587N41628N00619M36783M01437M13239
2202.8H36944103M17590L85702L71516L45766K75612K51889L01183L16798K66850J99259
2223.2H40076268J40607J18613J89007K69353K68877K75671L63052M68373N42343O15537
2243.6H43327701O30021N70536N33461N90086O66917O37471N54562N30422N64217N98431
2264H49203825N56409M39227L59595L09169K25425O6757k14338m99845o63340q17180
$$ y = [833819211, 833326399, 832895637, 832500100, 832052708, 831530631, 831008732, 830547035, 830134511, 829750061, 829394758, 829096854, 828847647, 828607261, 828361571, 828098834, 827921093, 827862263, 827797115, 827738523, 827820182, 828046083, 828313828, 828573585, 828886390, 829284370, 829708934, 830192924, 830761015, 831363142, 831962407, 832547963, 833102465, 833614647, 834120810, 834650397, 835192025, 835692644, 836129427, 836530864, 836944103, 837361693, 837747395, 838118911, 838464677, 838740289, 838992178, 839293361, 839610159, 839877009, 840076268, 840216875, 840335488, 840524495, 840793848, 841062725, 841338396, 841701448, 842169821, 842712164, 843327701, 843957722, 844528258, 845061719, 845651805, 846318722, 846956193, 847510755, 848041177, 848605394, 849203825, 849760234, 850199461, 850559056, 850868225, 851093650, 851160407, 850946069, 850446224, 849782884, 848965704]
2284.4H48965704j052022j196444j237332j349211j396239j307964j318693j393915
2300.7H38713884j309394j146317j054525r82285q62956o51181m19795l20316l28302
2319.1H31638813k41339k980J25885J17361J92046K82467J91390Q2314J37866J23322
2339.5H32647145n365K07246K60949l67284o36876l10182K9385J72734K94030K57134
2359.9H32548916L2544Q584P0989Q464l338q3626j41143m2737K38k2172J2815J7106
2384.3H32406640j00195k09451k73407l55243l68953k99573k94924l15010k31147j30475
2404.7H29828262l1531O8009J04070J15037J46925J93894K54095L07441K87652K06232
2425.1H31480086J03116J5318o5148j77502k92361l32594l23713l58045m04358m26113
$$ y = [848965704, 847913682, 846717238, 845479906, 844130695, 842734456, 841426492, 840107799, 838713884, 837404490, 836258173, 835203648, 834221363, 833358407, 832707226, 832287431, 831967115, 831638813, 831397474, 831394494, 831520379, 831637740, 831829786, 832112253, 832303643, 832385957, 832523823, 832647145, 832641780, 832849026, 833109975, 832742691, 832105815, 831795633, 831825018, 831997752, 832291782, 832548916, 832581460, 832590044, 832661033, 832669497, 832666159, 832582533, 832441390, 832398653, 832398891, 832376719, 832389534, 832406640, 832306445, 832096994, 831823587, 831468344, 831099391, 830799818, 830504894, 830189884, 829958737, 829828262, 829796731, 829864740, 829968810, 830083847, 830230772, 830424666, 830678761, 830986202, 831273854, 831480086, 831583202, 831598520, 831533372, 831355870, 831063509, 830730915, 830407202, 830049157, 829644799, 829218686]
2445.5H29218686m54367m71711m37319m21107l72290k30074j69397j69873j02341k9743
2465.9H26360464J7583O4910Q7857J11818J37508J64569K71797L71337L23057K83659
2486.3H28194559L37183L24965K98798L60191L79324K86459K30194L11315L84390L06070
2506.7H31413448K00927K06471K12669J54495J15812P3493O8903J58965J77384J28686
2527.1H32911253J09613J18077J52707J29044K7418o9797l1889R4116P9334n066j5200
2549.5H33499610n3942j62482k49744k81989k83420k43008j94609k28227l21269l58998
2569.9H31121922l27707l25918l60429l46184l02970l18170l56078l11971k21431k18332
2590.3H28032732k71022k15948j06275j49906k29716j51396q4102j15931j69039k07364
$$ y = [829218686, 828764319, 828292608, 827855289, 827434182, 827061892, 826831818, 826662421, 826492548, 826390207, 826360464, 826378047, 826442957, 826530814, 826642632, 826780140, 826944709, 827216506, 827587843, 827910900, 828194559, 828531742, 828856707, 829155505, 829515696, 829895020, 830181479, 830411673, 830722988, 831107378, 831413448, 831614375, 831820846, 832033515, 832188010, 832303822, 832377315, 832446218, 832605183, 832782567, 832911253, 833020866, 833138943, 833291650, 833420694, 833448112, 833378315, 833346426, 833440542, 833519876, 833514810, 833499610, 833445668, 833283186, 833033442, 832751453, 832468033, 832225025, 832030416, 831802189, 831480920, 831121922, 830794215, 830468297, 830107868, 829761684, 829458714, 829140544, 828784466, 828472495, 828251064, 828032732, 827761710, 827545762, 827439487, 827289581, 827059865, 826908469, 826824367, 826708436, 826539397, 826332033]
2610.7H26332033j67966r2268m8757m4703q0407j22964j24932q8274n1916n7399j12355
2633.2H25340092j69396j77503j36375j36793j87278k47478l36588l73482m21644n74648
2653.5H22578907o75857o49393o40511p26700p30634o71088o69003o00398m70459l21746
2673.9H16423118j78635r4891L4929K32994L33369K62260J53602J40905J41680L6836
2694.3H17486167o0558K1219J59502J12355l2306p7605p6592r1970j15097j79708j77800
2716.8H16967607j91331l75033n65111n57363j3292O00159M25279r0182m16815m31240
2737.2H15352678j40071o0796l30389p41064r00627l63290L19421L44992n5075k41637
2757.6H13184142k15649k56598l83616m34518l87013n49972r45270r84728l73066J37389
$$ y = [826332033, 826164067, 826071799, 826023042, 825978339, 825897932, 825774968, 825650036, 825561762, 825509846, 825452447, 825340092, 825170696, 824993193, 824856818, 824720025, 824532747, 824285269, 823948681, 823575199, 823153555, 822578907, 821903050, 821253657, 820613146, 819886446, 819155812, 818484724, 817815721, 817215323, 816744864, 816423118, 816244483, 816149592, 816184521, 816417515, 816750884, 817013144, 817166746, 817307651, 817449331, 817486167, 817425609, 817446828, 817606330, 817718685, 817686379, 817608774, 817532182, 817440212, 817325115, 817145407, 816967607, 816776276, 816401243, 815836132, 815278769, 815265477, 815865636, 816290915, 816200733, 815783918, 815352678, 815212607, 815151811, 814821422, 814080358, 813179731, 812816441, 813135862, 813480854, 813425779, 813184142, 812968493, 812711895, 812328279, 811893761, 811506748, 810956776, 810011506, 809026778, 808653712, 808791101]
2778H08791101L934l09944m89533p47502r45628o37769k13325l49880q38756r04143
2798.4H03358555n14150m75347q05437j031757j175225j102805q70883r39191j230418
2816.7G95213342j439512j559198j683414j816392j885891j957595k184212k479613
2833G80207515k754748l061354k903700k370298k528608l235936l356636k697348k174556
2851.4G55124331k295375k627671k953768l110528k961397k993286l257930l257751
2867.7G31666625l073991k699971j477778J01924O72102L97563J00255o9201j70887
2886.1G25446641l10838n09858q85606j400768j608015j676738k310634l514289n180419
2904.4G08049476p627010j0730565j3865590j6286313j7382920j6957283j5067041
$$ y = [808791101, 808795035, 808485091, 807995558, 807248056, 806302428, 805664659, 805451334, 805101454, 804262698, 803358555, 802844405, 802369058, 801563621, 800531864, 799356639, 798253834, 797382951, 796443760, 795213342, 793773830, 792214632, 790531218, 788714826, 786828935, 784871340, 782687128, 780207515, 777452767, 774391413, 771487713, 769117415, 766588807, 763352871, 759996235, 757298887, 755124331, 752828956, 750201285, 747247517, 744136989, 741175592, 738182306, 734924376, 731666625, 728592634, 725892663, 724414885, 724516809, 725188911, 725586474, 725686729, 725617528, 725446641, 725135803, 724625945, 723740339, 722339571, 720731556, 719054818, 716744184, 713229895, 708049476, 700422466, 689691901, 675826311, 659539998, 642157078, 625199795, 610132754]
2918.7F10132754j1976659q141101m129469p72476J324832K235889K372802K309322
2935E93355894K619922L466368M507482N285442N616724N294085M092276K252758J59561
2953.4F26650512k116143m478455o732524q712947r992480j0139048r075701o894112
2969.7E68509102l784418j30058L611148O995559R735345J1777223J3200998J4195263
2986F24110162J4904320J5284598J5224338J4667034J3536036J2049139J0442435Q610428
3002.3G28828490O684124M868984L184557J789749J083434J069188J236796J472712
3018.6G50218034J938820K429306K823532L217459L368139L166318K918601K967477
3034.9G73047686L055095K574504K011239K022028K218127K066970J590371J257301
$$ y = [610132754, 598156095, 590014994, 585885525, 585113049, 586437881, 588673770, 591046572, 593355894, 595975816, 599442184, 603949666, 609235108, 614851832, 620145917, 624238193, 626490951, 626650512, 624534369, 620055914, 613323390, 604610443, 594617963, 584478915, 575403214, 568509102, 564724684, 564594626, 568205774, 575201333, 584936678, 596713901, 609914899, 624110162, 639014482, 654299080, 669523418, 684190452, 697726488, 709775627, 720218062, 728828490, 735512614, 740381598, 743566155, 745355904, 746439338, 747508526, 748745322, 750218034, 752156854, 754586160, 757409692, 760627151, 763995290, 767161608, 770080209, 773047686, 776102781, 778677285, 780688524, 782710552, 784928679, 786995649, 788586020, 789843321]
3051.3G89843321J133263J013994J058102J054227Q09252N92053M09127M59671P60674
3069.6G97133684P98762M43459n4419j81973K07960N23508N57482O11126O11604N47409
3090H01198602O51598O89268M61578J94729K33233N76853O41525K50995Q4043L84033
3110.4H05366457L32772k22325l30210J95086Q10623J080215P97868J99676j42575
3128.8H08087587J03772L79562J00851l77297l45766J94430M01378N6564k42114m62591
3149.2H07896376o92904l48986L09349L15785o1691j56879m9651q8692l41832m80652
3169.6H06300223l92556k86997k14576k25604l52681m36306m07338l81589m52220m73261
3189.9H02677095l80874l79026m76360n18918n30541n25832n10752n63622o15656o63102
$$ y = [789843321, 790976584, 791990578, 793048680, 794102907, 794912159, 795504212, 795913339, 796373010, 797133684, 797932446, 798375905, 798321486, 798139513, 798347473, 798870981, 799428463, 800039589, 800651193, 801198602, 801850200, 802539468, 803001046, 803195775, 803429008, 804005861, 804647386, 804898381, 804982424, 805366457, 805699229, 805476904, 805146694, 805341780, 806152403, 807232618, 808030486, 808230162, 808087587, 808191359, 808570921, 808671772, 808294475, 807948709, 808143139, 808544517, 808601081, 808358967, 807896376, 807203472, 806854486, 807163835, 807479620, 807417929, 807261050, 807211399, 807122707, 806780875, 806300223, 805907667, 805620670, 805406094, 805180490, 804827809, 804391503, 803984165, 803602576, 803150356, 802677095, 802296221, 801917195, 801440835, 800921917, 800391376, 799865544, 799354792, 798791170, 798175514, 797512412]
3210.3G97512412p76291p65800n98610n48422n72801o11901o86765o65724p27236j092911
3230.7G90465951j194000n35071K980k31862o64890q92877r76921p48753k63393k26974
3251.1G84734190p05779q88407n07891k51413m88400p19726p73550j118958j507759
3269.5G77772307j021027j42336J32322O497k61605n41687n99861n57065p20262j122117
3289.9G72945166j251221r24110m30584k9088k12609j088977j781404j432657m98712
3308.2G65295804L1471r5368m88996o91652p63298r33051j297474j479208r83536n38647
3328.6G58056045q02756j218796j546144j835048j596987j051367q33809q08537j164675
3347G47197926j779675j516521p18415p29263j367450j694500j474083j428663k051056
$$ y = [797512412, 796736121, 795970321, 795371711, 794823289, 794250488, 793638587, 792951822, 792286098, 791558862, 790465951, 789271951, 788736880, 788739860, 788507998, 787843108, 786950231, 785973310, 785224557, 784961164, 784734190, 784028411, 783140004, 782632113, 782380700, 781892300, 781172574, 780399024, 779280066, 777772307, 776751280, 776608944, 776741266, 776747763, 776486158, 775944471, 775344610, 774787545, 774067283, 772945166, 771693945, 770769835, 770339251, 770310163, 770097554, 769008577, 767227173, 765794516, 765295804, 765327275, 765231907, 764742911, 764051259, 763287961, 762354910, 761057436, 759578228, 758594692, 758056045, 757253289, 756034493, 754488349, 752653301, 751056314, 750004947, 749171138, 748362601, 747197926, 745418251, 743901730, 743183315, 742454052, 741086602, 739392102, 737918019, 736489356, 734438300]
3365.4G34438300k328873j522958m97579m30942j136601j498461j402855j175880j001179
3383.7G23442972j206696j882017k563477k250254j191020j050174k052605k469421
3400G08777308j312375k09093p70330j784146j972914j694441j154422q47757j359224
3418.4F97672606j743317j448572j586377k488554l009915k594591k488553k920330
3434.7F79392397k198159p15614n27680j602172k387762k276540j725078j354217j167536
3453.1F65437639r69231j127124j145482p5877N57125n42581j047910Q63970L051459
3471.4F65001988K803445R84073m01497l03984J057208R40561n20766m82738J44303
3489.8F69222593l54409j127005j381516j131535r60409j140595n80609N8055n40971
$$ y = [734438300, 732109427, 730586469, 730088890, 729657948, 728521347, 727022886, 725620031, 724444151, 723442972, 722236276, 720354259, 717790782, 715540528, 714349508, 713299334, 711246729, 708777308, 707464933, 707255840, 706485510, 704701364, 702728450, 701034009, 699879587, 699031830, 697672606, 695929289, 694480717, 692894340, 690405786, 687395871, 684801280, 682312727, 679392397, 677194238, 676478624, 675950944, 674348772, 671961010, 669684470, 667959392, 666605175, 665437639, 664468408, 663341284, 662195802, 662119925, 662677050, 662134469, 661086559, 661950529, 665001988, 667805433, 668789506, 668388009, 668084025, 669141233, 670081794, 669561028, 669078290, 669222593, 668868184, 667741179, 666359663, 665228128, 664267719, 663127124, 662546515, 662604570, 662063599]
3508.1F62063599j668036k299071j888275j154840j132727j541852j713157j361370
3524.4F49304271o98090n35488p51257p45118p27057o58751m59790m71413m81367j0312
3544.8F43765628M89652O29128R07242J321256J482069J557589J561940J448512J731992
3563.2F54895008K672970L533959L257275K867401K885937K782285K704204K660036
3579.5F78259075K292931J944303K459288L064930K304078J643717J842081J851499
3595.8F95661902J572192J488447J376808J173556J303971J521110J263023J034915
3612.1G06395924R33886J252412K124787K116680J244843Q42988J631618L304780L059268
3630.5G22907186K137243K556861K951741L042996K902150K494037K260387L155768
$$ y = [662063599, 660395563, 658096492, 656208217, 655053377, 653920650, 652378798, 650665641, 649304271, 648606181, 648070693, 647319436, 646574318, 645847261, 645188510, 644728720, 644257307, 643775940, 643765628, 644255280, 644884408, 645791650, 647112906, 648594975, 650152564, 651714504, 653163016, 654895008, 657567978, 661101937, 664359212, 667226613, 670112550, 672894835, 675599039, 678259075, 680552006, 682496309, 684955597, 688020527, 690324605, 691968322, 693810403, 695661902, 697234094, 698722541, 700099349, 701272905, 702576876, 704097986, 705361009, 706395924, 707329810, 708582222, 710707009, 712823689, 714068532, 714911520, 716543138, 719847918, 722907186, 725044429, 727601290, 730553031, 733596027, 736498177, 738992214, 741252601, 744408369]
3646.8G44408369N199432N250931L811717M072011M500210L900588L915846L931403
3663.1G78990507L226876L272355M268765L593624L003299M624009M197658K712130
3679.4H07889223K285242J594305J099289J720428L033877L056705K115726J591742
3695.8H24386537J374722J293718J173497N52594J75357L61979R62198J167059K97189
3714.1H31744850j91331j26124J15514K74658K13147r1613l84390l67046k78115j19626
3734.5H30789924P2360m1068J86503J125634R04262o90341p272J188815J18136p19726
3754.9H32927227j14560N13852J80423j00553J16646L26276O17444L57390k11477l44694
3775.3H34267974k19286K3246J67847K54095K55525O0081j37269j88589r6262k50041
$$ y = [744408369, 749607801, 754858732, 758670449, 762742460, 767242670, 771143258, 775059104, 778990507, 782217383, 785489738, 789758503, 793352127, 796355426, 800979435, 805177093, 807889223, 810174465, 811768770, 812868059, 814588487, 817622364, 820679069, 822794795, 824386537, 825761259, 827054977, 828228474, 828781068, 828956425, 829318404, 830280602, 831447661, 831744850, 831553519, 831427395, 831542909, 831817567, 832030714, 831939101, 831554711, 831187665, 830909550, 830789924, 830862284, 830821216, 831007719, 832133353, 833037615, 832347274, 832340002, 833528817, 833646953, 832927227, 832812667, 833326519, 833506942, 833406389, 833523035, 833849311, 834466755, 834824145, 834612668, 834267974, 834048688, 834071934, 834239781, 834493876, 834749401, 834809482, 834672213, 834483624, 834387362, 834137321]
3795.7H34137321m89116K02060M85837j3649O06298N76317l93629n61714j75357l08275
3816.1H34066093o08861M73916Q32260M6134p2956j44959j76370m10914p37846j54972
3836.5H33111525N05089L22342J84179j33872o59645q10027P75J774728R01997j135588
3856.9H34061503q46922r5963K24709k23160l49343L92557L11374j14441k27689l97563
3877.3H32735062j26243j39773j77562J74165R0301J49786K36750k64049m90069k54929
3897.7H31933439o7055K14278N22077L70264J00553r6082l74019m64678k46406q2850
3918.1H31809521j18673p4923m2498k36273k69890j5676P7784o4909j74106l33309
3938.5H30557048m15384l79801m35472k96592q8811n6088l5584j47522l92794m34876
$$ y = [834137321, 833648205, 833850265, 834336102, 834322453, 834928751, 835505068, 835111439, 834549725, 834374368, 834066093, 833457232, 833931148, 834763408, 834809542, 834736586, 834591627, 834415257, 834004343, 833266497, 833111525, 833616614, 833938956, 834123135, 833989263, 833329618, 832519591, 832520366, 834295094, 835197091, 834061503, 833214581, 833118618, 833343327, 833120167, 832770824, 833163381, 833474755, 833360314, 833132625, 832735062, 832608819, 832469046, 832291484, 832465649, 832555950, 832705736, 832942486, 832678437, 832188368, 831933439, 831866384, 832080662, 832602739, 832973003, 833073556, 832977474, 832603455, 832138777, 831892371, 831809521, 831690848, 831615925, 831573427, 831337154, 831067264, 831051588, 831129372, 831064463, 830890357, 830557048, 830141664, 829761863, 829326391, 829029799, 828940988, 828884900, 828849316, 828701794, 828309000, 827874124]
3958.9H27874124k41935j70469k67745k90215k48253k41458k16246j13308P8857K48372
3979.3H26411724J99199M8697O7234J77085K20537K23339J94967J74403J56283
3997.6H27873468
$$ y = [827874124, 827632189, 827461720, 827193975, 826903760, 826655507, 826414049, 826197803, 826084495, 826163352, 826411724, 826610923, 826659620, 826726854, 826903939, 827124476, 827347815, 827542782, 827717185, 827873468]
##END=$$ End of the data block
