##TITLE=NEUVIC Contaminado $$ Begin of the data block
##JCAMP-DX=5.00 $$ ACD/SpecManager v 10.08
##SPECTROMETER/DATA SYSTEM=Alpha
##DATE=12 Nov 2015 10:23:56
##DATA TYPE=INFRARED SPECTRUM
##DATA CLASS=XYDATA
##ORIGIN=
##OWNER=
##NPOINTS=1667
##FIRSTX=599.64648438
##LASTX=3997.64306641
##MAXX=3997.64306641
##MINX=599.64648438
##MAXY=0.88376701
##MINY=0.01202892
##XFACTOR=1.0000000000
##YFACTOR=1.000000000000000e-9
##FIRSTY=0.56310248
##DELTAX=2.03961372
##XUNITS=1/CM
##YUNITS=ARBITRARY UNITS
##XYDATA=(X++(Y..Y))
599.6E63102484m5623482l2527327j0681629J3224452L2247395M1783094M1407943
613.9F02932930L4079134K3080707J1204481L50237q359730j2575030j0768414n214334
630.2F34729981P39515N211950P577598P979154P300318O099999M672348L280461K038479
648.6F79629803J527548J724064K566218M036367N750537P449329Q687615Q659065
664.9G20030546R960175J2702226R632647O718159N475164M194796L442228K926886
681.2G75082827K513885K410889K365291K302945K362370K400398K272845J899898
697.5G93611348J596808J464665J335144J113415Q62241O18040L64959K81632N59688
715.9H01807940J162171J636088J743675J735389J589715J235008J096368J045227
$$ y = [563102484, 517479002, 484951675, 474270046, 487494498, 519741893, 561524987, 602932930, 637012064, 660092771, 671297252, 671647489, 663287759, 650712729, 639944315, 634729981, 635469496, 640681446, 648259044, 656238198, 663538516, 669638515, 674310863, 677591324, 679629803, 681157351, 682881415, 685447633, 689484000, 695234537, 702683866, 711371481, 720030546, 729990721, 742692947, 752325594, 759043753, 764518917, 768713713, 772155941, 775082827, 777596712, 780007601, 782372892, 784675837, 787038207, 789438605, 791711450, 793611348, 795208156, 796672821, 798007965, 799121380, 799983621, 800601661, 800966620, 801248252, 801807940, 802970111, 804606199, 806349874, 808085263, 809674978, 810909986, 812006354, 813051581]
732.2H13051581P45595M67479M53234M93467K82347J50204K99036L56972J79291m7386
752.6H16431820k42114k71260j66893j92345k94387l86000n22613p44760r63986j179576
773H11467886j751840k830565m252136o342351r671808j4469504j9879103k3467183
789.3G28803396k2515178j6312479p312954J003921O756425R760261J0813951J1031091
805.6G22028434J0868192J0175526Q905411P382989O058633N067825M260123L509164
822G78256297K929628K582490K154351J572966J149118Q29339M60446J52826k01880
840.3G89885581n42880o43670n77688m80533l15547q1241p8619m13894r87530j729250
860.7G84034729k686441m101992n961835q264840j1385202j5464127j9342840j9888341
$$ y = [813051581, 813797176, 814264655, 814717889, 815211356, 815493703, 815643907, 815942943, 816299915, 816479206, 816431820, 816189706, 815918446, 815751553, 815559208, 815264821, 814878821, 814356208, 813611448, 812647462, 811467886, 809716046, 806885481, 802633345, 796290994, 786619186, 772149682, 752270579, 728803396, 706288218, 689975739, 682662785, 683666706, 690423131, 700183392, 710997343, 722028434, 732896626, 743072152, 751977563, 759360552, 765419185, 770487010, 774747133, 778256297, 781185925, 783768415, 785922766, 787495732, 788644850, 789474189, 789934635, 790087461, 789885581, 789342701, 788699031, 788121343, 787640810, 787325263, 787244022, 787165403, 786751509, 785763979, 784034729, 781348288, 777246296, 771284461, 763019621, 751634419, 736170292, 716827452, 696939111]
877F96939111j4338911m568338M161536Q880914J0105550R265542P410228N153120
893.4G23008752K780735N05269j333237k671182l824532m952252o110430p237434q062243
911.7F92103446q677900r338618j0055661j0957181j2283385j4103115j6465723j9312740
928E90909123k2089421k4068654k5033712k5263489k5267243k5453836k5126368k2060126
944.3C96546274j3687551M93169J6932696K9635996L4497648L1846315K5484234J9434273
960.7E41183054J5563131J3575911J2110770J0239840P946789N492210L115177Q82149
977F10109031j121461k963960m807294o377756p599712q727252r774566j0969281j2785018
995.3E44982731j5377760j8741786k2856355k7675271l3063769l8681746m3778926
$$ y = [696939111, 682600200, 678031862, 682193398, 691074312, 701179862, 710445404, 717855632, 723008752, 725789487, 726294756, 724961519, 722290337, 718465805, 713513553, 707403123, 700165689, 692103446, 683425546, 674086928, 664031267, 653074086, 640790701, 626687586, 610221863, 590909123, 568819702, 544751048, 519717336, 494453847, 469186604, 443732768, 418606400, 396546274, 382858723, 383351892, 400284588, 429920584, 464418232, 496264547, 521748781, 541183054, 556746185, 570322096, 582432866, 592672706, 600619495, 606111705, 609226882, 610109031, 608987570, 606023610, 601216316, 594838560, 587238848, 578511596, 568737030, 557767749, 544982731, 529604971, 510863185, 488006830, 460331559, 427267790, 388586044, 344807118]
1009.6C44807118m7063798m7073394m2759463l4236535k3068324j1524871j474321
1023.9A37606412O240040J1348292J3690278J3512403J1589185Q818000N813539L022030
1040.2B11640179J141310R75490K758711O159887J0426670J4639333J7825991J8850028
1056.5B84417599J7247200J3603658R067625N037129K404719O38247j006812k226144
1072.8C29183221k674461k514779k075642j557976r31353k24203M64767J109094J529097
1091.2C22307765J673610J747190J717538J529574J231045P29531K2203p36505j553178
1109.6C28668773k376050l042072l461480l472447k967358j961171l65198J998901
1125.9C13021898N163670R051531J3374746J7755151K1768689K4925739K7202308K8980195
$$ y = [344807118, 297743320, 250669926, 207910463, 173673928, 150605604, 139080733, 137606412, 143846452, 155194744, 168885022, 182397425, 193986610, 202804610, 208618149, 211640179, 212781489, 213756979, 216515690, 222675577, 233102247, 247741580, 265567571, 284417599, 301664799, 315268457, 324336082, 329373211, 331777930, 332416177, 331409365, 329183221, 326508760, 323993981, 321918339, 320360363, 319429010, 319204807, 319669574, 320778668, 322307765, 323981375, 325728565, 327446103, 328975677, 330206722, 330936253, 330958456, 330221951, 328668773, 326292723, 323250651, 319789171, 316316724, 313349366, 311388195, 311022997, 313021898, 318185568, 327237099, 340611845, 358366996, 380135685, 405061424, 432263732, 461243927]
1142.2D61243927L0568064L1899571L2346130L1001567K7506948K2515118J7025352
1156.5F54106677J1760711P282913L743947R62138j323462l452658n649925p946074
1172.8F59484267j0143459j2045920j3616323j4712155j5163600j5180707j5188456
1187.1E63433647j5546679j6434729j7773629j9436776k1422386k3718268k6150793
1201.3D22950387k8589547l1011909l3401966l5639346l7463009l8394287l7874595
1215.6A80575728l5615563l1620614k6397981k0828411j5629135j1203580p717635
1229.9C1562809n203806l466815k252333j372890o98650j34085L42414P26661J123139
1248.2B0626444J566790K006822K371020K805038L476349M473590N918246P905460
$$ y = [461243927, 491811991, 523711562, 556057692, 587059259, 614566207, 637081325, 654106677, 665867388, 673150301, 676894248, 677856386, 676532924, 673080266, 667430341, 659484267, 649340808, 637294888, 623678565, 608966410, 593802810, 578622103, 563433647, 547886968, 531452239, 513678610, 494241834, 472819448, 449101180, 422950387, 394360840, 363348931, 329946965, 294307619, 256844610, 218450323, 180575728, 144960165, 113339551, 86941570, 66113159, 50484024, 39280444, 31562809, 26359003, 22892188, 20639855, 19266965, 18568315, 18434230, 18776644, 19503305, 20626444, 22193234, 24200056, 26571076, 29376114, 32852463, 37326053, 43244299, 51149759]
1264.6E1149759J0557294J3965633J8145375K2783920K7466618L1930312L5742402
1278.8B11741313L8283661L9154291L8417042L6488533L3476591K9740930K6086032
1293.1D53388393K2879302K0102919J7729520J5855968J4539302J3682842J2984157
1307.4E71162403J2130856J0965943R784461Q772492Q124888P874071P661462P287920
1323.7F43764496O691038N839527M566133K668321l0875l382444p737518j2693345
1340F39685333j6765475k1365941k8032243l5593510m2863816m9007535n3791761n4867328
1356.4C37397724m9995392m3340057l8668916l2384664k5761470k2130653j6917065
1370.6A08199507r140506P34709J2319080K4200589L5715818M3756828M7488108N0418228
$$ y = [51149759, 61707053, 75672686, 93818061, 116601981, 144068599, 175998911, 211741313, 250024974, 289179265, 327596307, 364084840, 397561431, 427302361, 453388393, 476267695, 496370614, 514100134, 529956102, 544495404, 558178246, 571162403, 583293259, 594259202, 604043663, 612816155, 620941043, 628815114, 636476576, 643764496, 650455534, 656295061, 660861194, 663529515, 663498640, 660116196, 652378678, 639685333, 622919858, 601553917, 573521674, 537928164, 495064348, 446056813, 392265052, 337397724, 287402332, 244062275, 205393359, 173008695, 147247225, 125116572, 108199507, 99059001, 99793710, 112112790, 136313379, 172029197, 215786025, 263274133, 313692361]
1386.9C13692361M7077000L5946995K8882504K6169240K2002727J8273652J5869647
1401.2E07914126J3773024J2480199R644807N130112j36972n371928r785175j6201973
1417.5E17446220k3504406k2031606j9882887j9760817j6975940j4197886r352177
1431.8C91740501l182948K211571Q866280J3757587J7964274K1853804K5025904K8560877
1448.1E06797850K8698802K5583804K2655010K4420381K7649223K0824790J5561581
1462.4F72191441J4712989J3371587J0271251P746697O507456N733371M836738M053593
1478.7G39425123L399968L219128L146052K866149K764881L676712M011214K917707
1495.1G65426934J614332J663744K280236K005636K04444j952171Q43048K611816J912773
$$ y = [313692361, 360769361, 396716356, 425598860, 451768100, 473770827, 492044479, 507914126, 521687150, 534167349, 543812156, 548942268, 548805296, 543433368, 533648193, 517446220, 493941814, 471910208, 452027321, 432266504, 415290564, 401092678, 391740501, 388557553, 390769124, 399635404, 413392991, 431357265, 453211069, 478236973, 506797850, 535496652, 561080456, 583735466, 608155847, 635805070, 656629860, 672191441, 686904430, 700276017, 710547268, 718293965, 724801421, 730534792, 735371530, 739425123, 742825091, 746044219, 749190271, 752056420, 754821301, 758498013, 762509227, 765426934, 767041266, 768705010, 770985246, 772990882, 773195326, 771243155, 772086203, 774698019, 776610792]
1513.4G76610792Q00728L52622M23848J29640O45697J143575J113176J258851P52806
1531.8G83231735K6405Q44061Q59738j269937j149833R68397J465797J086891L50475
1550.1G86413729N1201P5221k16663k262414k056896J355707J205862L40283k90573
1568.5G84615457m19199O46650L33965q40843J95206J022637M35531j7107j63019m52041
1588.9G85357237q67546j278698j788974k233863k594471l226936l677010l812373
1605.2G65877366m264533n008400n003154m671395o531298q950532o274819n242944
1621.5G19930291p549941p292450o383896o061494m617274n430877r516597p990301
1637.8F65087461m333913m697382o005764p482529l902614K113223J411080r73046
$$ y = [776610792, 777411520, 777764142, 778187990, 778317630, 778963327, 780106902, 781220078, 782478929, 783231735, 783258140, 784102201, 784961939, 783692002, 782542169, 783510566, 784976363, 786063254, 786413729, 786464930, 786540151, 786323488, 784061074, 782004178, 783359885, 784565747, 784906030, 784615457, 784196258, 784842908, 785176873, 784336030, 784531236, 785553873, 785989404, 785972297, 785809278, 785357237, 784489691, 783210993, 781422019, 779188156, 776593685, 773366749, 769689739, 765877366, 761612833, 756604433, 751601279, 746929884, 740398586, 731448054, 725173235, 719930291, 712380350, 705087900, 698704004, 692642510, 688025236, 682594359, 673077762, 665087461, 660753548, 656056166, 650050402, 642567873, 638665259, 640778482, 642189562, 641216516]
1654.1F41216516K312601L262699K113998R81807J000584J195430q60572k936780k421498
1672.5F45864785m029155o286502n914807o456852j1367798k0070255j7497241j5155197
1688.8E59086978j7901897j7055213j9828916k2796959k2906661k8319537k5964976
1703.1D04312819k9651284l8642049l8010359l6079645l5207838l6127671l9980620
1717.4A50613353l3824109k3644052k1418482j9944970j5111648j0810304o970512
1731.7A8889276m589496j966068l04792L86209J413796K659418N031905J0026356K2975217
1750E4521821M1119598N4618344P1511775Q2538694P5828821O9643140N6091904M1766823
1766.3E47640920L5677254L0096173K6125670K1226525J5885353J3119698J1682093
$$ y = [641216516, 643529117, 646791816, 648905814, 649887621, 650888205, 652083635, 651223063, 648286283, 645864785, 641835630, 635549128, 629634321, 623177469, 611809671, 591739416, 574242175, 559086978, 541185081, 524129868, 504300952, 481503993, 458597332, 430277795, 404312819, 374661535, 336019486, 298009127, 261929482, 226721644, 190593973, 150613353, 116789244, 93145192, 71726710, 51781740, 36670092, 25859788, 18889276, 14299780, 12333712, 12028920, 12415129, 13828925, 16488343, 21520248, 31546604, 54521821, 95641419, 150259763, 221771538, 304310232, 380139053, 449782193, 505874097, 547640920, 583318174, 613414347, 639540017, 660766542, 676651895, 689771593, 701453686]
1780.6G01453686J0160386Q873344P605791O442368N244315M799485M887581M410207
1796.9G53877163L431976K505183K375603K192497J787186J163602Q30650R11534J072108
1815.3G70147502J065135J337588J695156J687825K010226K545536K833307L202736
1831.6G86525011L623009L439247L271282L262282K835929K134085K233922K708018
1847.9H10032785K398848J969278J623690J416564J231850J207232J283288J275480
1864.2H22439015R52959O70671J403869K108454K071202J872838J938462J988113J982868
1882.6H37428451J938819J801372J507819J431644J569628J368106J286626J246392
1898.9H49578857J031399P94292O88731N17667K84254K33054K41697J16349k77401
$$ y = [701453686, 711614072, 720487416, 728093207, 734535575, 739779890, 744579375, 749466956, 753877163, 757309139, 759814322, 762189925, 764382422, 766169608, 767333210, 768163860, 769075394, 770147502, 771212637, 772550225, 774245381, 775933206, 777943432, 780488968, 783322275, 786525011, 790148020, 793587267, 796858549, 800120831, 802956760, 805090845, 807324767, 810032785, 812431633, 814400911, 816024601, 817441165, 818673015, 819880247, 821163535, 822439015, 823391974, 824062645, 825466514, 827574968, 829646170, 831519008, 833457470, 835445583, 837428451, 839367270, 841168642, 842676461, 844108105, 845677733, 847045839, 848332465, 849578857, 850610256, 851404548, 852093279, 852610946, 852895200, 853128254, 853369951, 853486300, 853208899]
1917.3H53208899l43322m6730J76251N36799Q95202R63092R16243Q61764P75456O63996
1937.7H58607650M43280J49667J37090M66168N75722N03778M33266M15623M90249N62548
1958.1H62785041N24462M48942M28080L38674L82721M76539L44277K07722J93834J14680
1978.5H66244972J6391k8312j30296k57850l79920n64754o96718o60897q21948j063764
1998.8H61656904j041233r73821j013100j066029j050949r98438r70542j018107r96709
2017.2H52527976p93099o11306m80413k79605r3401Q166R3639K13086L29555M02569
2037.6H51317167M21822M31776M98712N55993N59389N55277N46157N52833N56767N39423
2058H56535316N77747O15836N68747O04034P55906P52389N91636M90606N28335N86689
$$ y = [853208899, 852865577, 852818847, 852995098, 853531897, 854427099, 855390191, 856306434, 857168198, 857943654, 858607650, 859050930, 859200597, 859337687, 859803855, 860379577, 860883355, 861316621, 861732244, 862222493, 862785041, 863309503, 863758445, 864186525, 864525199, 864907920, 865384459, 865728736, 865936458, 866130292, 866244972, 866261363, 866233051, 866102755, 865844905, 865464985, 864900231, 864203513, 863542616, 862720668, 861656904, 860615671, 859641850, 858628750, 857562721, 856511772, 855513334, 854542792, 853524685, 852527976, 851734877, 851123571, 850643158, 850363553, 850270152, 850278318, 850371957, 850585043, 850914598, 851317167, 851738989, 852170765, 852669477, 853225470, 853784859, 854340136, 854886293, 855439126, 855995893, 856535316, 857113063, 857728899, 858297646, 858901680, 859657586, 860409975, 861001611, 861492217, 862020552, 862607241]
2078.4H62607241N36203M76599M57644M12584K94745K03311J89185J00374m3332j11103
2098.8H65123451j49668k54392m16815n39482n65708o30676p20919p76708q50856q77738
2119.2H59340489q19206p65562p61450p48872p20740o81341o78002p28786p49886o55711
2139.6H52030933n40733n01335m43339l73006l36647k89798j88649j24574j19864J251
2160H49114239K22028L51905M04775M77553N95450P44880Q73506R60886R44316R22084
2180.4H55611622R58979R33469Q86977R35137R74119R21726R08315R07779Q46684P80999
2200.8H64665806P60496P26819O63161N79834M67956L91305L19063K75672K78294J72913
2221.2H69301319j192n9605o7293q5831j11580k12848l12090l02970k71500k98678
$$ y = [862607241, 863143444, 863620043, 864077687, 864490271, 864785016, 864988327, 865177512, 865277886, 865234554, 865123451, 864973783, 864719391, 864302576, 863763094, 863197386, 862566710, 861845791, 861069083, 860218227, 859340489, 858521283, 857755721, 856994271, 856245399, 855524659, 854843318, 854165316, 853436530, 852686644, 852030933, 851490200, 850988865, 850545526, 850172520, 849835873, 849546075, 849357426, 849232852, 849112988, 849114239, 849336267, 849688172, 850092947, 850570500, 851165950, 851910830, 852784336, 853745222, 854689538, 855611622, 856570601, 857504070, 858391047, 859326184, 860300303, 861222029, 862130344, 863038123, 863884807, 864665806, 865426302, 866153121, 866816282, 867396116, 867864072, 868255377, 868574440, 868850112, 869128406, 869301319, 869300127, 869240522, 869173229, 869087398, 868975818, 868762970, 868450880, 868147910, 867876410, 867577732]
2241.6H67577732l22760l36468l35812l20256k62737p8619J07765J43111J86205L26157
2262H66684318L78847L27348K67506K60174K74659K09808R5010k8253j53601k57850
2282.3H68057966l55184m46796n09441n58019o26325p04885p59661p96437p75874o30379
2302.7H61894965n11825o03557p21573n49972r7096L30984M06683J90496J11044K72631
2323.1H60722780M71771O37293O62744N55515M67599L66270K60532J31488p0214k37525
2343.5H63968253j49608N16654R78112N88238P6771J18255n1379m24325l95954k06113
2363.9H65018904j73807k02358k73823l55006k23696n9009N365J32978K25127O6161
2384.3H64160836k34008m05312m73141n64695n99801n43177n11706m76539l70920k52664
$$ y = [867577732, 867254972, 866918504, 866582692, 866262436, 865999699, 865921080, 866028845, 866171956, 866358161, 866684318, 867063165, 867390513, 867658019, 867918193, 868192852, 868402660, 868497670, 868469417, 868315816, 868057966, 867702782, 867255986, 866746545, 866188526, 865562201, 864857316, 864097655, 863301218, 862525344, 861894965, 861383140, 860779583, 860058010, 859508038, 859410942, 859741926, 860148609, 860339105, 860450149, 860722780, 861194551, 861831844, 862494588, 863050103, 863517702, 863883972, 864144504, 864275992, 864205778, 863968253, 863818645, 864335299, 865313411, 865901649, 865978420, 866096675, 866045296, 865620971, 865225017, 865018904, 864845097, 864642739, 864368916, 864013910, 863790214, 863731205, 863736570, 863869548, 864094675, 864160836, 863926828, 863521516, 863048375, 862483680, 861883879, 861340702, 860828996, 860352457, 859981537, 859728873]
2404.7H59728873r6619N3405J64092K80082L09229L01838M34935N12838L65139K29537
2425.1H62283349J70112P6353o5386k47836m50969o13868p15077p56264p81357q48115
2445.5H58050942q76784q13126p04170o44266o15597n18263m07338l55601k50399p3731
2465.9H52791667J1682N5433J59204K45154K68638L39627M57645M82738M43160M69446
2486.3H55724394N61595O17385O39498O69361O35564N39839M94719N38230O39319O41167
2506.7H61701071N17071M47869M07278L56019L20315K35200K42651M06086M29332L12806
2527.1H65375698K47538K32219K76268K97010K35975J94370J98126K18511K44796K26200
2547.5H67746711J63853J00315J5676j12713k44498k71142j97351k11536l28720m06146
$$ y = [859728873, 859632254, 859685659, 859849751, 860129833, 860439062, 860740900, 861175835, 861688673, 862053812, 862283349, 862453461, 862529814, 862464428, 862216592, 861765623, 861151755, 860436678, 859680414, 858899057, 858050942, 857174158, 856361032, 855656862, 855012596, 854396999, 853878736, 853471398, 853115797, 852865398, 852791667, 852803349, 852858782, 853017986, 853263140, 853531778, 853871405, 854329050, 854811788, 855254948, 855724394, 856285989, 856903374, 857542872, 858212233, 858847797, 859387636, 859882355, 860420585, 861059904, 861701071, 862218142, 862666011, 863073289, 863429308, 863749623, 863984823, 864227474, 864633560, 865062892, 865375698, 865623236, 865855455, 866131723, 866428733, 866664708, 866859078, 867057204, 867275715, 867520511, 867746711, 867910564, 868010879, 868026555, 867913842, 867669344, 867398202, 867200851, 866989315, 866660595, 866254449]
2567.9H66254449m61400m80115n00679n75960n50926m52816m25398m80295n45561m66227
2588.3H61315072l66867m41074m33326k67387k06589j99676j69754k16067k62201l03030
2608.7H58449101l57568k80499j64688j75059j66535q2612j10328j82093j23560n3048
2629.1H56753111o5923j15812k13086l08693k72095k23279l18348m50194n53787o62088
2649.5H53569806q02875r29594j018107j109302j201332j251161j162111j065791j089096
2667.8H43940437j001299p25865m96805m31120l48866l9041L55780M62413K93672J68562
2688.2H42177868J67012J30773j0073j10150m4763R4414R5844q5711l19064m64141
2708.6H41632009m65036m39763m40776l34680l50595o38246q50022p44045o9141O05702
$$ y = [866254449, 865793049, 865312934, 864812255, 864236295, 863685369, 863232553, 862807155, 862326860, 861781299, 861315072, 860948205, 860507131, 860073805, 859806418, 859599829, 859400153, 859230399, 859014332, 858752131, 858449101, 858091533, 857811034, 857646346, 857471287, 857304752, 857222140, 857111812, 856929719, 856806159, 856753111, 856687188, 856571376, 856358290, 856049597, 855777502, 855554223, 855235875, 854785681, 854231894, 853569806, 852766931, 851837337, 850819230, 849709928, 848508596, 847257435, 846095324, 845029533, 843940437, 842939138, 842213273, 841716468, 841285348, 840936482, 840897441, 841253221, 841715634, 842009306, 842177868, 842344880, 842475653, 842465580, 842355430, 842310667, 842405081, 842500925, 842415214, 842096150, 841632009, 841166973, 840727210, 840286434, 839951754, 839601159, 838962913, 838112891, 837368846, 837299705, 837905407]
2729H37905407L89218k34008o61313o89268l52562k51770n48541r91106j088143m18961
2749.4H33058953L28780L49819o3300k42174k27987l07441m12822m93169n72145p68423
2769.8H30650091j180589j303077o22928j7404k55645o13510o73652r96232j488567
2788.2H23498487j280844p20620q04067j372516j543343j178562j135290j554489j895666
2806.5H12013090k089858j982689j677275j744449k139032k472818k676904k892017
2822.8G94338048l123045l284693l464341l755033m082382m426181m772425m570365
2839.1G62859583m080594m442811n324363n466998m688144m062891m171848m516482
2855.5G26105452m959524n270302n204440n360066n684376n481243m944086m202724
$$ y = [837905407, 838294625, 838060617, 837399304, 836710036, 836357474, 836105704, 835557163, 834566057, 833477914, 833058953, 833387733, 833737552, 833674252, 833432078, 833204091, 832896650, 832483828, 831990659, 831418514, 830650091, 829469502, 828166425, 827543497, 827526093, 827270448, 826656938, 825983286, 824987054, 823498487, 822217643, 821497023, 820692956, 819320440, 817777097, 816598535, 815463245, 813908756, 812013090, 809923232, 807940543, 806263268, 804518819, 802379787, 799906969, 797230065, 794338048, 791215003, 787930310, 784465969, 780710936, 776628554, 772202373, 767429948, 762859583, 758778989, 754336178, 749011815, 743544817, 738856673, 734793782, 730621934, 726105452, 721145928, 715875626, 710671186, 705311120, 699626744, 694145501, 689201415, 684998691]
2871.8F84998691k532363m50134M02391J36852j26064j89125k41220m00126p08223
2890.1F80890679j207530j764357k035439k326787l072023m237414o285071r627581
2906.5F50334477j3833761j8031180k1211266k2617340k2031904j9633710j5675008
2920.7E17300308j0608077n455196j259536J547009K829373K947569K880335L349185
2937E13530970M380226N693614O849528P295489O706417N125582K839446J06096l024697
2955.4E49502671o325186r355962j1794746j3323962j3592899j2304753r481728n421400
2971.7D67902035o86318M018962Q418948J2268990J5143394J7147303J8702149K0028055
2988E62943518K1156013K1585822K0889879J9460856J7753304J5763223J3353944J0730147
$$ y = [684998691, 682466328, 682016194, 682418585, 682555437, 682429373, 682240248, 681999028, 681598902, 680890679, 679683149, 677918792, 675883353, 673556566, 670484543, 666247129, 659962058, 650334477, 636500716, 618469536, 597258270, 574640930, 552609026, 532975316, 517300308, 506692231, 501237035, 499977499, 501524508, 504353881, 507301450, 510181785, 513530970, 517911196, 523604810, 530454338, 537749827, 544456244, 549581826, 552421272, 552527368, 549502671, 543177485, 533821523, 522026777, 508702815, 495109916, 482805163, 473323435, 467902035, 467215717, 471234679, 479653627, 491922617, 507066011, 524213314, 542915463, 562943518, 584099531, 605685353, 626575232, 646036088, 663789392, 679552615, 692906559, 703636706]
3004.4G03636706Q139670N649149L580034K364218K000332K126932K617002L367960
3020.7G33482003M005730M541397N114377N336285N111217M894674M958749M930317
3037G72374749M307151L555298L279865L316223L192187K690136K275109K060831J724064
3055.3G98775613J585305J603603J371384J038253P64370Q57771J228988J202166P31051
3073.7H09158504J55926l1054L72529P63178Q29339P41481N62609O06000R78768J069784
3094.1H15207064P16806M03165N01335R20475R82642M84109K03550M80532M95136k6822
3114.5H20367992j71125K81394Q03649J089096Q84354K99633m2737J38879L23832j4722
3134.9H23960245n98133n75960J04487L72589o6638m89473p61867r87470o73413l9339
$$ y = [703636706, 711776376, 717425525, 721005559, 723369777, 725370109, 727497041, 730114043, 733482003, 737487733, 742029130, 747143507, 752479792, 757591009, 762485683, 767444432, 772374749, 776681900, 780237198, 783517063, 786833286, 790025473, 792715609, 794990718, 797051549, 798775613, 800360918, 801964521, 803335905, 804374158, 805138528, 805996299, 807225287, 808427453, 809158504, 809314430, 809283376, 809655905, 810419083, 811248422, 811989903, 812552512, 813158512, 814137280, 815207064, 815923870, 816327035, 816828370, 817748845, 818731487, 819215596, 819419146, 819899678, 820394814, 820367992, 820196867, 820478261, 821281910, 822371006, 823255360, 823554993, 823512256, 823651135, 823974967, 823960245, 823362112, 822786152, 822890639, 823263228, 823196590, 822707117, 821945250, 820957780, 820284367, 820245028]
3155.3H20245028P5459k24233m78863n53012n31733o05405p04109p06971p03096p35522
3175.7H15077543p77364p53402o57678p21812r42111j070500r51469p00294p42853
3194H07760060j030803j113176j049102j063406j130402j180411j169085j197815j310348
3212.4G97515512j282752j169145j204372j182615j086116j148284j244485j381934
3228.7G87815809j790046j862467j058638m78923p71344j180231j459301j645446j313209
3247.1G76256204p25508p11560j194001j369834r70482p35283r83179j137376j192450
3265.4G67236531j620710k014458j555443p17163k95222k84433o09160r97007j099825
3283.8G58043110r90629j106560j621246j812995j310944o85215l84450p45833j764000
$$ y = [820245028, 820320487, 820096254, 819617391, 819064379, 818532646, 817927241, 817223132, 816516161, 815813065, 815077543, 814300179, 813546777, 812889099, 812167287, 811225176, 810154676, 809203207, 808502913, 807760060, 806729257, 805616081, 804566979, 803503573, 802373171, 801192760, 800023675, 798825860, 797515512, 796232760, 795063615, 793859243, 792676628, 791590512, 790442228, 789197743, 787815809, 786025763, 784163296, 783104658, 782625735, 781854391, 780674160, 779214859, 777569413, 776256204, 775530696, 774819136, 773625135, 772255301, 771284819, 770549536, 769566357, 768428981, 767236531, 765615821, 763601363, 762045920, 761328757, 761033535, 760749102, 760139942, 759142935, 758043110, 757052481, 755945921, 754324675, 752511680, 751200736, 750515521, 750131071, 749385238, 747621238]
3302.1G47621238k435863j988113j042485m66824n55396j012027j294136j424611j583457
3320.5G35818326j902103k131343j713216j208723j330733j767218k317548k648771
3336.8G20798671k147257j538098j513541j507282j743376k371371k219200j461923
3353.1G06296623j471162k112150k444625k188266k091944k761841l045499k160668
3369.4F88020468j099169j044453j755774k096176k001405j831889j766383j993597
3385.7F74431622k525508l146053k942621j899422j705646k750218l135264j885355
3402.1F54441535p82907j371741k426028k652288k319634j669168j329303j995861
3418.4F39894605k546609k164721k126694l023505l651917l306747l185272l580510
$$ y = [747621238, 745185375, 743197262, 742154777, 741687953, 741132557, 740120530, 738826394, 737401783, 735818326, 733916223, 731784880, 730071664, 728862941, 727532208, 725764990, 723447442, 720798671, 718651414, 717113316, 715599775, 714092493, 712349117, 709977746, 707758546, 706296623, 704825461, 702713311, 700268686, 698080420, 695988476, 693226635, 690181136, 688020468, 686921299, 685876846, 684121072, 682024896, 680023491, 678191602, 676425219, 674431622, 671906114, 668760061, 665817440, 663918018, 662212372, 659462154, 656326890, 654441535, 653658628, 652286887, 649860859, 647208571, 644888937, 643219769, 641890466, 639894605, 637347996, 635183275, 633056581, 630033076, 626381159, 623074412, 619889140, 616308630]
3434.7F16308630k831698j412749j393140k367913l098965l290236k552271j710892
3451E97650766j468777j288951j353144j326383l06606M97818k95460p24196J172602
3469.4E92557669L249824K874493J202047J21892O318Q74221J011670j39594m78149
3487.7F01280391m8876l10599j042307j436889j046956q32617j566887j061201K53081
3506.1E94187140m03285j966357k487778j838029j099944j106918j610696k185464
3522.4E81488669j971662j081169r02116r03130o59167r60470j133740m85539M3690
3540.8E73435366j23918m64260l0935J091242J342952J257062J869142K336561K385796
3559.1E83099008K762734L371120K697706J921892L783048N350112M893959M277468
$$ y = [616308630, 613476932, 612064183, 610671043, 608303130, 605204165, 601913929, 599361658, 597650766, 596181989, 594893038, 593539894, 592213511, 591906905, 592404723, 592109263, 591385067, 592557669, 595807493, 598681986, 599884033, 600005925, 600012243, 600886464, 601898134, 601758540, 601280391, 601231515, 600920916, 599878609, 598441720, 597394764, 596562147, 594995260, 593934059, 594187140, 593783855, 591817498, 589329720, 587491691, 586391747, 585284829, 583674133, 581488669, 579517007, 578435838, 577533722, 576630592, 575971425, 575010955, 573877215, 573391676, 573435366, 573311448, 572847188, 572816253, 573907495, 575250447, 576507509, 578376651, 580713212, 583099008, 585861742, 589232862, 591930568, 593852460, 597635508, 602985620, 607879579, 612157047]
3575.4F12157047M176855M142582M222453M155219K955913J693487L159285M306316
3591.7F40969157L213227K412677K620995K506792K590180L207862K714575J436770
3608.1F61672235J431167J889169K305508K880752J829862J432061L506065M780769
3624.4F81727588L656984P78555J704634M702866M987836M797876M831016M924714
3640.7G12112069N518377N927503M928351L120780M819393P848560P310212N937338
3657G57522583O414890P148981P250429P244348O737828N519867N692542O023288M580557
3675.4H14135313M924774O162942N693793N015969M421234L089607K402008L839791
3691.7H49685431M449784L903508L470839K709925J599431J584649K240360J921415
$$ y = [612157047, 616333902, 620476484, 624698937, 628854156, 631810069, 633503556, 636662841, 640969157, 644182384, 646595061, 649216056, 651722848, 654313028, 657520890, 660235465, 661672235, 663103402, 664992571, 667298079, 670178831, 672008693, 673440754, 676946819, 681727588, 685384572, 686163127, 687867761, 692570627, 697558463, 702356339, 707187355, 712112069, 717630446, 723557949, 728486300, 731607080, 736426473, 744275033, 751585245, 757522583, 763937473, 771086454, 778336883, 785581231, 792319059, 797838926, 803531468, 809554756, 814135313, 819060087, 825223029, 830916822, 835932791, 840354025, 843443632, 845845640, 849685431, 854135215, 858038723, 861509562, 864219487, 865818918, 867403567, 869643927, 871565342]
3708H71565342N54204m76658N42879J384616R34064L32713J4603k14755j42634P32422
3728.4H75226796J066982m4107j670420j744688N69165K659738K035379o85572k36273
3746.7H77177000J128078m60923r42588O21021Q52048O5923J75714P78616N04494J08420
3767.1H80007803j06275l4511N59449O14465j8418m90427J04129N26250J32978Q7857
3787.5H81383300J96338L91721N69523l219j24395m2140r06766N6267O88851k87712
3807.9H81921768K88844J105130K90036j092970m23014k4677n77688N04017P04348
3826.3H82695794K27153J14441k61128l42249l54291o13272k98977j01864j61469L62575
3846.7H81266713J190186J310110q38518k607525l87132R51648P12275k51829o24061
$$ y = [871565342, 872119546, 871642888, 872185767, 873570383, 874504447, 874837160, 874851763, 874637008, 874494374, 875226796, 876293778, 876249671, 874579251, 872834563, 873403728, 876063466, 878098845, 877413273, 877177000, 878305078, 877844155, 876901567, 877522588, 878374636, 878440559, 878616273, 879394889, 879899383, 880007803, 879901528, 879867017, 880426466, 881040931, 881022513, 880532086, 880636215, 881162465, 881295443, 881383300, 881579638, 881971359, 882540882, 882537663, 882413268, 882371128, 881464362, 881520629, 882209480, 881921768, 882210612, 883315742, 883605778, 882512808, 882089794, 882065117, 881487429, 881991446, 882695794, 882922947, 883037388, 882776260, 882434011, 882079720, 881466448, 881167471, 881065607, 880904138, 881266713, 882456899, 883767009, 882928491, 880320966, 879933834, 880885482, 881597757, 881345928, 880721867]
3865H80721867K66671O0380p30396l42726J28627O01768R2685o12974l60608o52730
3885.4H79172564J26421Q76844l17097m44412P47740O08862l86775p11202p06733l22997
3905.8H78643215M50134M88281P9334j20163m35054o32823k03013r775m32730l73006
3926.2H77454400R2268k51770q10623l83020J78338R0181l67403r18626q03948l67284
3946.6H73912513m45127l96729j47283k78771n25713m98891n17308o22809n24640m43161
3967H69512081m88102m58598l76165k98262r894L86834M65631K76923K98739N00679
3987.4H69809866N02586K95520R8527P2062Q0764
3997.6H70859325
$$ y = [880721867, 880988538, 881048918, 880318522, 879975796, 880104423, 880706191, 880798876, 880185902, 879825294, 879172564, 879298985, 880175829, 879858732, 879414320, 880162060, 880770922, 880384147, 879672945, 878966212, 878643215, 879093349, 879581630, 879660964, 879540801, 879105747, 878472924, 878269911, 878260136, 877827406, 877454400, 877546668, 877294898, 876484275, 876101255, 876279593, 876369774, 876002371, 875083745, 874279797, 873912513, 873467386, 873070657, 872923374, 872644603, 872118890, 871619999, 871102691, 870479882, 869955242, 869512081, 869023979, 868565381, 868189216, 867890954, 867881060, 868267894, 868733525, 869010448, 869309187, 869809866, 870312452, 870607972, 870706499, 870778561, 870859325]
##END=$$ End of the data block
