##TITLE=$$ Begin of the data block
##JCAMP-DX=5.00 $$ ACD/SpecManager v 10.08
##SPECTROMETER/DATA SYSTEM=16PC
##DATE=Tue Sep 03 10:42:11 2013
##DATA TYPE=INFRARED SPECTRUM
##DATA CLASS=XYDATA
##ORIGIN=
##OWNER=
##NPOINTS=3601
##FIRSTX=400.00000000
##LASTX=4000.00000000
##MAXX=4000.00000000
##MINX=400.00000000
##MAXY=35.56257248
##MINY=14.49949551
##XFACTOR=1.0000000000
##YFACTOR=0.000000100000000
##FIRSTY=18.78708839
##DELTAX=1.00000000
##XUNITS=1/CM
##YUNITS=TRANSMITTANCE
##XYDATA=(X++(Y..Y))
400A87870884M9104385M0023976K7590046J5384693O002769L14064k297630l078690
408C20914497l067512k741337k186489j473751q64506o97708j103649j829090k338295
417C04612160k131501j050758O34060K388611L691654M237728L976803L033714J620446
426C21012917P324j473522k468644k720108k202034j170292n7983P36790J041508R54551
436C13660507P19681N29194L96576J84784k43492q74024j500912j829128j642570r27773
446C08472843J23120J213455K072410K536583K556057K156887J412392M44565n59731
455C20428581j362056j735535j558972q88290M4727R17855J452427J528625J225281
464C20052643P68738M17404L42712N62439R52835J327286J535759J535187J397362
$$ plain form
400 187870884 236975269 276999245 304589291 319973984 325976753 326290817 323993187 320914497
408 320914497 317846985 315105648 312919159 311445408 310580902 309883194 308779545 306950455 304612160
417 304612160 302480659 301429901 302063961 304452572 308144226 312381954 316358757 319392471 321012917
426 321012917 321020241 319546719 317078075 314357967 312155933 310985641 310927658 311664448 312705956 313660507
436 313660507 314380188 314909382 315305958 315490742 315247250 314373226 312872314 311043186 309400616 308472843
446 308472843 308595963 309809418 311881828 314418411 316974468 319131355 320543747 320988312 320428581
455 320428581 319066525 317330990 315772018 314883728 314928455 315846310 317298737 318827362 320052643
464 320052643 320821381 321238785 321581497 322143936 323096771 324424057 325959816 327495003 328892365
473C28892365J254005J213531J291237J392937J358948J048889M26979l94096j177330
482C35307465j649247j618499j075936k23694N88875J007653Q32595J20583q27026
491C32462769j592904j831703j425056n27497N15480J331482J678276J521454J010590
500C33142891L83987j34811m02679l73688q7242L49960P80029J024895R39064M80461
510C36102867k41928r80110j432800j375161p70988J93367J175308J812897J869545
519C36352997J321792L55988p12395j556091j941452j790237j189614l57780M18396
528C30901604Q64677Q03261K21977o97937j621551k167206k056847j246681K3956J305809
538C26331062K115059K141953J391525J86386r74922j640892j601791r64890q3122
$$ plain form
473 328892365 330146370 331359901 332651138 334044075 335403023 336451912 336878891 336484795 335307465
482 335307465 333658218 332039719 330963783 330740089 331328964 332336617 333169212 333289795 332462769
491 332462769 330869865 329038162 327613106 327085609 327601089 328932571 330610847 332132301 333142891
500 333142891 333526878 333392067 332989388 332615700 332528458 332878418 333658447 334683342 335622406 336102867
510 336102867 335860939 334880829 333448029 332072868 331301880 331495247 332670555 334483452 336352997
519 336352997 337674789 338030777 337318382 335762291 333820839 332030602 330840988 330483208 330901604
528 330901604 331766281 332569542 332791519 332093582 330472031 328304825 326247978 325001297 325025253 326331062
538 326331062 328446121 330588074 331979599 332165985 331191063 329550171 327948380 326983490 326900368
547C26900368O22139Q49685N31044j71241r63555j556015j771049j587372j116905
556C21737099n43137m8332K41165K81143J06507j93444n10139p47605q42704p72877
566C18707676n54962k41127Q7509L34434M14563K88276j2359l85437o96698q40034
576C17101841p86839n95836l73821k09446j22967o3191M5224K36969M65030O17943
586C16314907N84316L30277n9738m05560n11761k67200K87151R58824J477337J613026
596C20321579J288757O30036p6142n02395m33007J26725R38911J635094J883240J543693
606C27356491P34902k20528r41696j150933p80677J9378R59053J725884K088775J957207
616C31747856J390152N65605k72369q78105j071625p92236j23101P27616J486931J901741
$$ plain form
547 326900368 327522507 328372192 328903236 328731995 327768440 326212425 324441376 322854004 321737099
556 321737099 321193962 321145630 321386795 321667938 321774445 321581001 321070862 320323257 319480553 318707676
566 318707676 318152714 317911587 317999096 318333530 318748093 319036369 319024010 318638573 317941875 317101841
576 317101841 316315002 315719166 315345345 315135899 315012932 314949741 314994965 315231934 315696964 316314907
586 316314907 316899223 317229500 317169762 316764202 316252441 315985241 316272392 317231216 318708553 320321579
596 320321579 321610336 322240372 322164230 321661835 321228828 321355553 322294464 323929558 325812798 327356491
606 327356491 328091393 327870865 326929169 325778236 324997559 325016937 325975990 327701874 329790649 331747856
616 331747856 333138008 333703613 333431244 332553139 331481514 330689278 330566177 331293793 332780724 334682465
626C34682465J818428J233291K96326p29561j546211j913834j734161j093941k42615
635C30770187M96025Q52280P22923K16484l98025q14247q27027m19807K37579Q71239
645C31707611J220284J138610O43044r8953q29850j293907j332473r54667l47633J95274
655C30047340M13552K25486k02827n26085m10957K48756J223183K030945K191658J509323
665C36750374K18353j110039j857261j685334p12661N61142J530418J798134J352615
674C36845741N20630k47574o24389n41878j65291K47269M97207N22843L80783J73416
684C37608757j5488j42707j89400j42479L738K25983M56543N97458N63431L31764l4752
695C39262848m08363o51513o78215m89196j67008J63651L88908M47159L45001J46713
$$ plain form
626 334682465 336500893 337734184 338030510 337300949 335754738 333840904 332106743 331012802 330770187
635 330770187 331266212 332118492 332841415 333057899 332659874 331845627 331018600 330598793 330836372 331707611
645 331707611 332927895 334066505 334709549 334610596 333780746 332486839 331154366 330199699 329852066 330047340
655 330047340 330460892 330686378 330483551 329957466 329546509 329795265 331018448 333049393 335241051 336750374
665 336750374 336968727 335858688 334001427 332316093 331603432 332164574 333694992 335493126 336845741
674 336845741 337366371 337118797 336494408 335952530 335787239 336034508 336531715 337054558 337435341 337608757
684 337608757 337593269 337450562 337261162 337118683 337122421 337348404 337804947 338402405 338965836 339297600 339262848
695 339262848 338854485 338202972 337524757 337035561 336868553 337032204 337421112 337868271 338213272 338359985
705C38359985n4054j65901j25885Q6975M46243Q81539J286773J538124J524392J187744
715C44965935N61981k11487r11980j309509j259117p74841m2649O42701R96856Q70133
725C43528023L15208m32968j058769j303444j072731m72450K44484P86972R44595O64024
735C42142944N8709o47393j210518j457328j336556r23271l76549J23596M37394N03273
745C37314301L46565O1302k23045l81508l30429n4627L84865Q65288J241226J396980
755C40620918J292343R81598N93605K80381J54914K46697M94881P78312R69773R86518
765C47399940Q17528N20516J92833o7749j95885j76964m3640J40648L06282M00848
775C49294357M03061L24898K02866Q1329k861l2845j4724K9831P6141J12305J48697
$$ plain form
705 338359985 338305931 338140030 338014145 338101120 338547363 339428902 340715675 342253799 343778191 344965935
715 344965935 345527916 345316429 344404449 343094940 341835823 341060982 341018333 341661034 342657890 343528023
725 343528023 343843231 343410263 342351494 341048050 339975319 339502869 339747353 340534325 341478920 342142944
735 342142944 342201653 341554260 340343742 338886414 337549858 336626587 336250038 336373634 336811028 337314301
745 337314301 337660866 337722168 337499123 337117615 336787186 336732559 337117424 337982712 339223938 340620918
755 340620918 341913261 342894859 343488464 343768845 343923759 344170456 344665337 345443649 346413422 347399940
765 347399940 348217468 348737984 348930817 348863068 348667183 348490219 348446579 348587227 348893509 349294357
775 349294357 349697418 350022316 350225182 350306511 350303650 350270805 350256081 350285912 350362053 350474358 350623055
786C50623055K13088L35045N20745P35893R07402R49478Q04863M80538N5618l45535
796C55280190o05469o67038n56259l68386k20756j96953l12958n13763p04041p92122
806C50342445p29255n29900k65694l8223O1035j1902k31857n10864p31735p98569o78978
817C45876503m18892j20277J05667J85737J08185q6441l33938n75409p68547q82798
827C43089790q93287p85065n72662l15819j12534o1569k08435n07736q28743j010742
837C37793198r42231o22024j67465K35672M19769L12042l3302m60625p81936q54874
847C34898224o38542k06337K86331O61507P86590O23512K43721j99127n27572o10772
857C35317535m16526k3957M10614P19643P93076O22444K99911k3842k02293j53351
$$ plain form
786 350623055 350836143 351171188 351691933 352427826 353335228 354284706 355089569 355570107 355625725 355280190
796 355280190 354674721 354007683 353451424 353083038 352862282 352665329 352352371 351838608 351134567 350342445
806 350342445 349613190 349083290 348817596 348779373 348840408 348828506 348596649 348085785 347354050 346555481 345876503
817 345876503 345457611 345337334 345443001 345628738 345736923 345650482 345316544 344741135 343972588 343089790
827 343089790 342196503 341411438 340838776 340522957 340410423 340348854 340140419 339632683 338803940 337793198
837 337793198 336850967 336228943 336061478 336297150 336716919 337028961 336995659 336535034 335753098 334898224
847 334898224 334259682 334053345 334339676 335001183 335787773 336411285 336655006 336455879 335928307 335317535
857 335317535 334901009 334877052 335287666 336007309 336800385 337422829 337722740 337698898 337496605 337343254
867C37343254J11237M91905Q42476J028671R80454P19871L51524J9341j53351j14593
877C41620789R7618L76777N96962O67877N68047L43704Q0490j35116k46048k35138
887C43735962j21880M8752K16332L16581K97890J42136j18370m00048n94520o14472
897C42908363m38308j31379J74942L36915K63938l8147m64630q55903j062813j009712
907C39683266p23725l21884L9063K26555J84135n0392l66936o32706p49015o88095
917C36600266m95759k63748q6631k5445r1934k54936m58336o39686p44553p36313o08024
928C32194901l91312j56098P172K4185j25770l88756o53000p95250p41081n02129j72767
939C28300095J13983K48947J93787p287k55851m46320n09148m31251k49291k7236J70402
$$ plain form
867 337343254 337454491 337946396 338788872 339817543 340797997 341517868 341869392 341888733 341735382 341620789
877 341620789 341718407 342095184 342692146 343360023 343928070 344271774 344352264 344217148 343971100 343735962
887 343735962 343614082 343662834 343879166 344195747 344493637 344635773 344517403 344117355 343522835 342908363
897 342908363 342470055 342338676 342513618 342850533 343114471 343076324 342611694 341755791 340692978 339683266
907 339683266 338959541 338637657 338676720 338903275 339087410 339037018 338670082 338037376 337288361 336600266
917 336600266 336104507 335840759 335754128 335728683 335636749 335381813 334923477 334283791 333539238 332802925 332194901
928 332194901 331803589 331647491 331654663 331678848 331553078 331164322 330511322 329716072 328974991 328472862 328300095
939 328300095 328414078 328663025 328856812 328849525 328593674 328147354 327638206 327206955 326957664 326930428 327100830
950C27100830K98119L38325L02506K23922J47400J12458J39732K19154L12805L68386
960C29563637L43551K28119N3368j16348k10114j82571l8491J65520L40805M05045
970C30552521L19061J06010j55906l66631m47044l73039j86119K4070J57090J41220
980C29771233l7232l29780o42739q71544r37805q17909n52902k34413K6969J42899
990C25516777Q1749j19934l69949n58548o01921m75731k24266N8212K65465L19633
1000C23891487K00844m7302l33557n52292o21224n11169k58484M5051K82860L55606
1010C22451820K19384r5559m92973q46901j048698j049462q76331o18343l87307k71778
1020C16983852l04527m55189o48994q01029q50201p78236o11992m08421k32467j35251
$$ plain form
950 327100830 327398949 327737274 328039780 328263702 328411102 328523560 328663292 328882446 329195251 329563637
960 329563637 329907188 330135307 330188675 330072327 329862213 329679642 329641151 329806671 330147476 330552521
970 330552521 330871582 330977592 330821686 330455055 330008011 329634972 329448853 329472923 329630013 329771233
980 329771233 329734001 329404221 328761482 327889938 326952133 326134224 325581322 325346909 325373878 325516777
990 325516777 325598526 325478592 325108643 324550095 323948174 323472443 323248177 323306389 323571854 323891487
1000 323891487 324092331 324045029 323711472 323159180 322537956 322026787 321768303 321813354 322096214 322451820
1010 322451820 322671204 322575645 322082672 321235771 320187073 319137611 318261280 317642937 317255630 316983852
1020 316983852 316679325 316224136 315575142 314774113 313923912 313145676 312533684 312125263 311892796 311757545
1030C11757545j39083k31324l69949m97799n63240n40123m39224l04566j94854j57376
1040C08320007k06470l17040m37851n15709n20839m57287l58200k66914k17267k22168
1050C04800262k73361l49827m27303m85611n10197m95224m46052l80459l27129l14770
1060C00790329l57571m43573n33828n78309n39798m15592k43168q5373j564j9665j23291
1071B97448597k60372l68290m00353l44257k22568q1788K4853N3501j7929j81484l95889
1082B95254021n93129o96983o52675m56601j68113J05056K50664K02980k3079l35426
1092B92886715o06194p31163o75277m81873k44026n6191K7810Q182p4730j69105k35043
1103B89649105k53773k23426j50700m8714O0387J45168J72959J24855J1959j21670
$$ plain form
1030 311757545 311618462 311387138 311017189 310519390 309956150 309416027 308976803 308672237 308477383 308320007
1040 308320007 308113537 307796497 307358646 306842937 306322098 305864811 305506611 305239697 305022430 304800262
1050 304800262 304526901 304177074 303749771 303264160 302753963 302258739 301812687 301432228 301105099 300790329
1060 300790329 300432758 299989185 299455357 298877048 298337250 297921658 297678490 297593117 297591553 297571888 297448597
1071 297448597 297188225 296819935 296419582 296075325 295852757 295770969 295795822 295849323 295831394 295649910 295254021
1082 295254021 294660892 293963909 293311234 292854633 292686520 292791576 293042240 293245220 293222141 292886715
1092 292886715 292280521 291549358 290874081 290392208 290148182 290091991 290119801 290127983 290053253 289884148 289649105
1103 289649105 289395332 289171906 289021206 288972492 289032879 289178047 289351006 289475861 289487820 289366150
1113B89366150k13356k08111q6098J24359L54386N20344N57022M44164K17381m3164
1123B91033077k40192k96593j86252N2452L28540N34134N88780M74396K43091o733
1133B92524700j74122j99337q6784J02730K83451L83415L71761K65370J16215j2894
1143B93574505p1049l5381Q2187K39506L77083M39854L99933K72979J15700L796l166
1154B95395947J05667K83355M43993N04150M24481K30160j221j76296k28939j46676
1164B96834621K9087K26269L75424M34036L98693K99664J86843J11599J09902J90506
1174B99196644L29819M79641N83915O02780N30166L98979K67621J95178K17476L32871
1184C03135090N06153O82754Q08640Q45604P80411O28223M29707K42843J26305J19362
$$ plain form
1113 289366150 289152794 288944683 288858585 288982944 289337330 289857674 290414696 290858860 291076241 291033077
1123 291033077 290792885 290496292 290310040 290362492 290691032 291225166 291813946 292288342 292531433 292524700
1133 292524700 292350578 292151241 292064457 292167187 292450638 292834053 293205814 293471184 293587399 293574505
1143 293574505 293503456 293468075 293550262 293789768 294166851 294606705 295006638 295279617 295395317 295399113 295395947
1154 295395947 295501614 295784969 296228962 296733112 297157593 297387753 297386532 297210236 296981297 296834621
1164 296834621 296863708 297089977 297465401 297899437 298298130 298597794 298784637 298896236 299006138 299196644
1174 299196644 299526463 300006104 300590019 301192799 301722965 302121944 302389565 302584743 302802219 303135090
1184 303135090 303641243 304323997 305132637 305978241 306758652 307386875 307816582 308059425 308185730 308305092
1194C08305092K23293L95813N65186O58302O34727N05162L27320J80282J28289J92947
1204C12116413L45554N20401O42739O57329N48401L44048J05476r3593j93119j68801
1214C14824848m1942J25331K52972K73686J60656o0559l20492n33313o30074n85003
1224C13466110m24156k14138l6163M3602l662j59855l67432n50098o39592o01577m48799
1235C10064240k39888n8136J9455m5681k35691m79679o81457p58038o74763m60300
1245C06450062j93424L0479J39694J13907j2417j69391k84081l10230k43168j17283
1255C05404148J0815Q5258P1049l3054j91975l45173m26216l88718k27718J2894K53524
1266C04224834M07849M17557K77233L6831k17648l97472m43230l43838j35765J12324
$$ plain form
1194 308305092 308528385 308924198 309489384 310147686 310782413 311287575 311614895 311795177 311923466 312116413
1204 312116413 312461967 312982368 313625107 314282436 314830837 315174885 315280361 315186768 314993649 314824848
1214 314824848 314782906 314908237 315161209 315434895 315595551 315534992 315214500 314681187 314051113 313466110
1224 313466110 313041954 312827816 312791653 312835255 312831593 312671738 312304306 311754208 311114616 310513039 310064240
1235 310064240 309824352 309766216 309785671 309739990 309504299 309024620 308343163 307585125 306910362 306450062
1245 306450062 306256638 306287117 306426811 306540718 306528301 306358910 306074829 305764599 305521431 305404148
1255 305404148 305414963 305500221 305571270 305538216 305346241 305001068 304574852 304186134 303958416 303971310 304224834
1266 304224834 304632683 305050240 305327473 305364304 305146656 304749184 304305954 303962116 303826351 303938675
1276C03938675L23925M38385M28467L06968J21804n9719j74275j85394r7046M7970
1286C05089760J85776K58541K38876J41411J4686q0776r9773l1681R7275K37007L37047
1297C06388149L67832L31078K56329J86271J59760J99089L05557M61865O38027P98454
1307C10092411R08470R42764Q92754P72095O13537M58603L41682K76585K53028K44961
1317C15796890K26631J87283J36490R9258J01891J58310K61249L81871M79469N16548
1327C18345890M75178L67985K35881J32370R6569J31627J98593K34527J86081L9978
1337C20444679j68342l73345n13954n62668n31959m56505l69702k88047k16675j63975
1347C16799507j48468j87530k74907l65848l88756k82707m1142K70138N33390O33278
$$ plain form
1276 303938675 304262600 304700985 305129452 305436420 305558224 305498505 305324230 305138836 305041790 305089760
1286 305089760 305275536 305534077 305772953 305914364 305929050 305848274 305748501 305716820 305814095 306051102 306388149
1297 306388149 306755981 307087059 307343388 307529659 307689419 307888508 308194065 308655930 309293957 310092411
1307 310092411 311000881 311943645 312836399 313608494 314222031 314680634 315022316 315298901 315551929 315796890
1317 315796890 316023521 316210804 316347294 316446552 316548443 316706753 316968002 317349873 317829342 318345890
1327 318345890 318821068 319189053 319424934 319557304 319653873 319785500 319984093 320218620 320404701 320444679
1337 320444679 320276337 319902992 319389038 318826370 318294411 317837906 317468204 317180157 316963482 316799507
1347 316799507 316651039 316463509 316188602 315822754 315433998 315151291 315110149 315380287 315913677 316546955
1357C16546955N15404K15301j55506m59690n92327n20134k87533P038K52419L62453
1367C15884380L02067R3975j92661m68140o51703o96830o01597m02336j57547P0743
1377C13180351K29492K80419K05211J2284k55413n20783o89354o80847m65298q5449
1387C11210613L50952P05796Q64467P82872N07640J60523j09501j88618m6253K50454
1397C14488945N68028P69481P80354O23817M03004K40936K10877K99797M27379N06363
1407C19318981N05829M71630M89426O13098Q07075R45549Q74100N03426j23520q29277
1417C23576317j372719j558304j328640p95040j89075K42214L48759J45339k02407
1426C18866444m68712m93756k79655K213J01585j63956p89833j564350k167358k333470
$$ plain form
1357 316546955 317062359 317277660 317122154 316662464 316070137 315550003 315262470 315269508 315521927 315884380
1367 315884380 316186447 316280422 316087761 315619621 314967918 314271088 313669491 313267155 313109608 313180351
1377 313180351 313409843 313690262 313895473 313907757 313652344 313131561 312442207 311761360 311296062 311210613
1387 311210613 311561565 312267361 313131828 313914700 314422340 314582863 314473362 314284744 314238491 314488945
1397 314488945 315056973 315826454 316606808 317230625 317633629 317874565 318085442 318385239 318812618 319318981
1407 319318981 319824810 320296440 320785866 321398964 322206039 323151588 324025688 324529114 324405594 323576317
1417 323576317 322203598 320645294 319316654 318521614 318332539 318574753 318923512 319068851 318866444
1426 318866444 318397732 317903976 317624321 317626534 317728119 317564163 316774330 315209980 313042622 310709152
1436C10709152j986103j267013m48456K07329N57556N99136M14143J02062k45133n20877
1446C08121796n86243l11413L23086J133938J747799J759891R74140m22744j887589
1455C10852661k771492k667408j649055k42901Q65478J220455Q44899J95713j44634
1464C06503716J55696R68247J788635K054234J494350K97794r94205j793461j777744
1473C08697262j034317L0842R40227J393604J382847J134682R39941R79882J242160
1482C15707130J551476J684837J500359J022873M44641M4022M9400N08079J229020
1491C23741837J845321J992226J521568O32668j82190l80631L06092J660232L019104
1500C34156227L585053K852630R12590j551666l585243m431267l885269k347412n65300
$$ plain form
1436 310709152 308723049 307456036 307007580 307214909 307772465 308371601 308785744 308887806 308642673 308121796
1446 308121796 307535553 307224140 307547226 308681164 310428963 312188854 313162994 312740250 310852661
1455 310852661 308081169 305413761 303764706 303521805 304387283 305607738 306452637 306648350 306503716
1464 306503716 306659412 307627659 309416294 311470528 312964878 313262672 312268467 310475006 308697262
1473 308697262 307662945 307693787 308634014 310027618 311410465 312545147 313485088 314464970 315707130
1482 315707130 317258606 318943443 320443802 321466675 321911316 321955338 322004738 322512817 323741837
1491 323741837 325587158 327579384 329100952 329733620 329551430 329170799 329476891 331137123 334156227
1500 334156227 337741280 340593910 341506500 339954834 336369591 331938324 328053055 325705643 325140343
1509C25140343P66296J313248J166878O72416J68267j97526m80804q23097j304970
1518C26421051j875992k384147k663441k614021k235280j617527r14745l10936K8687
1527C11833649K2068k69947o37570q03985n75104K0008O96125J030388O87351l73306
1537C11629677j831665l134499l753280l434201k311344q28323M78706J221218J309643
1546B99345932R55582N44433M41628Q15639J549034K268830K498626J879216L71761
1555C10670681j655083l520622m493484m118386k450580o8989K157898L454494L482456
1564C03458385K473221J081791M1542j99299L28865J185017J791859J760063J084156
1573C13005600J14822o56986q72593m80652K70653R98917J402416J399212J125622
$$ plain form
1509 325140343 325906639 327219887 328386765 329059181 329227448 329029922 328549118 327726021 326421051
1518 326421051 324545059 322160912 319497471 316883450 314648170 313030643 312115898 311804962 311833649
1527 311833649 311855717 311585770 310948200 310144215 309569111 309589119 310285244 311315632 312002983 311629677
1537 311629677 309798012 306663513 302910233 299476032 297164688 296336365 296815071 298036289 299345932
1546 299345932 300301514 300845947 301287575 302103214 303652248 305921078 308419704 310298920 310670681
1555 310670681 309015598 305494976 301001492 296883106 294432526 294363537 296521435 299975929 303458385
1564 303458385 305931606 307013397 307054939 306855640 307184505 308369522 310161381 311921444 313005600
1573 313005600 313120422 312463436 311590843 311110191 311380844 312379761 313782177 315181389 316307011
1582C16307011Q15811O50101O62689P52372P70646O23188L23143k5483k92739l94135
1592C20192604l29857j79653o2389p9842k69814n86166r17396j141663j190796j091537
1602C14343491r50261q83903r36546j040364j057853q88005n68676k92301l08323p59659
1612C06657600j559524k399578k903214k838649k261010j491699r43985q97827j357937
1621B90004177k070045k672406k880001k599868j931534j087132k99816K28844L45669
1630B77037888l6717q92792k031192l088551l626003l313713k123604m10061J196957
1639B62712212K065162J873951P96852n63297j477280j482486o52657M20075R41867
1648B64634399L75004j217537l149738m446354m363556k805576l94974J853638L074150
$$ plain form
1582 316307011 317122822 317772923 318435612 319187984 319958630 320581818 320904961 320879478 320586739 320192604
1592 320192604 319862747 319683094 319620705 319540863 319271049 318684883 317767487 316625824 315435028 314343491
1602 314343491 313393230 312509327 311572781 310532417 309474564 308586559 308017883 307725582 307417259 306657600
1612 306657600 305098076 302698498 299795284 296956635 294695625 293203926 292259941 291362114 290004177
1621 290004177 287934132 285261726 282381725 279781857 277850323 276763191 276463375 276692219 277037888
1630 277037888 277001171 276108379 274077187 270988636 267362633 264048920 261925316 261515255 262712212
1639 262712212 264777374 266651325 267448177 266884880 265407600 263925114 263272457 263692532 264634399
1648 264634399 265009403 263791866 260642128 256195774 251832218 249026642 248631668 250485306 253559456
1657B53559456K991962K018776R55601M98390Q51326J671734K354031K446308J923961
1666B69271545J157628O26125N86986R34525J328545J482734J397457J364460J738835
1675B79888840K638530L786278M613457M576168L489780J677838j60771j291637j302109
1684B97916374k83279J250038K637558L391571L383999K825908K075997J407528Q69598
1693C15475292L12214m55952j485862k600499l459911l742199l333263k408047j353455
1702B96948318n71823k77824m03099o58856p18250m11663J71490P25193Q88138M34570
1712B96126194n98202j905937l037338l581944l345909k436600j215934j37368M64592
1721B80331554N28946K83242J00784K69127P98569J391334J602974J115112m1752j456375
$$ plain form
1657 253559456 256551418 258570194 259525795 260024185 260875511 262547245 264901276 267347584 269271545
1666 269271545 270429173 271055298 271642284 272576809 273905354 275388088 276785545 278150005 279888840
1675 279888840 282527370 286313648 290927105 295503273 298993053 300670891 300510120 299218483 297916374
1684 297916374 297633095 298883133 301520691 304912262 308296261 311122169 313198166 314605694 315475292
1693 315475292 315787506 315331554 313845692 311245193 307785282 304043083 300709820 298301773 296948318
1702 296948318 296376495 296098671 295695572 295036716 294318466 293906803 294078293 294803486 295691624 296126194
1712 296126194 295527992 293622055 290584717 287002773 283656864 281220264 280004330 279866962 280331554
1721 280331554 280860500 281143742 281244526 281513653 282312222 283703556 285306530 286421642 286379890 284923515
1731B84923515k530002k791519k152367r50623K41642R32026R59263N40142J00556
1740B79272633M787L48244R28020J390705J454277J068516M31652j31206l42312j00041
1750B84325275M96769J223755J845761K209758K276383K096271J763268J379490J043758
1759B98660488Q53348Q91952J196213J709938K264309K613297K529850J922702R10607
1768C13552704j97315j022263j281910r17187j13906P92541J472988J737881J585770
1777C15609303J161499O66694K80781J22776K43988O25458J165752J679230J934776
1786C23490257J747513J088257J41907p39975j191407j016464l03535O05316J279678
1795C25101547J416741R88159K42653m33846p17621n00526P7743P20902J133499J158257
$$ plain form
1731 284923515 282393513 279601994 277449627 276499004 276740646 277672672 278631935 279172077 279272633
1740 279272633 279277420 279625664 280553684 281944389 283398666 284467182 284898834 284767628 284425316 284325275
1750 284325275 284822044 286045799 287891560 290101318 292377701 294473972 296237240 297616730 298660488
1759 298660488 299513836 300405788 301602001 303311939 305576248 308189545 310719395 312642097 313552704
1768 313552704 313355389 312333126 311051216 310134029 310020123 310812664 312285652 314023533 315609303
1777 315609303 316770802 317437496 317718277 317841053 318085041 318710499 319876251 321555481 323490257
1786 323490257 325237770 326326027 326467934 325727959 324536552 323520088 323216553 323821869 325101547
1795 325101547 326518288 327506447 327749100 327315254 326597633 326097107 326174850 326895752 328029251 329187508
1805C29187508Q29391L29971j14631l44658l24440j29776J15623L12500M27056M81910
1815C30770454N16701N48248N61142N31197M55551L62969K90718K47955J99356Q8654
1825C34572945j09482l49732n27038n37148l49083l3722K79274M87137N81246O41098
1835C34655495P53021R16443J010742Q63190L78189l59307j088676j497269j393051
1844C34238777q17985l0251O35643R44214Q64601N52406K32087O0424N6382J25846
1854C36862144J52932Q8081j9379o1607M9973L16085O33812Q39005P87659M33578j37100
1865C39945183p30934j127282j175422q62885l21006K37464O15654P14913N61333K70423
1875C38127441k2430k20451k85569k25067o5689J54267L79409N33448N39665L63426
$$ plain form
1805 329187508 330016899 330346870 330232239 329887581 329563141 329433365 329548988 329861488 330288544 330770454
1815 330770454 331287155 331835403 332396545 332927742 333383293 333746262 334036980 334284935 334484291 334572945
1825 334572945 334463463 334113731 333586693 333049545 332700462 332666740 332946014 333433151 334014397 334655495
1835 334655495 335408516 336324959 337335701 338198891 338577080 338217773 337129097 335631828 334238777
1844 334238777 333420792 333390541 334026184 334970398 335834999 336387405 336619492 336679916 336736298 336862144
1854 336862144 337015076 337103157 337083778 337022171 337072144 337388229 338022041 338861046 339648705 340082283 339945183
1865 339945183 339214249 338086967 336911545 336048660 335727654 335965118 336580772 337295685 337857018 338127441
1875 338127441 338105011 337884560 337598991 337373924 337308235 337462502 337841911 338375359 338915024 339278450
1885C39278450M8485k85835m96865m94919k95410j0910K14043K82974J92337J7395
1895C38449745j45111k32658k36168j80359q9035K8267J62506K82783L34626K69317
1905C38643913Q8196j38664k98844l01017j35269J14173L12272L50036K04430n4436
1915C38784790l09753m64173m85306m05235k84462j70059p6256N112P9842J33895J39656
1926C36948051P5722m9820j95236l00102l12844k15034l1929J75018L29895L68500
1936C36792221K62795L3836k51618n01365o31981o00205m24346j76506M6119J63117
1946C34712067J45225K4109j26266k27127k32239j47858k4071P3891J00098N0354m0016
1957C34308167j17226j40190j01242k9145K8801L2311l0441j38016k47383l15667l18717
$$ plain form
1885 339278450 339326935 339041100 338544235 338049316 337753906 337742996 337957039 338240013 338432350 338449745
1895 338449745 338304634 338071976 337835808 337655449 337566414 337594681 337757187 338039970 338374596 338643913
1905 338643913 338732109 338593445 338294601 337993584 337858315 337972488 338284760 338634796 338839226 338784790
1915 338784790 338475037 338010864 337525558 337120323 336835861 336665802 336589546 336594658 336674500 336808395 336948051
1926 336948051 337023773 336973953 336778717 336478615 336165771 335950737 335918808 336093826 336423721 336792221
1936 336792221 337055016 337088852 336837234 336335869 335703888 335103683 334679337 334502831 334548950 334712067
1946 334712067 334857292 334881401 334755135 334528008 334295769 334147911 334123840 334197731 334297829 334348183 334308167
1957 334308167 334190941 334050751 333949509 333920364 333949165 333981476 333951035 333813019 333565636 333249969 332931252
1968C32931252k59018j60485n5847K8038P5951Q5067N9662P515o0959j30806j81465
1979C32338905j90010j40609l5782R7122K10609K54059J98288N3330j28556k73208
1989C32384148l16964k39524p5837R7237J97907J78299M8942j26991k63748k93579
1999C31589890j98060j3847J84898L20473L43552K51579Q6212q5983k01492k23542
2009C32053680j55220l4561Q2360J46522J33591N2871o1798j68304k34184k46697k11143
2020C31357117j44158o3476J4305P5226J05476R5177M3068l7346j19438j72882j77079
2031C30975990j32446o0349P058M2267L4561o790n9929j01242j15090r8076n8326j0720
2043C30416908K6436L8109J6899l1395q7089j23978j20392p3395k746N6686P3204L6430
$$ plain form
1968 332931252 332672234 332511749 332455902 332483940 332559891 332644958 332704620 332712135 332651176 332520370 332338905
1979 332338905 332148895 332008286 331972504 332069626 332280235 332534294 332732582 332785912 332657356 332384148
1989 332384148 332067184 331827660 331751823 331849060 332046967 332225266 332274208 332147217 331883469 331589890
1999 331589890 331391830 331377983 331562881 331883354 332226906 332478485 332564697 332478714 332277222 332053680
2009 332053680 331898460 331863899 331946259 332092781 332226372 332279243 332217445 332049141 331814957 331568260 331357117
2020 331357117 331212959 331149483 331163788 331239014 331344490 331439667 331482735 331445389 331325951 331153069 330975990
2031 330975990 330843544 330783195 330790253 330832520 330867081 330860291 330800362 330699120 330584030 330485954 330427628 330416908
2043 330416908 330443344 330481453 330498352 330466957 330379868 330255890 330135498 330062103 330059357 330116043 330189247 330225677
2055C30225677l4828j02615j29776j02387l6735K9564N7983K9831m6425j40495k16331
2066C29533463k47002k22054j48773m7378N3596J22490J32980P3891m1351j73912k71225
2077C28764725k88964k12707o8092Q8081J93176K06070J25008j4076j54686k44484
2087C28394051k53563j82877n9853P2747J70326K00195J51406L9520r6016k05612k47307
2098C27983017k05002r5901L6659J41144J80130J43699N0850o1798j56746k07901k06032
2109C27602119j57699p9079Q278Q2817J26076J27754Q9798K7580l3989o9389o1607
2120C27662659j1254O3210J31836J63727J40152O2141m8409j55372k21977k24915j63841
2131C27397957o3553L5782R3574Q5869J5259q9989j86691k36092k18429j42822m2115
$$ plain form
2055 330225677 330190849 330088234 329958458 329856071 329819336 329848900 329906883 329936714 329890289 329749794 329533463
2066 329533463 329286461 329064407 328915634 328868256 328921852 329044342 329177322 329251213 329209862 329035950 328764725
2077 328764725 328475761 328263054 328194962 328283043 328476219 328682289 328807297 328793221 328638535 328394051
2087 328394051 328140488 327957611 327897758 327970505 328140831 328341026 328492432 328531952 328435936 328230324 327983017
2098 327983017 327778015 327682114 327718773 327859917 328040047 328183746 328234596 328172798 328016052 327808151 327602119
2109 327602119 327444420 327365341 327373619 327456436 327582512 327710266 327800064 327827644 327793655 327724266 327662659
2120 327662659 327651405 327714615 327846451 328010178 328150330 328212471 328164062 328008690 327786713 327561798 327397957
2131 327397957 327334404 327370186 327463760 327549629 327564888 327474899 327288208 327052116 326833687 326690865 326648750
2142C26648750M0551P0533L6736m3068j31264j86424j82495j20125k5215O4354J16729
2153C26289062J19591Q3313L2654p706k4261j8387j907J1520J3466J869j9760m4479
2165C26434975o4087o9046n0888o333N7221J20201J56593J44539P8812k3651j28746
2176C26649590j98555k08245j56860o6147K8572R3994J10359P7324J0147o6337j27525
2187C26146317j54572j39580q6937j2397N9013J00670R2506L0403o9542j73378k40364
2198C25552139k39639j65062m1428Q2856J55258J42479M7569q9989k10304k61230k20299
2209C24752350j05820L4218J44196J85012J48087N3978n9433j55029k06414k04734
2219C24586411j56098p8545K366N9852P2975L5477l9329j21422j75171j74866j18408
$$ plain form
2142 326648750 326689301 326759834 326796570 326753502 326622238 326435814 326253319 326133194 326107979 326172333 326289062
2153 326289062 326408653 326491966 326524620 326516914 326492653 326474266 326472359 326483879 326497345 326499214 326479454 326434975
2165 326434975 326370888 326301842 326250954 326244621 326301842 326422043 326578636 326723175 326801987 326778336 326649590
2176 326649590 326451035 326242790 326085930 326019783 326048355 326142349 326252708 326330032 326340179 326273842 326146317
2187 326146317 325991745 325852165 325765228 325752831 325811844 325912514 326005020 326035423 325965881 325792503 325552139
2198 325552139 325312500 325147438 325106010 325188866 325344124 325486603 325534172 325444183 325233879 324972649 324752350
2209 324752350 324646530 324680748 324824944 325009956 325158043 325212021 325152588 324997559 324791145 324586411
2219 324586411 324430313 324351768 324354134 324413986 324486961 324522438 324483109 324361687 324186516 324011650 323893242
2230C23893242k9030N5008R8305Q4343K2621n7068j18332j34544r7275j8158P8163
2241C23777275J63269K13585K16904J74331R9945J6404n0621q3199p6027m0245J755
2252C24413376K5215J4992k8458q8920j42441j68190j56822j13640n5771m120K2621
2263C23717842J5679k1935p5493j22757j42059j22948p4005k2545m120m3106j35803
2274C22968750k44331l10135k80762j39160Q2817L13873M72756N03959M00277K04658
2284C23972702j0338j72691k36473j94206p3510P6218K01416K61650K41432J55030
2294C24221230M2228m5509o4087P019J55602L42102N13687O20842O31294N35927L49579
2305C27309914J09787j27755k96745l34320k02827Q9874M79774Q53424J079522J052589
$$ plain form
2230 323893242 323864212 323919220 324017525 324101868 324124489 324067421 323949089 323814545 323717270 323699112 323777275
2241 323777275 323940544 324154129 324371033 324545364 324645309 324661713 324611092 324527893 324451866 324411621 324413376
2252 324413376 324438591 324453583 324425125 324336205 324193764 324025574 323868752 323755112 323699341 323695221 323717842
2263 323717842 323733521 323711586 323636093 323513336 323371277 323248329 323174324 323151779 323147659 323104553 322968750
2274 322968750 322724419 322414284 322133522 321994362 322077179 322391052 322863808 323367767 323768044 323972702
2284 323972702 323962364 323789673 323553200 323358994 323285484 323361702 323563118 323824768 324066200 324221230
2294 324221230 324263458 324217949 324153862 324160881 324316483 324658585 325172272 325793114 326424408 326960335 327309914
2305 327309914 327419701 327291946 326995201 326660881 326458054 326547928 327027702 327881126 328960648 330013237
2315C30013237P39670K05765l97950q84781j109848j038703p72439n04989m26445o17829
2325C25205688r97200j355705j471519j240082p40929j96590J53179J84536o1855m45748
2335C19033775q59470j320763j944618k795238l716660m280605l929825k272701O28795
2344B98542690M160462P334957R183082R162713P375526M486275J398658j131324k750130
2353C37762909l529167l789292l859939l913613l941974l846970l559341l105660k593746
2362C05623207k146110j833477j648846j528378j395282j199398r32312o20442l04603
2371B94014359j8387K26764M45443O70471R35230J251411J594696J907063K117119
2380C03144169K169895K051888J797027J472569J152095Q89607P06539N92747N17883
$$ plain form
2315 330013237 330752907 330958672 330560722 329675941 328566093 327527390 326754951 326249962 325823517 325205688
2325 325205688 324208488 322852783 321381264 320141182 319400253 319203663 319356842 319541378 319479523 319033775
2335 319033775 318174305 316853542 314908924 312113686 308397026 304116421 300186596 297913895 298542690
2344 298542690 302703152 310038109 319221191 328383904 335759430 340245705 341644363 340513039 337762909
2353 337762909 334233742 330444450 326584511 322670898 318728924 314881954 311322613 308216953 305623207
2362 305623207 303477097 301643620 299994774 298466396 297071114 295871716 294939404 294318962 294014359
2371 294014359 293995972 294222736 294668179 295338650 296273880 297525291 299119987 301027050 303144169
2380 303144169 305314064 307365952 309162979 310635548 311787643 312677250 313383789 313976536 314494419
2389C14494419M48094L56864K35272R4032l8929j28670j46980q5525L7422J81465K98119
2400C15745583L47919L14159K06776N8670q6002j85166k11677j62640o1760M7417J17283
2411C16130562J16730M5375o5078j64872k10914j87378j12496k7160K7351L0480j0243
2422C15572357o7119j09425j19572r8819o2542k8954r975q374k0504m1275o7081r4280
2434C14844437j17245j27411j16844q4019l8490R5Q679k7237j04618k00615k80037
2445C13756695l10078k74982j84536p0629K5520P0133N0373k2316j16787j96323k31609
2456C12495461k11525j46447o4048M57J7720k4281j13506k17877k96325l16029k66457
2467C10857143j63993m4957M9954R2602P6618J6327o3267j37558j91135k18201k19860
$$ plain form
2389 314494419 314942513 315299377 315534649 315628681 315589752 315461082 315314102 315228577 315265999 315447464 315745583
2400 315745583 316093502 316407661 316614437 316673107 316587105 316401939 316190262 316027622 315965862 316013279 316130562
2411 316130562 316247292 316292667 316227589 316062717 315851803 315664425 315551929 315524769 315552120 315582600 315572357
2422 315572357 315505238 315395813 315276241 315177422 315114880 315085926 315075951 315067577 315047073 315005798 314938717 314844437
2434 314844437 314727192 314599781 314482937 314398918 314360428 314360523 314369202 314341965 314237347 314036732 313756695
2445 313756695 313446617 313171635 312987099 312916470 312941990 313012123 313062496 313040180 312923393 312727070 312495461
2456 312495461 312283936 312137489 312073441 312073898 312091618 312067337 311953831 311735954 311439629 311123600 310857143
2467 310857143 310693150 310648193 310698147 310790749 310867367 310883694 310820427 310682869 310491734 310273533 310053673
2478C10053673k00787j68114j32541j07594j05591j30577j72557k09275k14748j72939
2488C08438950q8921J0662Q8196J12285P3300j2303j08795j78203j95809j58977q5240
2499C07895145k517O2256R1800Q1406L8586k1153p7324j10493j08165p0973j4362L5343
2511C07799549N1632J9913n3921j44711k19268k50759k31514j74542j06468n3616l1433
2522C06604862l8681o1493q1176q3066o1340k1534K2602N2738N1461R460o9713j67160
2534C06156960k52781k95144k75058j94855q0662K6665Q7948Q2207J5983p9002j59798
2545C05032463j90163j56726p4025K1668Q7471R2468L0918p5283j85127k55146k57816
2556C04070702j93634r0676O371N5542L5915m2724j44082k21309k38247j85738q6078
$$ plain form
2478 310053673 309852886 309684772 309552231 309444637 309339046 309208469 309035912 308826637 308611889 308438950
2488 308438950 308350029 308360691 308448887 308561172 308634472 308622169 308513374 308335171 308139362 307980385 307895145
2499 307895145 307892628 307954884 308046684 308128090 308166676 308145523 308068199 307957706 307849541 307778568 307764206 307799549
2511 307799549 307851181 307871094 307817173 307672462 307453194 307202435 306970921 306796379 306689911 306636295 306604862
2522 306604862 306566181 306504688 306423512 306340446 306279106 306257572 306280174 306332912 306384373 306393833 306324120 306156960
2534 306156960 305904179 305609035 305333977 305139122 305058460 305085125 305173073 305255280 305271263 305192261 305032463
2545 305032463 304842300 304685574 304611549 304633217 304720688 304813156 304844074 304768791 304583664 304328518 304070702
2556 304070702 303877068 303786392 303792763 303848305 303884220 303841496 303697414 303476105 303237858 303052120 302966042
2567C02966042J7833Q1311P8830J3600q5068j75934k24552k15015j54000o3515K9240
2578C02268772J00937J36452J28555P8239n760j05362j95198k48947k49500j98097
2588C01710091j16482l9959j602j7414p8736j55372k10247k15722j65061p4387K6054
2599C00661163J04161J38054J22642O9027k48n9910r0446q4496n0316r060J3676j392
2611C00812855n6973j35841k06604k36244k05403j17702l05J06411J63898J49956O6376
2622C00340424o1646j94893k92167l23296k78721j72558l8681P9613J44482J37519
2632B99340076O6548l7251j32084j83162j77517j27583o5117k5482l1509q3962j61934
2643B98381023k33287k67640k48146j77784p6847K3747R2830J09330O8798j4477j12190
$$ plain form
2567 302966042 302983875 303065186 303144016 303157616 303072548 302896614 302672062 302457047 302303047 302239532 302268772
2578 302268772 302369709 302506161 302634716 302712955 302707195 302601833 302406635 302157688 301908188 301710091
2588 301710091 301593609 301553650 301552048 301534634 301455898 301300526 301090279 300874557 300709496 300635109 300661163
2599 300661163 300765324 300903378 301026020 301095047 301094799 301034889 300944443 300859947 300809631 300800571 300814247 300812855
2611 300812855 300755882 300620041 300413437 300177193 299971790 299854088 299853783 299960194 300124092 300274048 300340424
2622 300340424 300278778 300083885 299791718 299468422 299189701 299017143 298978462 299058075 299202557 299340076
2632 299340076 299406624 299369373 299237289 299054127 298876610 298749027 298683910 298658428 298626919 298542957 298381023
2643 298381023 298147736 297880096 297631950 297454166 297377319 297401066 297493896 297603226 297672024 297657547 297545357
2654B97545357j91403k26688k10400j55124q9379m4632m1732q1521j44252j98574k16198
2665B95945454j85261j15872l6010K0637K9869j2722r0732j74313k33364k49844k23560
2676B94674282j70269j13392p4234o4888q5678j28155j78260k21692k46429k45705
2686B93145580k19516j76049j30558j00555j00384j33381j89342k47135k81697k74868
2696B91292095k23427j40667n2719J1769L2024K995o2371j39141j99432k23522k07901
2707B90089703j66283j23806j04904j22795j72539k33631k78931k87647k53830j89037
2717B88156300j16425n9738l4905m3735p5455j12095j36261j37710j17188q6250o3496
2728B87173042o7043j06564j76963k58027l19862l35197k90661j94550p5226K9526
$$ plain form
2654 297545357 297353954 297127266 296916866 296761742 296672363 296627731 296585999 296504478 296360226 296161652 295945454
2665 295945454 295760193 295644321 295608311 295628948 295658817 295646095 295555363 295381050 295147686 294897842 294674282
2676 294674282 294504013 294390621 294316387 294251499 294165821 294037666 293859406 293637714 293391285 293145580
2686 293145580 292926064 292750015 292619457 292518902 292418518 292285137 292095795 291848660 291566963 291292095
2696 291292095 291068668 290928001 290875282 290887051 290919075 290922070 290859699 290720558 290521126 290297604 290089703
2707 290089703 289923420 289799614 289694710 289571915 289399376 289165745 288886814 288599167 288345337 288156300
2717 288156300 288039875 287980137 287945232 287901497 287826042 287713947 287577686 287439976 287322788 287236538 287173042
2728 287173042 287105999 286999435 286822472 286564445 286244583 285909386 285618725 285424175 285348949 285378475
2738B85378475Q6632Q1120K0771o7482j49250j95389j92299j45645p6237j2360K1172
2749B84749508J0490m2762j23539k08664k74659l04851k93751k46906j78528j06144
2759B82980194m6444j1654o752k9640p1506j20068j63841j95828k16942k34069k56100
2770B81627350k87762l25374l57056l67107l45173k91825k21843j59779j30692j49498
2780B78991241k13565l00751l76835m07658l73630k79255j54705m5166O008k3785j25866
2791B76696033k62908l84007m46567m33865l59917k60277j74274j27468j24912j54667
2801B73967171j99414k46200k90299l30276l62644l79029l70750l36590k87819k45590
2811B70918560k30541k52114l02276l59574m00695m11816l94192l61461l30029l11527
$$ plain form
2738 285378475 285465107 285546227 285566998 285499516 285350266 285154877 284962578 284816933 284740696 284728336 284749508
2749 284749508 284759998 284717236 284593697 284385033 284110374 283805523 283511772 283264866 283086338 282980194
2759 282980194 282933750 282922096 282915344 282885704 282814198 282694130 282530289 282334461 282117519 281883450 281627350
2770 281627350 281339588 281014214 280657158 280290051 279944878 279653053 279431210 279271431 279140739 278991241
2780 278991241 278777676 278476925 278100090 277692432 277318802 277039547 276884842 276839676 276845684 276821899 276696033
2791 276696033 276433125 276049118 275602551 275168686 274808769 274548492 274374218 274246750 274121838 273967171
2801 273967171 273767757 273521557 273231258 272900982 272538338 272159309 271788559 271451969 271164150 270918560
2811 270918560 270688019 270435905 270133629 269774055 269373360 268961544 268567352 268205891 267875862 267564335
2821B67564335l08418l15724l25069l28350l19500k96383k63004k31152k20146k48013
2831B64708576l22628m31404n42183o16112o27060n77926n02529m50459m61922n46379
2841B59629974o77852q08907q95042r15413q79517q15429p52640p06330o73694o42471
2851B51862679o01578n48554m88910m29860l74755l22533k71988k25944j92681j80721
2861B48225155j92318k18411k41355k41547k07729j43452o6128N34L7766M0836K1152
2872B47014503N54m39K6379P1506J13106J28441J07879N9605O638k6894k8725m329
2884B47468224K8133M9877N2490M1104K7084J8101J1730k022l1147p3604j15738j40572
2896B47333660j38683j14479q3657o3629o3343q0070j04008j25732j41526j52549j60752
$$ plain form
2821 267564335 267255917 266940193 266615124 266286774 265967274 265670891 265407887 265176735 264956589 264708576
2831 264708576 264385948 263954544 263412361 262796249 262169189 261591263 261088734 260638275 260176353 259629974
2841 259629974 258952122 258143215 257248173 256332760 255453243 254637814 253885174 253178844 252505150 251862679
2851 251862679 251261101 250712547 250223637 249793777 249419022 249096489 248824501 248598557 248405876 248225155
2861 248225155 248032837 247814426 247573071 247331524 247123795 246980343 246914215 246914749 246952515 246993351 247014503
2872 247014503 247015057 247014618 247040997 247112503 247225609 247354050 247461929 247521534 247528172 247501278 247472553 247468224
2884 247468224 247496357 247546234 247598724 247639828 247666912 247685013 247696743 247694721 247663574 247589970 247474232 247333660
2896 247333660 247194977 247080498 246996841 246933212 246869869 246789799 246685791 246560059 246418533 246265984 246105232
2907B46105232j65691j66531j66588j74961k02541k52876l14522l63140l72486l30773
2917B43595123k50644j64719j09901j07003j50432k11811k57187k65064k37008j92413
2927B41648941j55830j41754j47267j55620j46103j04008k7676P2670J78070K67792
2937B41289215L23925L36876L08075K50835J86673J39942J27582J53084K04086K56062
2947B43576355K82478K65103K01263J05648M940p1869j04141q6269k9164M4957J11198
2958B44300499J52607J64719J57070J47171J52645J83735K38933L07236L72410M20513
2968B46597538M44946M48723M42124M37297M42944M59766M81873M99019N03178M91791
2978B51249199M68254M40159M14390L95985L87745L92170M12006M47693M93431N34821
$$ plain form
2907 246105232 245939541 245773010 245606422 245431461 245228920 244976044 244661522 244298382 243925896 243595123
2917 243595123 243344479 243179760 243069859 242962856 242812424 242600613 242343426 242078362 241841354 241648941
2927 241648941 241493111 241351357 241204090 241048470 240902367 240798359 240770683 240843353 241021423 241289215
2937 241289215 241613140 241950016 242258091 242508926 242695599 242835541 242963123 243116207 243320293 243576355
2947 243576355 243858833 244123936 244325199 244430847 244435787 244363918 244259777 244173508 244144344 244189301 244300499
2958 244300499 244453106 244617825 244774895 244922066 245074711 245258446 245497379 245804615 246177025 246597538
2968 246597538 247042484 247491207 247933331 248370628 248813572 249273338 249755211 250254230 250757408 251249199
2978 251249199 251717453 252157612 252572002 252967987 253355732 253747902 254159908 254607601 255101032 255635853
2988B55635853N52254N29651M65679L78723L02849K72503L04680L87440M82445N42240
2998B59854317N33237M54235L38822K40326K07309K58904L75595N06172N91011N87597
3008B63947525M89693L29475J63517M9229K1610Q0643J93653L10974L86257L93562
3018B66366138L35045K35787J31664N4646K3021L7079Q3008J39408J84784K02980J87111
3029B67980671J39885P2536K079n3424p9728p0915l2024K2468P2060R7446Q5793L6087
3041B68272934m0722j24836j94473k33650k37923k16236j86844j69086j74885k02446
3051B66491833k36225k55013k41451j91956j21364n7030k9125n6591j38340k51770
3061B64912968l61214m30832m38423l82423k81201j64757o2408O370L5935L2558Q278
$$ plain form
2988 255635853 256188107 256717758 257183437 257562160 257865009 258137512 258442192 258829632 259312077 259854317
2998 259854317 260387554 260841789 261180611 261420937 261628246 261887150 262262745 262768917 263359928 263947525
3008 263947525 264437218 264766693 264930210 264979439 265001049 265081692 265275345 265586319 265972576 266366138
3018 266366138 266701183 266936970 267068634 267123280 267146301 267183380 267266388 267405796 267590580 267793560 267980671
3029 267980671 268120556 268193092 268195171 268141747 268062019 267991104 267959080 267981548 268053608 268151054 268236847 268272934
3041 268272934 268232212 268107376 267912903 267679253 267441330 267225094 267038250 266869164 266694279 266491833
3051 266491833 266255608 266000595 265759144 265567188 265445824 265388794 265359669 265303078 265164738 264912968
3061 264912968 264551754 264120922 263682499 263300076 263018875 262854118 262791710 262798080 262834015 262866573 262874851
3072B62874851k5005n8479q7414j08681j20563j22776j17379j08585j00880r5730q9969
3083B61839390p6981n1365j3637K8114O0864P3566O3782L8414J0223j0319k0465k5502
3095B61916084l2291m2210m7836l6316J335O2962J33075J90506K18258K12231J82476
3106B62758274J44882J12877R0847P4902N9528M2896K8477K0657J9512J8711R899j0624
3118B63370838l6335n2376m4326q030M4517Q9894J04122P5092Q640p3890j46752j90544
3130B63140850j99280j80092j46789j14288r2507q7147r8438j22795j52531j76544
3140B61770439j83563j67236j30616q6212n2452m4804o8378j15166j67598k06986k21825
3151B60325603k12287j88942j66169j56707j66932j95903k37255k82040l20396l44086
$$ plain form
3072 262874851 262849846 262791367 262703953 262595272 262474709 262351933 262234554 262125969 262025089 261929359 261839390
3083 261839390 261762409 261711044 261697407 261725521 261786385 261859951 261923733 261962147 261972370 261962051 261941586 261916084
3095 261916084 261883793 261841583 261793747 261757431 261758766 261821728 261954803 262145309 262363567 262575798 262758274
3106 262758274 262903156 263016033 263106880 263181782 263241310 263284206 263312683 263333340 263352852 263371563 263381462 263370838
3118 263370838 263334503 263282127 263237801 263229771 263274288 263364182 263468304 263543396 263552036 263478146 263331394 263140850
3130 263140850 262941570 262761478 262614689 262500401 262407894 262320747 262222309 262099514 261946983 261770439
3140 261770439 261586876 261419640 261289024 261202812 261150360 261105556 261037178 260922012 260754414 260547428 260325603
3151 260325603 260113316 259924374 259758205 259601498 259434566 259238663 259001408 258719368 258398972 258054886
3161B58054886l47462l29208k92950k46715k01130j65882j47629j47801j62811j85566
3171B55827732k07500k22035k27203k26822k29187k43149k72446l12118l48950l67660
3181B53170662l58830l25355k82440k50683k45934k72121l19519l70846m09698m27800
3191B49907436m24823m05560l75042l36304k92625k49729k17266k05345k19078k53926
3201B46927738k96078l27587l34282l11966k69145k22188j89094j81904k01816k39087
3211B44354591k76451k96211k87743k51388k01092j58234j43966j70593k35520l21979
3221B42011414m04625m60110m74663m50001m01401l51544l21750l23315l54195l99665
3231B38070145m40312m60205m54883m32892m10080m00791m09546m28219m41113m35028
$$ plain form
3161 258054886 257707424 257378216 257085266 256838551 256637421 256471539 256323910 256176109 256013298 255827732
3171 255827732 255620232 255398197 255170994 254944172 254714985 254471836 254199390 253887272 253538322 253170662
3181 253170662 252811832 252486477 252204037 251953354 251707420 251435299 251115780 250744934 250335236 249907436
3191 249907436 249482613 249077053 248702011 248365707 248073082 247823353 247606087 247400742 247181664 246927738
3201 246927738 246631660 246304073 245969791 245657825 245388680 245166492 244977398 244795494 244593678 244354591
3211 244354591 244078140 243781929 243494186 243242798 243041706 242883472 242739506 242568913 242333393 242011414
3221 242011414 241606789 241146679 240672016 240222015 239820614 239469070 239147320 238824005 238469810 238070145
3231 238070145 237629833 237169628 236714745 236281853 235871773 235470982 235061436 234633217 234192104 233757076
3241B33757076m07161l67985l35465l24344l38574l68080l94344m00410l78284l32890
3251B30109539k78740k32963k09198k13299k41928k84882l27644l55492l57647l30238
3261B27277508k78893k16446j60198j26037j24455j58272k23007l07713l97586m75445
3271B24809456n24216n31578m93984m19827l28140k43072j85681j66778j84517k26975
3281B21504688k78148l23506l53603l63236l50799l18222k71988k23866j89457j83067
3291B18648796k11143k67849l36552l95794m28696m29630m04835l68595l34949l12443
3301B15158310l01933k99301k99397k98386k94780k87018k72217k46601k08950j63460
3311B12486267j21860j00480j13678j65863k47154l34320m00429m25777m08173l63254
$$ plain form
3241 233757076 233349915 232981930 232646465 232322121 231983547 231615467 231221123 230820713 230442429 230109539
3251 230109539 229830799 229597836 229388638 229175339 228933411 228648529 228320885 227965393 227607746 227277508
3261 227277508 226998615 226782169 226621971 226495934 226371479 226213207 225990200 225682487 225284901 224809456
3271 224809456 224285240 223753662 223259678 222839851 222511711 222268639 222082958 221916180 221731663 221504688
3281 221504688 221226540 220903034 220549431 220186195 219835396 219517174 219245186 219021320 218831863 218648796
3291 218648796 218437653 218169804 217833252 217437458 217008762 216579132 216174297 215805702 215470753 215158310
3301 215158310 214856377 214557076 214257679 213959293 213664513 213377495 213105278 212858677 212649727 212486267
3311 212486267 212364407 212263927 212150249 211984386 211737232 211402912 211002483 210576706 210168533 209805279
3321B09805279l17135k91653k93369l10803l23085l14255k83966k48165k28043k35863
3331B06958942k65655k97089l08532k91844k57625k28558k24228k48585k88562l24269
3341B04223995l43551l49312l55988l76472m10195m41894m51622m29764l85666l43876
3351B00335655l28388l47958l90052m29478m45690m35181m13895m04472m20933m58946
3361A96260662m98714n19448n12752m88129m66003m62570m80023n04475n16052n00736
3371A91311760m58527m01668l46470l04928k82478k79999k98004l36151l88985m41074
3381A87773476m68693m50688l81526k81125j89628j49689j84421k82155m00695m86031
3391A84498825m99153m34189l20434k06204j36070j30253j79234k50835l07388l22590
$$ plain form
3321 209805279 209488144 209196491 208903122 208592319 208269234 207954979 207671013 207422848 207194805 206958942
3331 206958942 206693287 206396198 206087666 205795822 205538197 205309639 205085411 204836826 204548264 204223995
3341 204223995 203880444 203531132 203175144 202798672 202388477 201946583 201494961 201065197 200679531 200335655
3351 200335655 200007267 199659309 199269257 198839779 198394089 197958908 197545013 197140541 196719608 196260662
3361 196260662 195761948 195242500 194729748 194241619 193775616 193313046 192833023 192328548 191812496 191311760
3371 191311760 190853233 190451565 190105095 189800167 189517689 189237690 188939686 188603535 188214550 187773476
3381 187773476 187304783 186854095 186472569 186191444 186001816 185852127 185667706 185385551 184984856 184498825
3391 184498825 183999672 183565483 183245049 183038845 182902775 182772522 182593288 182342453 182035065 181712475
3401A81712475k92149k32544j72367j38073j42650j80550k31304k69776k77748k51369
3411A79523945k01588j47667j07822r3384j05667j38722j81522k20604k41756k32144
3421A77853069j86042j08490j7338O2580J09749J15356Q8158M8618J7223M292O065
3432A77993240J0300N779j0509l2292n0659o0425o3285o5060p0210p7037p8621o7082
3444A77434139l7803P782O3743J22833J78624K25372K57549K69394K57130K21863J71470
3455A79172096J19915Q2035P0000Q7395J29642J85452K39944K78225K88468K64358
3465A80917530K08511J34449O5937L1262N2204J32332K49462L59802M14601L82194
3475A82948284K66628J10016k3727p8354l2158R1496K36435L42216L72467L29266K46448
$$ plain form
3401 181712475 181420326 181187782 181015415 180877342 180734692 180554142 180322838 180053062 179775314 179523945
3411 179523945 179322357 179174690 179066868 178973484 178867817 178729095 178547573 178326969 178085213 177853069
3421 177853069 177667027 177558537 177541199 177603779 177713528 177828884 177917042 177965660 177982883 177987175 177993240
3432 177993240 178003540 178009319 177998810 177966518 177915859 177855434 177792149 177727089 177656879 177579842 177501221 177434139
3444 177434139 177396336 177404118 177467861 177590694 177769318 177994690 178252239 178521633 178778763 179000626 179172096
3455 179172096 179292011 179374046 179444046 179531441 179661083 179846535 180086479 180364704 180653172 180917530
3465 180917530 181126041 181260490 181326427 181357689 181409893 181542225 181791687 182151489 182566090 182948284
3475 182948284 183214912 183324928 183301201 183222847 183190689 183282185 183518620 183860836 184233303 184562569 184809017
3486A84809017J69316J32141J47228K06261K89135L72676M33598M50172M06361L01018
3496A87716923J56307J6899o4812n3291M9915K01683L36667L97510L63178K57111J32618
3507A89510708M6272L1910R1305K01244L29609M49295N42965O00968O15673N82370
3517A93002319N01557L83892K49615J22947K5826k6970k6951L0155J42880K97775M63676
3528A95166721N92747O36253N70260M16755K44389J41945J72481L34034N52712P15847
3538A99544144P32975N87444L48930J35861M8065J11446K68078M16279M75941M34952
3548B03104115L49636L01056L41491M66595O30855P88708R25007J051331J168556J232147
3558B10359497J153259Q49991L15895l37238r04522j173439j026669n03349K17476
$$ plain form
3486 184809017 184978333 185110474 185257702 185463963 185753098 186125774 186559372 187009544 187415905 187716923
3496 187716923 187873230 187890129 187825317 187772026 187821941 188023624 188360291 188757801 189120979 189378090 189510708
3507 189510708 189556980 189588890 189680195 189881439 190211048 190660343 191203308 191804276 192419949 193002319
3517 193002319 193503876 193887768 194137383 194260330 194286156 194259186 194232235 194262390 194405270 194703045 195166721
3528 195166721 195759468 196395721 196965981 197382736 197627125 197769070 197941551 198275585 198828297 199544144
3538 199544144 200277119 200864563 201213493 201349354 201397419 201508865 201776943 202193222 202669163 203104115
3548 203104115 203453751 203754807 204096298 204562893 205193748 205982456 206907463 207958794 209127350 210359497
3558 210359497 211512756 212362747 212678642 212341404 211436882 210263443 209236774 208733425 208950901
3567B08950901Q99086J349487J489525J360645J083394P99808O27709O36863Q35991
3576B18033409J163597J489144J642608J479798R61952K06146n37968r88979r68647
3585B22481060m95682K19059Q77705J243477J244640R82533O47392M04377L22895L80115
3595B28307571N19581P05185R29890J179848J393585J465168J298809Q81920L22303
3604B37003860j84993m44584l54633M7779O04801J103267J349469J228809P44114L3874
3614B41131763o38923r52397o51187L03974J641750K827606L270359K610455R39197
3623B50482597j190376k990971l799800l378640j993942k47955J230659K057286K192287
3632B42361145J861210J385231J036911R79175J262341J825390K478485K906742K752476
$$ plain form
3567 208950901 209849987 211199474 212688999 214049644 215133038 215932846 216560555 217197418 218033409
3576 218033409 219197006 220686150 222328758 223808556 224770508 224976654 224438686 223449707 222481060
3585 222481060 221985378 222204437 223082142 224325619 225570259 226552792 227200184 227604561 227927456 228307571
3595 228307571 228827152 229532337 230462227 231642075 233035660 234500828 235799637 236681557 237003860
3604 237003860 236818867 236374283 236019650 236067429 236672230 237775497 239124966 240353775 241097889 241131763
3614 241131763 240492840 239540443 238889256 239193230 240834980 243662586 246932945 249543400 250482597
3623 250482597 249292221 246301250 242501450 239122810 237128868 236880913 238111572 240168858 242361145
3632 242361145 244222355 245607586 246644497 247623672 248886013 250711403 253189888 256096630 258849106
3641B58849106J786117Q5259j904869l511696m137802l565655k084579l50495R44710
3650B46110096J406937J090164L98788j72138k90260J02100Q38127J662350K345734
3659B53491898K729759K721481K294197J513920N60551l10231q76960j079026j065368
3668B59980221j110287j431637k024898k627278k850132k399559j249961L33290J925411
3677B48545170L133144L728352L665161L011665J881047M19082j156254k535381l372593
3686B57319393l416252k639580j282120K35348J480637K168484K228565J769504R93767
3695B58857746J27812o02875r83868q54530j92471Q07877J744480K145004J691914
3704B62741089M14562j272507k729244l375568k955380j639175P7247J610146K529163
$$ plain form
3641 258849106 260635223 260720482 258815613 255303917 251166115 247600460 245515881 245165386 246110096
3650 246110096 247517033 248607197 249005985 248833847 248543587 248645687 249483814 251146164 253491898
3659 253491898 256221657 258943138 261237335 262751255 263311806 263001575 262124615 261045589 259980221
3668 259980221 258869934 257438297 255413399 252786121 249935989 247536430 246286469 246619759 248545170
3677 248545170 251678314 255406666 259071827 262083492 263964539 264383621 263227367 260691986 257319393
3686 257319393 253903141 251263561 249981441 250216789 251697426 253865910 256094475 257863979 258857746
3695 258857746 258985558 258382683 257398815 256544285 256351814 257159691 258904171 261049175 262741089
3704 262741089 263155651 261883144 259153900 255778332 252822952 251183777 251261024 252871170 255400333
3713B55400333K686959K202568J346264M05845l96919r28326j126594r82247n32302
3722B58075581J34277Q71315J482544J749267J485634O18134p30133k201748l269062
3731B58215809l417931k397861m13361J873894L588886M038983L066444J146069q48828
3740B64852104k102394k277889j660328r36489p46632j286468k199364k817879k594146
3749B48230515j447011J85452J605473K254772K007274J191655L58181m6997R5367
3758B54434681N70660J004085J088200P29694N6667o78806j225796j419429j210328
3767B53349628o57520Q9665Q19320J306820J389656J042652M05884k65198p15522q12435
3777B55952950o02971k69050q393Q3523N6744N0850J83525M62608P83692J009101J067601
$$ plain form
3713 255400333 258087292 260289860 261636124 262041969 261645050 260716724 259590130 258607883 258075581
3722 258075581 258209858 259081173 260563717 262312984 263798618 264416752 263686619 261484871 258215809
3731 258215809 254797878 252400017 251986656 253860550 257449436 261488419 264554863 265700932 264852104
3740 264852104 262749710 260471821 258811493 257875004 257128372 255841904 253642540 250824661 248230515
3749 248230515 246783504 246968956 248574429 250829201 252836475 254028130 254386311 254339314 254434681
3758 254434681 255005341 256009426 257097626 257827320 257883987 257205181 255979385 254559956 253349628
3767 253349628 252692108 252781773 253601093 254907913 256297569 257340221 257746105 257480907 256765385 255952950
3777 255952950 255349979 255080929 255072536 255156059 255212803 255263653 255447178 255909786 256693478 257702579 258770180
3788B58770180R99222R09194Q68283Q36811O79283K66361m05235j168346j760102j974983
3798B58020668j793632j391125j013451q00304o82678m32339J59130J093960K105922
3807B55266151K779103K778511K048282Q47435l96347j321106j799411j943817j959496
3816B56299305j962967j894398j582679r07288O5880J077785J808415K060451J869507
3825B56834011J466999J120243R57031Q89206O85292J43509p48158j769352k570934
3834B57007847k862301k563438j830292r36699r3079O76079J506252K526665L657913
3843B57088947M521923M556694L309613P58266k534141n554524p236252o934852m740296
3852B43235378j457424J744480L838787M353314L495350J955738N20172k97508m28086
$$ plain form
3788 258770180 259769402 260678596 261546879 262383690 263062973 263329334 262924099 261755753 259995651 258020668
3798 258020668 256227036 254835911 253822460 253022156 252339478 251907139 252066269 253160229 255266151
3807 255266151 258045254 260823765 262872047 263719482 263323135 262002029 260202618 258258801 256299305
3816 256299305 254336338 252441940 250859261 249951973 250017853 251095638 252904053 254964504 256834011
3825 256834011 258301010 259421253 260378284 261267490 261952782 262096291 261348133 259578781 257007847
3834 257007847 254145546 251582108 249751816 248815117 248722038 249398117 250904369 253431034 257088947
3843 257088947 261610870 266167564 269477177 270235443 267701302 262146778 254910526 247975674 243235378
3852 243235378 241777954 243522434 247361221 251714535 255209885 257165623 257685795 257388287 256960201
3861B56960201j71604M3182q1310n69114j193848j628552j625709j136017l17841N50290
3871B50829678J198539J471424J366234R98516N27382Q4019k60658m86737n95493n93166
3881B54539738m97532l56236k45876k36034l32280m42123m01573o4984N87464J393013
3891B53943577K048607K239933J792259P61967n80616j863480k757339l080712k828636
3900B49675560k132587j190091k01702O67649J307163J663914J740341J578998J241913
3909B54351158P91950K88353k03590o06213q40225q57677o75831l82576r8591Q4858
3919B51851616J52035J58252J74332K21119K44102J53294r8743m57707p73773q79211
3929B50745316o86570k47612K68193O58493P85522O31504K89364r3708l84502n10044
$$ plain form
3861 256960201 256788597 256831779 256750469 256181355 254987507 253358955 251733246 250597229 250279388 250829678
3871 250829678 252028217 253499641 254865875 255864391 256391773 256475792 256215134 255728397 255132904 254539738
3881 254539738 254042206 253685970 253440094 253204060 252871780 252429657 252028084 251963100 252550564 253943577
3891 253943577 255992184 258232117 260024376 260786343 260205727 258342247 255584908 252504196 249675560
3900 249675560 247542973 246352882 246151180 246818829 248125992 249789906 251530247 253109245 254351158
3909 254351158 255143108 255431461 255227871 254621658 253781433 252923756 252247925 251865349 251766758 251851616
3919 251851616 252003651 252161903 252336235 252557354 252801456 252954750 252856007 252398300 251624527 250745316
3929 250745316 250058746 249811134 250079327 250737820 251523342 252154846 252444210 252350502 251966000 251455956
3939B51455956m69742l22285j54572m4899k9468q6365j47915j41830l8128J25790K64797
3950B50411339K99911K10247M6368j04427j77613j68666j24493r9545j13201j43242
3960B50036678j55029j36986j09710j01643j18866j38512j34277j07498r0676j14173
3970B48829308j67866j98097j54038m5223M5605K0370j45187l59669m71630l92723
3980B46960850j86901l7098r6550l42083n65090n39532k46773M3926m6787o65340j497441
3991B42781181j906318j450825m66614k47822k545662q539333j7852325k8274689l6502638
4000A44994955
$$ plain form
3939 251455956 250986214 250663929 250509357 250464458 250434990 250348625 250200710 250058880 250020752 250146542 250411339
3950 250411339 250711250 250921497 250967865 250863438 250685825 250517159 250392666 250293121 250179920 250036678
3960 250036678 249881649 249744663 249634953 249533310 249414444 249275932 249141655 249034157 248943481 248829308
3970 248829308 248661442 248463345 248309307 248264084 248309689 248330059 248184872 247825203 247353573 246960850
3980 246960850 246773949 246736851 246640301 246298218 245733128 245193596 244946823 244990749 244943962 244278622 242781181
3991 242781181 240874863 239424038 238957424 238709602 236163940 227624607 209772282 181497593 144994955
4000 144994955
##END=$$ End of the data block
