##TITLE=N3Ac-C7 $$ Begin of the data block
##JCAMP-DX=5.00 $$ ACD/SpecManager v 10.08
##SPECTROMETER/DATA SYSTEM=Alpha
##DATE=16 May 2016 10:57:36
##DATA TYPE=INFRARED SPECTRUM
##DATA CLASS=XYDATA
##ORIGIN=
##OWNER=
##NPOINTS=1667
##FIRSTX=599.64648438
##LASTX=3997.64306641
##MAXX=3997.64306641
##MINX=599.64648438
##MAXY=1.07879758
##MINY=0.86661845
##XFACTOR=1.0000000000
##YFACTOR=0.000000010000000
##FIRSTY=0.96083611
##DELTAX=2.03961372
##XUNITS=1/CM
##YUNITS=ARBITRARY UNITS
##XYDATA=(X++(Y..Y))
599.6 96083611 96133173 96160251 96130818 96094918 96080166 96079105 96095395 96126509 96140647 96141684 96176827 96248543
624.1 96248543 96329308 96421099 96528900 96615869 96680385 96760035 96815997 96820295 96839631 96904713 96960777 96975672
648.6 96975672 96975124 96973532 96962905 96959192 96985680 97037625 97089851 97096962 97016168 96957564 97046363 97150975 97230685
675.1 97230685 97321600 97424340 97508633 97566652 97613859 97649699 97680461 97729397 97782105 97805035 97798258 97791785
699.6 97791785 97817391 97879279 97969288 98085314 98196328 98264557 98301727 98344231 98398042 98450828 98502606
722 98502606 98562676 98629510 98688138 98741305 98800164 98860073 98910600 98955560 99004358 99050206 99094427 99147660
746.5 99147660 99203140 99250853 99292618 99329269 99369299 99425542 99485344 99528706 99561590 99604714 99666595 99740064
771 99740064 99809575 99865210 99914545 99973375 100038922 100093710 100151110 100221598 100277686 100317621 100364697 100421214
795.4 100421214 100481391 100538743 100584936 100616407 100629306 100628579 100620997 100598252 100562561 100528896 100502264 100476754
819.9 100476754 100446522 100420249 100428164 100483656 100551426 100610268 100670135 100720370 100736320 100716376 100694656 100683141
844.4 100683141 100656867 100607467 100536752 100449479 100355351 100258923 100180864 100155962 100186181 100243044 100303411 100336909
868.9 100336909 100326550 100300837 100287724 100279701 100262558 100241280 100221109 100201309 100190771 100190222 100173736 100108850
893.4 100108850 99983448 99820626 99652213 99485916 99319446 99149656 98975712 98798347 98609716 98403198
913.7 98403198 98189878 97990191 97813046 97662169 97539544 97435778 97328681 97194529 97022241 96801519
934.1 96801519 96528125 96220952 95906222 95608288 95347112 95140916 95018327 95006508 95107561 95288748
954.5 95288748 95503700 95719004 95904851 96037197 96120417 96167254 96181798 96174365 96164066 96172071 96190923
977 96190923 96188670 96154499 96082807 95953172 95755643 95499074 95189124 94836330 94468153 94081372 93651867
999.4 93651867 93199021 92754108 92314267 91890508 91527253 91248870 91046727 90916038 90863407 90867329
1019.8 90867329 90883595 90889579 90872365 90807080 90681583 90512639 90327042 90136236 89925504 89689612 89450645
1042.2 89450645 89224917 89021605 88867271 88794225 88810557 88907510 89072740 89281845 89502949 89709574
1062.6 89709574 89875579 89970487 89976752 89896595 89737368 89505827 89214134 88885748 88532466 88153720
1083 88153720 87775338 87422711 87102109 86846483 86698943 86661845 86711091 86824757 86979991 87169605
1103.4 87169605 87416464 87723953 88057828 88405192 88776606 89172387 89596379 90047795 90504038 90953308
1123.8 90953308 91408849 91875386 92331362 92752367 93136770 93489480 93808758 94091237 94335842 94552815
1144.2 94552815 94747168 94907081 95026171 95107079 95151126 95155877 95117849 95055789 95006800 94991648 95022941
1166.7 95022941 95116621 95265907 95446920 95638990 95817882 95970631 96093863 96176481 96212417 96208096 96177936
1189.1 96177936 96135283 96090275 96058428 96054947 96084595 96144652 96226954 96323854 96432132 96543902 96656215
1211.5 96656215 96775854 96891069 96964115 96966034 96895832 96766877 96605349 96443564 96308136 96228963 96231496
1234 96231496 96314311 96438098 96557361 96661353 96757168 96860868 97000420 97180814 97377324 97561640
1254.4 97561640 97712380 97830564 97939128 98046064 98146862 98252916 98374426 98507768 98646206 98781615
1274.8 98781615 98911560 99036270 99150121 99255073 99355477 99447101 99535781 99628413 99716228 99797916 99880797
1297.2 99880797 99965775 100049710 100130498 100208163 100277114 100321805 100339055 100354218 100373018 100383806 100406063 100442612
1321.7 100442612 100466192 100463820 100439131 100405204 100361562 100280762 100141716 99972463 99858040 99808258 99697191
1344.1 99697191 99447882 99083096 98638833 98135805 97610092 97146940 96797574 96545935 96435988 96506810
1364.5 96506810 96597898 96590710 96511477 96347857 96157235 96051180 95978600 95897228 95848107 95847273 95967299
1386.9 95967299 96306902 96717799 97024488 97268862 97523117 97764081 97965360 98070413 98119515 98202527
1407.3 98202527 98272413 98297346 98294461 98222232 98064065 98014122 98164666 98348439 98543161 98715860 98839271
1429.8 98839271 98977542 99052256 99022353 99117631 99326473 99441904 99445093 99379224 99358666 99484652 99620694
1452.2 99620694 99590707 99432105 99646109 100186419 100538480 100735557 101027739 101298654 101341116 101347327
1472.6 101347327 101661801 102135468 102515900 102770770 102969229 103067756 103003430 102960289 103191292 103454149
1493 103454149 103478336 103425276 103568864 103776062 103764927 103420234 103200507 103540528 103871155 103948450 103804171
1515.4 103804171 103626978 103496063 103417325 103524327 103660131 103753209 103797364 103693116 103594637 103570676
1535.8 103570676 103300691 102826238 102806139 103130114 103391433 103457034 103393173 103301704 103128171 102781618
1556.2 102781618 102332592 102463138 102878761 103035009 102971113 102795708 102736366 102779400 102628636 102425206
1576.6 102425206 102482378 102558672 102511668 102424300 102332187 102213967 102079177 101935422 101791775 101684105
1597 101684105 101601613 101518285 101451480 101393044 101309991 101232767 101192963 101107311 100884593 100716245 100734770
1619.5 100734770 100660908 100492907 100410914 100361061 100339842 100297737 100031829 99652934 99652368 99830109 99871016
1641.9 99871016 99702781 99339592 99183875 99258888 99057811 98943245 99345833 99643409 99665588 99591160
1662.3 99591160 99659199 99734998 99636513 99610621 99765444 99871975 99979299 100079715 100007415 99687773 99385774
1684.7 99385774 99413520 99394304 99198675 98848563 98145282 97283083 96496499 95733106 95281172 94821346
1705.1 94821346 94290286 93911374 93544346 93082476 92497027 91969740 91936308 92211896 92469990 92764962
1725.5 92764962 93161517 93626678 94154829 94933492 96101892 97226566 98261821 99264199 100129986
1743.9 100129986 100812304 101341009 101877451 102480280 102960467 103271544 103520179 103731060 103965640 104214704
1764.3 104214704 104333782 104335427 104307568 104385424 104662228 104938734 105078256 105166447 105303371 105456710
1784.7 105456710 105578589 105603516 105521095 105511904 105637443 105728781 105751169 105817187 105968213 106106031 106178164
1807.1 106178164 106212771 106286263 106412733 106507981 106558299 106602955 106609845 106547499 106491172 106471670 106487298
1829.6 106487298 106595576 106706727 106745005 106761825 106757224 106665778 106557512 106606710 106746078 106847823 106895506
1852 106895506 106906474 106901860 106892896 106891692 106889701 106840611 106721473 106644583 106733823 106871390 106935430 106947780
1876.5 106947780 106950665 106955695 106959546 106953156 106912172 106855559 106862760 106902885 106913245 106929851 106962276 106983781
1900.9 106983781 106987977 106973362 106944847 106937051 106970108 106995070 106961799 106903112 106884384 106889319 106912982 106970727
1925.4 106970727 107013786 107022524 107018232 107012737 107010365 107004035 106966853 106916893 106925917 106974387 107000828 107011306 107016671
1951.9 107016671 107013655 107012439 107017195 107019079 107011509 106983745 106949699 106955445 106994545 107018983 107021892 107021534 107021511 107017922
1980.5 107017922 107015145 107013857 107004035 106979418 106956303 106969583 107006001 107024062 107028723 107032824 107033718 107033014 107028592
2007 107028592 107025301 107030451 107027531 107005358 106989491 106996214 107004535 107006216 107011092 107014799 107013369 107010508 107006490 107004642
2035.6 107004642 107002878 106995106 106991518 106996381 106998503 106996763 106994748 106989419 106980324 106975245 106978965 106982636 106973910 106962395
2064.1 106962395 106967890 106982470 106987274 106984973 106981850 106977367 106973183 106969607 106965661 106958961 106952691 106950140 106948602 106951594
2092.7 106951594 106957054 106951988 106931031 106906724 106894279 106895065 106902480 106905413 106895435 106884098 106888914 106908798 106927395
2119.2 106927395 106929314 106923687 106929851 106944609 106954503 106955338 106953168 106956339 106966543 106977439 106984985 106989145 106985664 106976557
2147.7 106976557 106972563 106981587 106999290 107009757 107007849 107003748 107007110 107019031 107030964 107037675 107042766 107044339 107038963
2174.3 107038963 107039189 107051766 107065248 107073116 107073855 107073140 107079446 107089329 107098234 107103086 107104647 107112944 107124329 107127631
2202.8 107127631 107126033 107124293 107124197 107126200 107133269 107141113 107138479 107133210 107134640 107138968 107142341 107145286 107148409 107147491 107143319
2233.4 107143319 107140791 107138300 107132983 107129323 107136798 107153499 107160616 107150996 107138968 107136035 107139015 107145071 107152092 107150531
2262 107150531 107137811 107122207 107116926 107123911 107127988 107128739 107137311 107146764 107150340 107150972 107144701 107131660 107121730 107116675
2290.5 107116675 107104313 107087934 107077420 107063210 107050657 107046199 107026231 106983054 106943548 106926906 106926692 106926930
2315 106926930 106917906 106895709 106860948 106825531 106800628 106789339 106782222 106765032 106750453 106749070 106731558 106693745
2339.5 106693745 106677055 106680965 106695485 106729138 106747818 106729460 106701028 106668150 106624413 106606150 106603587 106609452
2363.9 106609452 106640577 106667280 106684792 106729925 106790793 106836164 106879365 106938660 106999695 107040930 107061958
2386.4 107061958 107074547 107083201 107084846 107080102 107072484 107064259 107062817 107068157 107068694 107061410 107049811 107038891 107036006 107035339
2414.9 107035339 107027078 107017446 107018971 107030642 107036829 107028961 107012963 107000530 106999564 107002699 106998658 106990707 106986904 106983078
2443.5 106983078 106970561 106957114 106953597 106949353 106938601 106933331 106935108 106934714 106927085 106915236 106904089 106892121 106878543
2470 106878543 106868672 106862319 106850994 106834018 106823480 106821311 106812465 106794095 106779993 106776631 106776488 106765473 106747746
2496.5 106747746 106741428 106740701 106731987 106719780 106708825 106696188 106683314 106673133 106661546 106648302 106636441 106624222
2521 106624222 106614649 106609213 106598556 106584418 106582439 106584764 106570530 106549895 106540906 106535804 106527328 106519842 106512737 106507361
2549.5 106507361 106504226 106494236 106480956 106473160 106462622 106449091 106443393 106441748 106433511 106417143 106398904 106385744 106378639
2576 106378639 106371915 106360698 106342947 106320822 106302094 106289351 106278837 106271303 106262434 106247973 106234217 106221390
2600.5 106221390 106207931 106196141 106187534 106183100 106175709 106163645 106153202 106143713 106135392 106132281 106130171 106119895 106110108
2627 106110108 106114042 106121767 106120944 106109893 106091499 106075227 106065321 106056142 106048107 106046379 106045175 106034589 106018853 106013572
2655.6 106013572 106016684 106010103 105996644 105994689 105998778 105988657 105970478 105961406 105953896 105933881 105912197 105903316 105897713
2682.1 105897713 105887139 105878174 105871689 105857742 105839455 105833912 105833840 105821717 105811858 105816603 105816090 105798149 105773187
2708.6 105773187 105754340 105744100 105735219 105724466 105710471 105691457 105670917 105653632 105638373 105623555 105609250 105584729
2733.1 105584729 105550349 105528951 105523062 105519128 105510509 105486286 105457199 105445778 105445814 105440617 105426085 105407882 105392015
2759.6 105392015 105381167 105370665 105358779 105348468 105332971 105307949 105281866 105268979 105269945 105265522 105245376 105215347
2784.1 105215347 105178261 105146980 105140626 105142438 105118394 105068374 105026507 105009067 104997599 104979300 104950321 104912055
2808.6 104912055 104874086 104839551 104806817 104770994 104728913 104686105 104648209 104611194 104565251 104511321 104456306
2831 104456306 104402280 104346716 104286194 104238629 104207551 104155350 104075766 103990722 103908408 103830016 103740501 103633773
2855.5 103633773 103526509 103425670 103320265 103199697 103069353 102940559 102806342 102666354 102559924 102503157
2875.9 102503157 102462053 102414846 102366245 102328002 102304626 102281940 102243280 102183878 102109027 102037311 101984596
2898.3 101984596 101935828 101869941 101798809 101734042 101662719 101576543 101481402 101395798 101328409 101263404 101182806
2920.7 101182806 101080501 100967741 100844228 100705600 100568533 100435460 100308025 100209475 100154603 100140870
2941.1 100140870 100165451 100232506 100330317 100420630 100479889 100516665 100531220 100514948 100476241 100422776 100355542
2963.6 100355542 100283110 100210726 100130141 100041008 99963981 99903303 99837655 99776512 99756342 99778980 99829072
2986 99829072 99922156 100074053 100276160 100509739 100739551 100946176 101144826 101332271 101490045 101622379
3006.4 101622379 101732647 101821375 101909900 102008557 102104282 102190793 102263236 102304661 102320516 102335811 102342415
3028.8 102342415 102322197 102291834 102277911 102272749 102246237 102200067 102165437 102145112 102108920 102051926 101993477 101937127
3053.3 101937127 101882958 101834762 101782560 101715732 101636851 101560903 101505089 101461589 101413524 101353681 101274824
3075.7 101274824 101179552 101091754 101036835 101001167 100950050 100876057 100800014 100740719 100685549 100610578 100522697
3098.2 100522697 100442505 100365901 100278616 100185144 100097811 100012898 99909282 99784952 99669290 99576360 99493271
3120.6 99493271 99410552 99322885 99221599 99117023 99023521 98924506 98804551 98681325 98577684 98489994 98404986
3143 98404986 98314279 98207289 98084044 97966003 97876185 97803396 97717571 97613746 97506398 97395217 97276449
3165.5 97276449 97164696 97067970 96975166 96877652 96772587 96655720 96538514 96429801 96319056 96204698
3185.9 96204698 96090615 95977312 95871800 95767981 95648342 95529872 95434302 95342594 95234227 95114017
3206.3 95114017 94995803 94889444 94793135 94700730 94605935 94494867 94378668 94284171 94196743 94097155 94002372
3228.7 94002372 93920803 93840742 93756437 93669862 93586969 93509912 93428665 93338603 93253344 93179816 93106329 93022555
3253.2 93022555 92945445 92888057 92830288 92765605 92709726 92656666 92586499 92515552 92463857 92412090 92350417 92295659
3277.7 92295659 92251790 92197877 92126930 92068845 92033511 91992277 91938871 91890430 91845745 91800141 91756558 91707867
3302.1 91707867 91658062 91614974 91568446 91515595 91464663 91424161 91385275 91335517 91282415 91237384 91197515 91142094
3326.6 91142094 91080332 91037840 90990251 90919882 90860993 90822703 90777886 90726209 90680003 90629810 90571856 90524894
3351.1 90524894 90494162 90461844 90418267 90373808 90336508 90303516 90275460 90253431 90236270 90211630 90170372 90131438
3375.5 90131438 90103096 90075386 90054697 90047359 90043473 90036607 90025711 90014863 90010452 90002966 89993078 90002096 90026146
3402.1 90026146 90044469 90053272 90065050 90090382 90118146 90142709 90168059 90181857 90195221 90244842 90310025 90341032
3426.5 90341032 90358847 90401858 90457785 90509897 90575540 90656376 90717471 90762550 90804034 90840286 90911895 91017389
3451 91017389 91107094 91174209 91238678 91314721 91393799 91465646 91534454 91613197 91719311 91830224 91911125 91981876
3475.5 91981876 92080939 92185944 92273009 92378861 92497677 92600739 92721629 92855889 92952597 93036437
3495.9 93036437 93163455 93295962 93375695 93463558 93611664 93762869 93900812 94058967 94219047 94351351
3516.3 94351351 94466168 94576257 94689023 94816959 94944382 95073080 95258158 95480537 95655423 95790249
3536.7 95790249 95953989 96124780 96235216 96314377 96465462 96696651 96898723 97065330 97264707 97458661
3557.1 97458661 97600806 97724015 97824055 97806782 97797060 98079044 98494822 98793709 98986751 99149901
3577.5 99149901 99305332 99471146 99610043 99643916 99694407 99957782 100260651 100430405 100565577 100753832
3597.9 100753832 100957274 101194489 101435947 101558793 101605833 101725435 101893616 102080059 102256715 102365983
3618.3 102365983 102568924 102925456 103206265 103244054 103162551 103356993 103728557 104021657 104240167 104422045
3638.7 104422045 104585254 104708493 104694879 104501021 104377496 104670274 105100727 105355644 105530262 105748200
3659 105748200 105941331 106081343 106149709 106092179 105991948 106009543 106025732 106037021 106270218 106581604 106801057
3681.5 106801057 106893814 106830597 106657445 106614089 106837881 107097685 107240105 107272899 107232678 107206118 107254314
3703.9 107254314 107264543 107144487 106990469 107030058 107242227 107380342 107377028 107306373 107251728 107245207 107292271
3726.4 107292271 107332993 107237852 106977558 106766391 106860316 107112074 107221520 107115567 106993699 107011151
3746.7 107011151 106980503 106951678 107121062 107313657 107393622 107447076 107546425 107603192 107566333 107491207 107454312
3769.2 107454312 107544148 107688391 107717359 107619274 107553470 107604718 107656443 107686996 107744050 107789481 107784915
3791.6 107784915 107700372 107572734 107480288 107382154 107328928 107411659 107504511 107603133 107721317 107732522 107595181
3814.1 107595181 107436895 107335353 107248342 107307208 107469404 107569695 107614279 107590342 107500422 107388425
3834.4 107388425 107265067 107202148 107277608 107440424 107612085 107708180 107650530 107413769 107149827 107220125
3854.8 107220125 107478452 107616711 107579529 107472396 107451379 107464707 107431424 107448053 107537138 107632279 107665050
3877.3 107665050 107598376 107541549 107536530 107547009 107591915 107594752 107582998 107662177 107717586 107635188 107484758 107392097
3901.8 107392097 107419872 107569635 107734275 107815373 107829309 107797921 107712662 107656229 107686257 107711530 107709742
3924.2 107709742 107743633 107758498 107705045 107685137 107749009 107816517 107832301 107788336 107735789 107727945 107730472 107734835
3948.7 107734835 107772601 107827699 107870364 107879758 107849562 107821977 107837999 107863986 107869351 107866681 107851827 107823396
3973.1 107823396 107812548 107837081 107863975 107863104 107852066 107853687 107863367 107869029 107864439 107852101 107848370 107855868
3997.6 107855868
##END=$$ End of the data block
