##TITLE=N3Ac-C3 $$ Begin of the data block
##JCAMP-DX=5.00 $$ ACD/SpecManager v 10.08
##SPECTROMETER/DATA SYSTEM=Alpha
##DATE=16 May 2016 10:57:36
##DATA TYPE=INFRARED SPECTRUM
##DATA CLASS=XYDATA
##ORIGIN=
##OWNER=
##NPOINTS=1667
##FIRSTX=599.64648438
##LASTX=3997.64306641
##MAXX=3997.64306641
##MINX=599.64648438
##MAXY=1.12909234
##MINY=0.26010352
##XFACTOR=1.0000000000
##YFACTOR=0.000000010000000
##FIRSTY=0.92559659
##DELTAX=2.03961372
##XUNITS=1/CM
##YUNITS=ARBITRARY UNITS
##XYDATA=(X++(Y..Y))
599.6I2559659j298564r05550j49172O41668J131045J239419J003683N74917K71749
618I5068854K34157K40362J31416J9991N299L8839J9341n5086j58757l02810m43828
640.4I4797778n13476m79388l84641k62850j11330L701K1738k8831j26516k45834l62682
662.9I2307669m61066o86729q81135m64112j34682n2023r9087l63022r37987j844173
683.3H6383653k912015l741539l838485l110808k434027k914226m177094m377633k320946
701.6E6556880J097930M016274N205596M633057L298908K404338K354437K663261K765608
720H4996289K375263J640815R50801N24181L87549M16935M60738M21578K29346j38342
740.4I2265153o20353j055044j272476j319599j475781j883364k347571k579027k425897
$$ plain form
599.6 92559659 91261095 90355545 90206373 90848041 91979086 93218505 94222188 94797105 95068854
618 95068854 95303011 95543373 95674789 95694780 95700079 95738918 95758259 95703173 95544416 95241606 94797778
640.4 94797778 94284302 93804914 93420273 93157423 93046093 93049794 93071532 93042701 92916185 92670351 92307669
662.9 92307669 91846603 91159874 90278739 89814627 89679945 89627922 89528835 89165813 88227826 86383653
683.3 86383653 83471638 79730099 75891614 72780806 70346779 67432553 63255459 58877826 56556880
701.6 56556880 57654810 61671084 66876680 71509737 74808645 77212983 79567420 82230681 84996289
720 84996289 87371552 89012367 89963168 90487349 90874898 91291833 91752571 92174149 92403495 92265153
740.4 92265153 91644800 90589756 89317280 87997681 86521900 84638536 82290965 79711938 77286041
758.7G7286041j857168r16320K70128J450354K358699K859742K953660K709484K257002
777.1H9371622J778560J384652J069170Q37446O84994N64885M59731L64756K64842
795.4I6780658J61493P6389L7289M7671O2150N0014K6536m893n5230j06495j23352
817.9I6952230j16849j23441j25605r8855q5061j25784k04253l01451m07564m91947
838.3I4871420n20397m65416l33858j52010O3783K58464L76874M15945L77846K89976
858.7I5182627J99497J15580M1455j8675q4137j36918j31828n5659N8478J30397J23001
881.1I5423818O9540P761m8268j21683k31087l64333n11361o67482q65323j132845
901.5I1558737j351268j182872l66020O52707J083618Q65311M79573J85781j4072j38712
$$ plain form
758.7 77286041 75428873 74512553 74782681 76233035 78591734 81451476 84405136 87114620 89371622
777.1 89371622 91150182 92534834 93604004 94441450 95126444 95691329 96151060 96515816 96780658
795.4 96780658 96942151 97018540 97055829 97103500 97165650 97215664 97242200 97237307 97182077 97075582 96952230
817.9 96952230 96835381 96711940 96586335 96487480 96402419 96276635 96072382 95770931 95363367 94871420
838.3 94871420 94351023 93885607 93551749 93399739 93463522 93721986 94098860 94514805 94892651 95182627
858.7 95182627 95382124 95497704 95539159 95520484 95436347 95299429 95167601 95111942 95170420 95300817 95423818
881.1 95423818 95493358 95501119 95452851 95331168 95100081 94735748 94224387 93556905 92691582 91558737
901.5 91558737 90207469 89024597 88658577 89311284 90394902 91260213 91739786 91925567 91911495 91772783
921.9I1772783j63275q7583J4734O0898L5304k7818j08653j97673k95222m12821n41115
944.3I0049559o60658p31236p03615n79512l85922j32185J20169K49797J99681O1345
964.7H7487423l039P8272K49291M04489M72963M41175L43872K28899J14763p838j19811
987.2H9690459j73229j77032j84667l09187p38460j219964q72517J93256N84418j5283
1007.6H6777794p58737j290023j719815k104425k474720k883398l213668l117245k381403
1025.9F6834360j328891n07236j28585p3510j28335j37877k5833K45047O78920J227516
1046.3F6655576J804507K274787K482135K384233K058870J608282J138568P41654M13198
1064.7H1561810R9647r8676M2481M67032Q01670Q77393Q38047P76809O41084M08411
$$ plain form
921.9 91772783 91609508 91521925 91536659 91597557 91632861 91605043 91496390 91298717 91003495 90590674 90049559
944.3 90049559 89388901 88657665 87954050 87374538 86988616 86856431 86976600 87226397 87426078 87487423
964.7 87487423 87484384 87562656 87811947 88216436 88689399 89130574 89474446 89703345 89818108 89810270 89690459
987.2 89690459 89517230 89340198 89155531 88846344 88107884 86887920 86015403 86208659 86793077 86777794
1007.6 86777794 86019057 84729034 83009219 80904794 78430074 75546676 72333008 69215763 66834360
1025.9 66834360 65505469 64998233 64869648 64796138 64667803 64529926 64504093 64749140 65428060 66655576
1046.3 66655576 68460083 70734870 73217005 75601238 77660108 79268390 80406958 81148612 81561810
1064.7 81561810 81661457 81562781 81605262 82072294 82873964 83751357 84589404 85366213 86007297 86415708
1085.1H6415708J38706q2391j94276k15721k06298j71554q6736n025l356o2442j13433
1107.5H5413182j12355m4328Q4376K45643M17048O09326Q19975J015514J151210J185757
1127.9I0785348J111556R47171P29704M96626K69073O7997r2256k13140k95496l47388
1148.3I3459195m38094o42187q77249r01657n66924o9702K27237K14726J3095l47245
1168.7I0071195q80104j387221j528650j166219n51605l8844K56407L38346J69289
1187.1H5282594k25335o96594j070678j263368j323152j361215j474082j727468k151764
1205.4G3988938k761697l526289m327142m995787n394280n466244n212688m671443
1221.7C7633368l926700l083265k243471j467347p63926j38307L99632Q39585J162594
$$ plain form
1085.1 86415708 86554414 86472023 86277747 86062026 85855728 85684174 85597438 85592413 85589057 85526615 85413182
1107.5 85413182 85300827 85256499 85340875 85586518 86003566 86612892 87432867 88448381 89599591 90785348
1127.9 90785348 91896904 92844075 93573779 94070405 94339478 94407475 94315219 94102079 93806583 93459195
1148.3 93459195 93021101 92378914 91501665 90600008 90033084 89963382 90190619 90405345 90418440 90071195
1168.7 90071195 89191091 87803870 86275220 85109001 84557396 84518552 84774959 85113305 85282594
1187.1 85282594 85057259 84360665 83289987 82026619 80703467 79342252 77868170 76140702 73988938
1205.4 73988938 71227241 67700952 63373810 58378023 52983743 47517499 42304811 37633368
1221.7 37633368 33706668 30623403 28379932 26912585 26148659 26010352 26409984 27249569 28412163
1240.1B8412163J369262J495564J572224J633892J694739J729166J715604J669723
1256.4D1292337J634582J635853J665530J712718J765090J792238J784485J753581
1272.7E5036414J738745J777821J846409J904375J967454K069401K192355K251189
1289G0784163K150929J877553J470440R93318N59044K36320J472j29938j19638n4628
1309.4G7769035o3985j25343j58239j81204j26266J76018O48088J035821J252884J382321
1329.8H1609130J431096J337593J125712Q90642O77162M40371J70571j03968l80248
1348.2H7198061o88082j076246j620668k358460l146953l776371l944862l167367j917207
1366.6F5501845r23109k58595N758O5386K62141P72369J548851K275145K663386K807557
$$ plain form
1240.1 28412163 29781425 31276989 32849213 34483105 36177844 37907010 39622614 41292337
1256.4 41292337 42926919 44562772 46228302 47941020 49706110 51498348 53282833 55036414
1272.7 55036414 56775159 58552980 60399389 62303764 64271218 66340619 68532974 70784163
1289 70784163 72935092 74812645 76283085 77276403 77835447 78071767 78073239 77943301 77823663 77769035
1309.4 77769035 77705050 77579707 77421468 77240264 77113998 77290016 77938104 78973925 80226809 81609130
1329.8 81609130 83040226 84377819 85503531 86394173 87071335 87511706 87682277 87578309 87198061
1348.2 87198061 86509979 85433733 83813065 81454605 78307652 74531281 70586419 67419052 65501845
1366.6 65501845 64578736 64320141 64325899 64391285 64653426 65425795 66974646 69249791 71913177 74720734
1386.9G4720734K544779J959652J716095J791489J705676J459712J140332Q26705O39844
1405.3H8505018M40293K09743J5199j21331k06959k94662l43227l06356l42858m23425
1425.7H7131435m60208n11151m93998m83387p07460j043290j477128k439153l436393
1444.1G6079267l668445k770150n34725J645356K788610L938353M683363L189695K007943
1462.4H7359267J703924J542145J228381R54812P10261L04395j41334l73531m40788
1480.8I2847532o70373j390541k557755l290218k333659n12063P85512J715779J827627
1499.1H6421841J202405N99015J37496j82164j57386j53178k57141l25077k84583j45965
1519.5H6855263k5636J43432K75999L70348M19670M33374N18513N00065L74192M34839
$$ plain form
1386.9 74720734 77265513 79225165 80941260 82732749 84438425 85898137 87038469 87865174 88505018
1405.3 88505018 88945311 89155054 89170253 89048922 88841963 88547301 88204074 87897718 87554860 87131435
1425.7 87131435 86671227 86160076 85666078 85182691 84475231 83431941 81954813 79515660 76079267
1444.1 76079267 72410822 69640672 69105947 70751303 73539913 77478266 82161629 85351324 87359267
1462.4 87359267 89063191 90605336 91833717 92788529 93498790 93803185 93661851 93288320 92847532
1480.8 92847532 92177159 90786618 88228863 84938645 82604986 82092923 82878435 84594214 86421841
1499.1 86421841 87624246 88223261 88360757 88178593 88021207 87868029 87610888 87285811 87001228 86855263
1519.5 86855263 86829627 86973059 87249058 87619406 88039076 88472450 88990963 89491028 89865220 90300059
1539.9I0300059O56319P36916P20751O58799O53141O43313N74535M47792M38225O65409
1560.3I6495259N45054L16835J24389j32758m06450o52927j161253j583958q13794
1578.7I2730397J36834O55717R52268Q69757K72888p04056j801789k602530k310604
1597H8198882q72904O25307J462257J664936J366800P34490J47963k36833n90128q40068
1617.4I1660702o57528n89323p77865q55356r23986r85360r50461j145971j653415
1635.8H3121437j549143j243061j347172j570785k071512k122259j302260j089787
1652.1G0825458r99684j33067K33102L24005M20534M52441L05427P6091m7279J3280
1672.5G1470308J93501M49240N83464N32860L54117Q3780j50931l70634n52719n84871
$$ plain form
1539.9 90300059 90956378 91693294 92414045 93072844 93725985 94369298 94943833 95391625 95829850 96495259
1560.3 96495259 97040313 97357148 97481537 97348779 96942329 96289402 95128149 93544191 92730397
1578.7 92730397 92867231 93522948 94475216 95344973 95617861 94913805 93112016 90509486 88198882
1597 88198882 87325978 87951285 89413542 91078478 92445278 93179768 93327731 93090898 92500770 91660702
1617.4 91660702 91003174 90413851 89635986 88780630 87856644 86871284 85920823 84774852 83121437
1635.8 83121437 81572294 80329233 78982061 77411276 75339764 73217505 71915245 70825458
1652.1 70825458 69825774 69692707 69925809 70249814 70670348 71122789 71428216 71504307 71457028 71470308
1672.5 71470308 71663809 72113049 72696513 73229373 73583490 73667270 73516339 73145705 72592986 72008115
1692.9G2008115p18725p62754o75178p57384p77424j096952j654529j966125k196240
1711.3F1402804k373827k596181l003586k754342k167303k152949k253217k254402
1727.6D1846997k445716k727813l543064l435313k120582j315811k26813J274868K813748
1745.9C0120501M541853O677902P950175P451653P221901O949246N816478N030960
1762.2H1760669L902131K810818K288824J887977J684136J444924J094043Q89605Q19343
1780.6I8582470P52193O79761N79226M64928L73209L75819L59750K85411K18260J88959
1801A02859986J90818J55854J22285R7311J34504J96182K26212K34091K52247K53856
1821.4A04723346K27952K33913K37512K50709K80989K67410K17688J91629J63138J10185
$$ plain form
1692.9 72008115 71289390 70526636 69851458 69094074 68316650 67219698 65565169 63599044 61402804
1711.3 61402804 59028977 56432796 53429210 50674868 48507565 46354616 44101399 41846997
1727.6 41846997 39401281 36673468 33130404 29695091 27574509 26258698 26031885 27306753 30120501
1745.9 30120501 34662354 41340256 49290431 56742084 63963985 70913231 76729709 81760669
1762.2 81760669 85662800 88473618 90762442 92650419 94334555 95779479 96873522 97763127 98582470
1780.6 98582470 99334663 100014424 100593650 101058578 101431787 101807606 102167356 102452767 102671027 102859986
1801 102859986 103050804 103206658 103328943 103426254 103560758 103756940 103983152 104217243 104469490 104723346
1821.4 104723346 104951298 105185211 105422723 105673432 105954421 106221831 106439519 106631148 106794286 106904471
1841.8A06904471Q8811J49560J84512J49620J13308Q3661O9845N4359M9758M4656K0707
1864.2A07913268k2662l1281K6870M3357N042l2139m2247m8531m9853m9615n3787n4574
1888.7A07603848k7311l993n496J8776L8981L4654K3997K2900K4426M4274Q0836R0170
1913.2A07946062O2859L6287N4384P5519Q2516Q9884Q3590O4754N1487M3320L7086
1935.6A08627748K5273j4174n2929m5276l3593o2931q8167r5939r5833q3923o7019
1958.1A08013237n0998l1662j6463r680J7929N1010O0677N9820O6971P2229O7664O7341
1982.5A08368075O5970N7650N1284N9235Q1670R6512Q9860P1227N1749L9280L0267
2005A09062779J3721n37k717l255j6534l0160k5010j6499j7834k5618l9386n0533n2393
$$ plain form
1841.8 106904471 106993282 107142842 107327354 107476974 107590282 107673943 107743788 107798147 107847905 107892561 107913268
1864.2 107913268 107890606 107859325 107886195 107929552 107934594 107902455 107860208 107811677 107761824 107712209 107658422 107603848
1888.7 107603848 107576537 107572544 107567048 107585824 107624805 107659459 107683456 107706356 107730782 107775056 107855892 107946062
1913.2 107946062 108008921 108045208 108099592 108175111 108257627 108347511 108431101 108495855 108547342 108590662 108627748
1935.6 108627748 108653021 108638847 108585918 108540642 108507049 108444118 108355951 108260012 108164179 108080256 108013237
1958.1 108013237 107962239 107930577 107914114 107904434 107922363 107973373 108034050 108093870 108160841 108233070 108300734 108368075
1982.5 108368075 108434045 108491695 108542979 108602214 108683884 108780396 108870256 108941483 108993232 109032512 109062779
2005 109062779 109076500 109075963 109073246 109069991 109053457 109023297 108998287 108981788 108963954 108938336 108898950 108848417 108796024
2031.5A08796024n4168n3120n2273o7807q2159r1564j16873j52290j84142k10333k39444
2053.9A07491851k69735k91121l19517l64542m05097m35733m80581n59604o69134q07416
2074.3A02889371r73415j168132j410085j714129k094990k584540l233028m061365
2090.6H5649687n034590o055706o877304p155555o683183n522901l983926k440560
2106.9D1895962j100579J04922J415637K989373M714098O260306P249075P422119O810981
2125.3G7761894N727035M544467L500545K676976K066153J619726J286597J031076
2141.6A00214469Q37946O93810N79965M89521M19963L61538L06856K60103K18201J86443
2162A04568815J63734J33181J05226Q8024O8057M7230L8946M5443N9258O2812O0272
$$ plain form
2031.5 108796024 108741856 108688736 108636463 108568656 108486497 108394933 108278060 108125770 107941628 107731295 107491851
2053.9 107491851 107222116 106930995 106611478 106246936 105841839 105406106 104925525 104365921 103696787 102889371
2074.3 102889371 101915956 100747824 99337739 97623610 95528620 92944080 89711052 85649687
2090.6 85649687 80615097 74559391 67682087 60526532 53843349 48320448 44336522 41895962
2106.9 41895962 40795383 40900305 42315942 45305315 50019413 56279719 63528794 70950913 77761894
2125.3 77761894 83488929 88033396 91533941 94210917 96277070 97896796 99183393 100214469
2141.6 100214469 101052415 101746225 102326190 102815711 103235674 103597212 103904068 104164171 104382372 104568815
2162 104568815 104732549 104865730 104970956 105058980 105127037 105174267 105213213 105258656 105317914 105380726 105440998
2184.5A05440998O9892Q5950R7943J06275J15275J27435J39499J41978J38998J44780
2204.8A06609023J54793J56772J57666J66238J72519J68658J55353J30475R8610P4398
2225.2A08044505O7330P4827Q4543Q5628P7641O3992M8411M2999N3143O0892N3132
2247.7A08757043M0626L8410L9875M2844N4562N4574L7181K5404K5225K6667K7573
2270.1A09169984L0374L3176L4523K6715J6940K3544L0171J9396R787J4543K3795L1817
2294.6A09464765L3438K6321K6858K7239P284r119j2196j9562k6667k5403j9825j9443
2319.1A09453690p319L0362N5480L6180l93k3580k4485k0719m9388n8139j0955o342
2343.5A09374392l5632L1543J27316J55258J23048P2062M7218K5261k0945m1080l4701
$$ plain form
2184.5 105440998 105510890 105596840 105694783 105801058 105916333 106043768 106183267 106325245 106464243 106609023
2204.8 106609023 106763816 106920588 107078254 107244492 107417011 107585669 107741022 107871497 107970107 108044505
2225.2 108044505 108111835 108186662 108271205 108356833 108434474 108498466 108546877 108589876 108643019 108703911 108757043
2247.7 108757043 108797669 108836079 108875954 108918798 108973360 109027934 109065115 109090519 109115744 109142411 109169984
2270.1 109169984 109200358 109233534 109268057 109294772 109311712 109335256 109365427 109384823 109394610 109409153 109432948 109464765
2294.6 109464765 109498203 109524524 109551382 109578621 109585905 109576786 109564590 109545028 109518361 109492958 109473133 109453690
2319.1 109453690 109446371 109476733 109532213 109568393 109568000 109544420 109519935 109499216 109449828 109391689 109380734 109374392
2343.5 109374392 109338760 109370303 109497619 109652877 109775925 109847987 109895205 109920466 109899521 109858441 109823740
2366A09823740n3490p1668n1916l4940l0351j0168J2338J4746J1587J3530J2744N448
2390.4A09641600j0765k8884m1235m0018k2078j2970k0146j8585j1802q857p117j6129
2414.9A09403014l1638l1853j4007K372L58j8048k9671l2342l4368k8169k5702l3748
2439.4A09126198l4046k8181k7883k2328j1945j2266j8406k1649k0575j2326j0324
2461.8A08906269k2840l7265m4406l9971l4892l4750l3486l1864k5153j8823k2734
2484.3A08560085k6190j8466m446M399p75p927J19R000Q297J0037R466O961J3376R095
2512.8A08573031o008m494Q059K0432L3379L6812K8407K5964L8612M1079K1100P582
2537.3A08823955J0574J3614J5187J6260J1253J0884J3364J335j0741j0157j2839j5425
$$ plain form
2366 109823740 109770250 109698582 109646666 109611726 109581375 109571207 109583545 109598291 109609878 109623408 109636152 109641600
2390.4 109641600 109630835 109601951 109560716 109520698 109498620 109485650 109465504 109446919 109435117 109426260 109419143 109403014
2414.9 109403014 109371376 109339523 109325516 109327888 109328246 109310198 109280527 109248185 109213817 109185648 109159946 109126198
2439.4 109126198 109092152 109063971 109036088 109013760 109001815 108989549 108971143 108949494 108928919 108916593 108906269
2461.8 108906269 108883429 108846164 108801758 108761787 108726895 108692145 108658659 108626795 108601642 108582819 108560085
2484.3 108560085 108533895 108515429 108510983 108515382 108514607 108506680 108506799 108515799 108524096 108534133 108543599 108550560 108563936 108573031
2512.8 108573031 108567023 108562529 108570588 108591020 108624399 108661211 108689618 108715582 108754194 108795273 108816373 108823955
2537.3 108823955 108834529 108848143 108863330 108879590 108890843 108901727 108915091 108916426 108905685 108895528 108882689 108867264
2561.8A08867264p773n340j4234k8181m0614m3142l9351l6323l5787l4452l1518l3451
2586.2A08517098l8909m1831m5002m6241l2878j8096j5592n770J2386J9967J6559R644
2610.7A08331335p28j3792j6725p689o747j5402j8382p058J3304K2519K0158J8180
2635.2A08318973K2685L4666M0889L3772K4939J9669J4436J3829K2709L4189L1936
2657.6A08612692J8680J3292J6260J5629R238J538j681l743j5390j9264M971L6156
2682.1A08688378L7659J4114q94m947o414k050q118k3067j5676p117j8037k4139l0876
2708.6A08598816l7992l0624k1244j4233j5235l3224m8804m5526p284L7551K7216j2064
2733.1A08397353l5036l3581j2219l147k0492n4360o9368l2270J5140J3447k1148l5572
$$ plain form
2561.8 108867264 108859491 108854151 108839917 108811736 108771122 108727980 108688629 108652306 108616519 108582067 108550549 108517098
2586.2 108517098 108478189 108436358 108391356 108345115 108312237 108294141 108278549 108272779 108285165 108305132 108321691 108331335
2610.7 108331335 108330607 108316815 108300090 108292401 108285654 108270252 108251870 108244812 108258116 108280635 108300793 108318973
2635.2 108318973 108341658 108376324 108417213 108450985 108475924 108495593 108510029 108523858 108546567 108580756 108612692
2657.6 108612692 108631372 108644664 108660924 108676553 108685791 108687329 108685648 108681905 108666515 108647251 108652222 108688378
2682.1 108688378 108726037 108740151 108739257 108734310 108727896 108725846 108717728 108694661 108678985 108671868 108653831 108629692 108598816
2708.6 108598816 108560824 108530200 108508956 108494723 108479488 108446264 108397460 108351934 108344650 108382201 108409417 108397353
2733.1 108397353 108362317 108328736 108316517 108313370 108292878 108238518 108169150 108136880 108152020 108165467 108144319 108108747
2757.6A08108747l0184l1924l8660m5776n4061n8294p1263q1146m7338o378j0466l5250
2782A07598007n7459r1672j11616p0762k4999l8135p5984p9262m4370l0326m9770p6664
2806.5A06846988r9528q8083n3394m5359o3789q5855j04868j14131j14787j25110j51992
2828.9A05800092j82116k16663k70748l26645l31009l12602l57843m45115m89915m61173
2849.3A02406263m06944l59822k86042k03979j55902j38617j64950k25127k60663k72548
2869.7I9931669k64650j64724k2542R477n0598r1345j00541j12062j26923j33758j54633
2892.2I8719370j84309j61231j12015j42598k22784k50048k60245l24756m19760m77892
2912.6I6163732m71658m50808m58204m79764m94391m78422m36277l64196k37596j06275
$$ plain form
2757.6 108108747 108078563 108046639 108007979 107962203 107908142 107849848 107778585 107697439 107650101 107643723 107633257 107598007
2782 107598007 107540548 107448876 107337260 107266498 107241499 107203364 107127380 107048118 107003748 106973422 106923652 106846988
2806.5 106846988 106747460 106659377 106605983 106560624 106496835 106410980 106306112 106191981 106077194 105952084 105800092
2828.9 105800092 105617976 105401313 105130565 104803920 104472911 104160309 103802466 103357351 102867436 102406263
2849.3 102406263 101999319 101639497 101353455 101149476 100993574 100854957 100690007 100464880 100204217 99931669
2869.7 99931669 99667019 99502295 99479753 99489230 99438632 99347287 99246746 99134684 99007761 98874003 98719370
2892.2 98719370 98535061 98373830 98261815 98119217 97896433 97646385 97386140 97061384 96641624 96163732
2912.6 96163732 95692074 95241266 94783062 94303298 93808907 93330485 92894208 92530012 92292416 92186141
2933I2186141r215Q6045J76680K08819J77837J25837N9348l1584j12891j24693q1420
2955.4I2660904l2163K6047R0677J42908J85841K23560K42823K31135K20823K45869
2975.8I4238424K63560K77627L46422M10116L94523L44675K94829K64603K77507K58261
2996.2I7370547K01649J80029J74869J82336K03240J89656J45924J16646Q5909k993
3016.6I8847812j58917l40689n09017o01584n65159m36128k51448l558K80416M91696
3037I6753424N12898L91055K61354J38122m4239k82061m83733o22231p17193p00408
3057.4I5206988n46920l08019j3119K90304N57756P44403P91269O89906M93330K95681
3077.8I8201579J62226J04445J29217K20019L30966M33970M98163M69685L46708J99867
$$ plain form
2933 92186141 92176926 92262971 92439651 92648470 92826307 92952144 93011492 92979908 92867017 92742324 92660904
2955.4 92660904 92628741 92654788 92745465 92888373 93074214 93297774 93540597 93771732 93992555 94238424
2975.8 94238424 94501984 94779611 95126033 95536149 95930672 96275347 96570176 96834779 97112286 97370547
2996.2 97370547 97572196 97752225 97927094 98109430 98312670 98502326 98648250 98764896 98850805 98847812
3016.6 98847812 98688895 98348206 97839189 97237605 96672446 96236318 95984870 95981312 96261728 96753424
3037 96753424 97266322 97657377 97918731 98056853 98012614 97730553 97246820 96624589 95907396 95206988
3057.4 95206988 94660068 94352049 94338930 94629234 95186990 95931393 96722662 97412568 97905898 98201579
3077.8 98201579 98363805 98468250 98597467 98817486 99148452 99582422 100080585 100550270 100896978 101096845
3098.2A01096845J08719R2613J01519J02365J22023J69312J60778Q1825L9637M4203
3118.6A02119839N9712Q1253O0654p737m5478k7168j9538m4787o4349m8876m161J3542
3143A02072906j1789l4511n3120o3920j9956M2594M6026Q286j7870k6584l3390m2582
3167.5A01866090m9030n1260m9353n0259o3467p2193o7902o7317p2265p4625p2396
3189.9A01176023o0462m7553n7924p2515p2288p2301p5352p6520p2945p7211r1863
3212.4A00399089q7011p0322p7831p9191o6412q7922j09578j02084j23221j40268q4722
3234.8I9370527m5609q3739j18792j27280j48451j48743j07092r7907j42335j51813
3255.2I8198766j07563j01334j30606j30808j36274j94812k34216j67662q9365q2195
$$ plain form
3098.2 101096845 101205564 101298177 101399696 101502061 101624084 101793396 101954174 102035999 102075636 102119839
3118.6 102119839 102179551 102260804 102321458 102313721 102268243 102241075 102221537 102176750 102112401 102063525 102059364 102072906
3143 102072906 102061117 102026606 101973486 101909566 101889610 101932204 101978230 101986516 101968646 101942062 101908672 101866090
3167.5 101866090 101817060 101765800 101716447 101666188 101602721 101530528 101462626 101395309 101323044 101248419 101176023
3189.9 101176023 101115561 101068008 101010084 100937569 100865281 100792980 100717628 100641108 100568163 100490952 100399089
3212.4 100399089 100312078 100241756 100163925 100084734 100018322 99930400 99820822 99718738 99595517 99455249 99370527
3234.8 99370527 99324918 99241179 99122387 98995107 98846656 98697913 98590821 98492914 98350579 98198766
3255.2 98198766 98091203 97989869 97859263 97728455 97592181 97397369 97163153 96995491 96906126 96823931
3275.6I6823931q6719r3365j15675j37037j42496j49095k01053k29609j69593r5826
3296I5403463o1036q8107j95521k87694k46310j19204k3424j5032q2398j32728j36297
3318.4I4015712j45966j70100j72561j14108m3863l3003o0826j10132j47050r9099
3338.8I2919004k2525N949J7613j6934r2268n8883O1095Q6581J7959k7162j6516j5300
3363.3I2858613o7246q5080J967J08379J22887P2944M1622M3493O9112Q5294O3140
3385.7I3315125Q547n3042k3091R4324J20634K3359j8024R8741K07722J48582N3746
3408.2I3976623M8876Q3351J36113J71482J33008R8270J15872R9701K6571r525L4529
3430.6I4914871M4382M8Q2707K41834K39498J19113M7303M6295Q1098R0766N5980K6280
$$ plain form
3275.6 96823931 96737212 96643847 96528172 96391135 96248639 96099544 95898491 95668882 95499289 95403463
3296 95403463 95342427 95254320 95058799 94771105 94524795 94405591 94382167 94367135 94284737 94152009 94015712
3318.4 94015712 93869746 93699646 93527085 93412977 93369114 93336111 93275285 93165153 93018103 92919004
3338.8 92919004 92896479 92902428 92920041 92903107 92810839 92751956 92813051 92899632 92917591 92890429 92873913 92858613
3363.3 92858613 92791367 92706287 92708254 92816633 92939520 93012464 93054086 93097579 93166691 93251985 93315125
3385.7 93315125 93323672 93270630 93247539 93341863 93462497 93485856 93467832 93566573 93774295 93922877 93976623
3408.2 93976623 94025499 94108850 94244963 94416445 94549453 94647723 94763595 94863296 94889867 94880342 94914871
3430.6 94914871 94959253 94959301 95042008 95283842 95523340 95642453 95689756 95736051 95817149 95907915 95963895 95990175
3455.1I5990175q112k5636M6992P1091n3394q7440J27220L47298L13908J45692K7561
3477.5I6895355M9031K09158K44731J29551J32280J93811J35660M4704M8184J25670
3497.9I8208135J32388P6449J62649K73234K26086J24866P1669J18202J87373J78498
3518.3I9759549J30379J05220J51575K26712K34497K20859K14922J77837J72925K21157
3538.7A01615632K15685J53112J53196K47431L11315K72358K37965K39873K15209J85573
3559.1A03847349J80292J83427J40250J18959K29919L10707K69949K08342J80841J53470
3579.5A05823505J31690J30737J13595J21856K15995K47836J84989J51861J64568J70958
3599.9A07457590J87111J97804J59788J20986J27554J20341J12951J20223O0284N4061
$$ plain form
3455.1 95990175 95982063 95956427 96003419 96074510 96021116 95933676 96060896 96408194 96722102 96867794 96895355
3477.5 96895355 96944386 97153544 97398275 97527826 97660106 97853917 97989577 98034281 98082465 98208135
3497.9 98208135 98340523 98416972 98579621 98852855 99078941 99203807 99275476 99393678 99581051 99759549
3518.3 99759549 99889928 99995148 100146723 100373435 100607932 100828791 101043713 101221550 101394475 101615632
3538.7 101615632 101831317 101984429 102137625 102385056 102696371 102968729 103206694 103446567 103661776 103847349
3559.1 103847349 104027641 104211068 104351318 104470277 104700196 105010903 105280852 105489194 105670035 105823505
3579.5 105823505 105955195 106085932 106199527 106321383 106537378 106785214 106970203 107122064 107286632 107457590
3599.9 107457590 107644701 107842505 108002293 108123279 108250833 108371174 108484125 108604348 108664632 108718693
3620.3A08718693J74177K20025J10411o1071J7727J83177J51419Q7548O7758O2788
3640.7A09732652P8177N8007o8867j89352p486K33447J91403P8618J25075J83773J79767
3663.1A10595214J65987J10531J6797N3096J05178J6308R3508K31802K07639J47617
3683.5A11743677P2348n8294p3409J07634J82748J36388Q3041J0586m4096J6081P8261
3706A12254965K2567r2268j00148N3322J17696N1462j4531j5498j67J2851N7113L6514
3730.4A12383878r2745k08246j14417J24776K22325P2563j12832J4580N3024j11794
3750.8A12231112l1913J31381J02019K0433N0580Q4531J5903m1735m9663J0419R1851
3773.3A12614918O3503l4154o6662K0123O1619K8944K7800K8360K7942Q369m3035j8096
$$ plain form
3620.3 108718693 108892870 109112895 109223306 109162235 109179962 109363139 109514558 109602106 109669864 109732652
3640.7 109732652 109810829 109868836 109799969 109610617 109603131 109836578 110027981 110106599 110231674 110415447 110595214
3663.1 110595214 110761201 110871732 110888529 110941625 111046803 111063111 111156619 111388421 111596060 111743677
3683.5 111743677 111816025 111757731 111684322 111791956 111974704 112111092 112194133 112204719 112160623 112176704 112254965
3706 112254965 112277532 112185264 112085116 112138438 112256134 112307596 112293065 112277567 112277400 112290251 112347364 112383878
3730.4 112383878 112291133 112082887 111968470 112093246 112315571 112388134 112275302 112289882 112342906 112231112
3750.8 112231112 112199199 112330580 112432599 112453032 112503612 112588143 112604046 112562311 112512648 112523067 112614918
3773.3 112614918 112678421 112644267 112577605 112597728 112659347 112688291 112716091 112744451 112772393 112780762 112737727 112719631
3797.7A12719631l2687j16169J0669P9655J4818O6996J02734J943j07502o2740p3099
3820.2A12604249o5208Q0848Q8548M6087J4853m1497n7494q6057r9457O068P4458P3290
3844.6A12638688J02770J26863M0913k20740k33150Q8489J67430O7806m1878l2664
3865A12704527L4333l6836q5962P129P7879Q5700j9503p4672k1852m9626O401N8699
3889.5A12686217j9717J2028Q0073O330r3448j11402o8759L9017J20055Q3709K5201
3912A12759304R18m3321m8983J7894K4819k7788q905L0339j3852l8731K2471N9247
3936.4A12733412L4213j7679n5957k5713J2159m566r906J5640J8323R06j0371j4162
3960.9A12676299q750j4007k7729k3233j3435j1993l421J1933Q940r214n615J8251
$$ plain form
3797.7 112719631 112686944 112570775 112581444 112661099 112675917 112742913 112845647 112847590 112740088 112677348 112604249
3820.2 112604249 112539041 112619889 112708437 112754524 112769377 112727880 112670386 112584329 112484872 112490940 112565398 112638688
3844.6 112638688 112741458 112868321 112909234 112688494 112455344 112543833 112711263 112779069 112737191 112704527
3865 112704527 112738860 112702024 112616062 112623191 112701070 112786770 112767267 112692595 112670743 112621117 112627518 112686217
3889.5 112686217 112666500 112678528 112758601 112764931 112671483 112560081 112491322 112530339 112650394 112734103 112759304
3912 112759304 112760222 112716901 112667918 112685812 112710631 112682843 112673938 112704277 112690425 112651694 112674165 112733412
3936.4 112733412 112767625 112749946 112693989 112668276 112680435 112675869 112665963 112681603 112699926 112700832 112690461 112676299
3960.9 112676299 112667549 112653542 112625813 112602580 112589145 112577152 112573731 112585664 112594604 112585390 112579775 112598026
3985.4A12598026J4865j3542k5570j5653j2981j9193
3997.6A12525952
$$ plain form
3985.4 112598026 112612891 112599349 112573779 112558126 112545145 112525952
3997.6 112525952
##END=$$ End of the data block
