##TITLE=N3Ac-B-5 $$ Begin of the data block
##JCAMP-DX=5.00 $$ ACD/SpecManager v 10.08
##SPECTROMETER/DATA SYSTEM=Alpha
##DATE=16 May 2016 10:57:36
##DATA TYPE=INFRARED SPECTRUM
##DATA CLASS=XYDATA
##ORIGIN=
##OWNER=
##NPOINTS=1667
##FIRSTX=599.64648438
##LASTX=3997.64306641
##MAXX=3997.64306641
##MINX=599.64648438
##MAXY=1.10635328
##MINY=0.13252231
##XFACTOR=1.0000000000
##YFACTOR=0.000000010000000
##FIRSTY=0.77748007
##DELTAX=2.03961372
##XUNITS=1/CM
##YUNITS=ARBITRARY UNITS
##XYDATA=(X++(Y..Y))
599.6 77748007 75245810 73647845 73493749 74641269 76485050 78355986 79832292 80848914 81558818
618 81558818 82190347 82843703 83333963 83532441 83610213 83785975 84106082 84490162 84818357 84937263
638.4 84937263 84766692 84320766 83657289 82935601 82412976 82299972 82573247 83040226 83523268 83899695
658.8 83899695 84114277 84158176 84012765 83633804 83243698 83195937 83249611 83227104 83038372 82513666 81343657
681.2 81343657 79038799 74998116 68703991 60498321 52609611 47982475 47211355 48075703 48521021
699.6 48521021 48895091 50726753 54580337 59571606 64325434 68039924 70795512 73131186 75392467
717.9 75392467 77533954 79237556 80167949 80091316 78878731 76677412 74039727 71670073 69812834
736.3 69812834 68069243 65863097 63059562 60221219 58268291 57850695 58993226 61191529 63766712
754.7 63766712 66163450 68095446 69561017 70776725 72096819 73823613 76052815 78641742 81285924
773 81285924 83674598 85615700 87088943 88182139 88995928 89625484 90117240 90459979 90660536 90755749
793.4 90755749 90749019 90597844 90276510 89858055 89479816 89207065 89006031 88832247 88672751 88531184
813.8 88531184 88386083 88178563 87881422 87480175 86933869 86280352 85682613 85343629 85363126 85602170
834.2 85602170 85804224 85838115 85726506 85562319 85430586 85357451 85311073 85241771 85130823 85006881 84938151
856.6 84938151 84987682 85157269 85384065 85589015 85709649 85705066 85578626 85383177 85196638 85083324
877 85083324 85052890 85064030 85071677 85053062 84985197 84825045 84528410 84056759 83398271 82605982 81734961
899.5 81734961 80818963 79939187 79214877 78740788 78507000 78397125 78318363 78267407 78255373 78256941 78242713
921.9 78242713 78200620 78128028 78018641 77838600 77525562 77035958 76352072 75457245 74340039 73003334
942.3 73003334 71450710 69660109 67606062 65284103 62712604 59960806 57126725 54259872 51409233
960.7 51409233 48791727 46828941 45971319 46484524 48338807 51215601 54588389 57839459 60432380
979 60432380 62112015 63005680 63508016 64000350 64633811 65319204 65870488 66101402 65763634 64780903
999.4 64780903 63752496 63287401 62968719 62104356 60621285 58661360 56213188 53231078 49800357
1017.8 49800357 46171039 42712444 39862487 38031170 37445503 38070855 39564788 41305652 42734063
1036.1 42734063 43635008 44077331 44270152 44466394 44895455 45713326 46930259 48378283 49795651
1054.5 49795651 50949401 51694089 51968765 51804429 51328725 50779760 50498158 50806528 51767004 52943605
1074.9 52943605 53698587 53908074 53980225 54200894 54480255 54615796 54535985 54310942 54039931 53786242
1095.3 53786242 53588903 53478664 53477663 53580141 53731602 53884965 54097760 54516619 55220836 56151634
1115.7 56151634 57217932 58366376 59561568 60794377 62068480 63348687 64561909 65630800
1132 65630800 66513139 67204261 67699409 68010014 68223208 68478870 68838924 69175041 69220626 68759257
1152.4 68759257 67831874 66835034 66249627 66171563 66305810 66406566 66442144 66376364 66078365 65473378
1172.8 65473378 64661056 63866287 63304853 63091874 63188118 63373262 63359183 62965494 62166762 61044919
1193.2 61044919 59729153 58313268 56795686 55112273 53214282 51078165 48652413 45814961
1209.5 45814961 42404926 38371724 33887231 29304299 25050455 21482816 18756130 16838095
1225.8 16838095 15600823 14876764 14501850 14359637 14383025 14542079 14840984 15286665 15863656 16522127
1246.2 16522127 17196880 17833303 18415345 19000638 19712566 20695302 22060101 23821393 25903928
1264.6 25903928 28211358 30643994 33121544 35570329 37917608 40130427 42215061 44202906
1280.9 44202906 46163920 48165259 50158817 51927066 53207994 53970206 54524511 55259943 56274694
1299.2 56274694 57367200 58322400 59119433 59908760 60800368 61761963 62729919 63657516 64501560 65243059
1319.6 65243059 65881097 66440862 66977441 67548752 68190783 68860418 69427955 69797760 70004076 70139086
1340 70139086 70117754 69691372 68712562 67167407 65057933 62343132 58885902 54604012 49783275
1358.4 49783275 45144698 41781500 40557042 40920720 41766587 42327705 42203411 41488943 40691021
1376.7 40691021 40288687 40647477 41982180 44228375 47356161 50882024 53951311 56561303 58989215
1395.1 58989215 61109990 62881976 64291602 65267104 66015869 66659927 67119962 67373943 67427826
1413.5 67427826 67232108 66791546 66378850 66150409 65868545 65470397 64967847 64315510 63660461 62965298
1433.9 62965298 61964071 60796016 59511811 57546955 54713291 51272863 48201400 47582757 49654952
1452.2 49654952 52706170 56252438 60504103 63827008 66159934 68417633 70901936 73147666
1468.5 73147666 75091362 77161425 79233164 80853575 81950355 82533115 82583749 81827766 79778546
1486.9 79778546 75985706 70999312 66964358 65696234 68704325 74386859 78928804 81270188
1503.2 81270188 81961703 82161534 82790577 83275592 83308184 82989919 82650489 82435268 82321602 82496703
1523.6 82496703 82761407 83026665 83238071 83219641 83231997 83393216 83208328 82790112 83150256 84080398
1544 84080398 84982324 85610491 86049700 86439300 86669803 86552358 86366689 87280929 88374901 88860315
1564.4 88860315 88882226 88510954 87980270 87239075 85504353 83085042 82357556 83296996 84523231
1582.8 84523231 85426795 85938489 85859144 84854370 82771158 79955930 77564245 76647991 77102643
1601.1 77102643 78209996 79413074 80360413 80868846 80968976 80664676 79881096 78931731 78259540
1619.5 78259540 77432626 76279974 75274360 74528909 73971522 73390490 72321361 70766854 69753247
1637.8 69753247 69147217 68294674 67020756 65142232 63345033 62250066 60786211 59138149 58785093
1656.2 58785093 58699781 58359993 57922029 57653284 57400876 56796366 56072599 55656171 55394775 55358577
1676.6 55358577 55551487 55629116 55329508 54780531 54378247 53718323 52597350 51225591 49268186
1694.9 49268186 46931034 44627532 42047200 39939615 37838525 35351610 33053374 30907455
1711.3 30907455 28833878 26773071 24674758 23125741 22176820 21265841 20230801 19123124 17851920
1729.6 17851920 16473450 14832957 13579042 13252231 13541213 14568198 16455095 19171453 22743386
1748 22743386 27507246 33172536 38851947 44943514 51463103 57568371 63407111 68292028 71977311
1766.3 71977311 75042725 77651030 80217630 82701480 84688699 86291277 87756002 89121044
1782.6 89121044 90355587 91414374 92163610 92650646 93274498 94050527 94641137 95028329 95424938
1801 95424938 95953506 96452284 96818489 97102970 97486198 98004210 98497283 98921609 99335474 99674654
1821.4 99674654 99889505 100133944 100415504 100747669 101283634 101820302 102166986 102439570 102644503 102650607
1841.8 102650607 102610350 102853692 103243184 103540659 103730226 103836203 103899980 103942537 103983629 103996146
1862.2 103996146 103887999 103594255 103302550 103304017 103418779 103385699 103237641 103089285 102974796 102899194
1882.6 102899194 102851355 102783465 102708721 102754569 102865005 102931786 103037763 103179252 103300369 103407753
1903 103407753 103500378 103563547 103654552 103826511 103992474 104036856 104005885 104052722 104139125 104231286 104370356
1925.4 104370356 104471242 104493904 104485083 104465342 104435372 104367387 104186583 103919816 103736019 103644145 103527367
1947.9 103527367 103391051 103272009 103187990 103160453 103181469 103224766 103276837 103311360 103334951 103432226 103600454
1970.3 103600454 103757083 103888857 104021144 104157293 104282379 104396927 104505944 104597068 104662597 104730463
1990.7 104730463 104867899 105064952 105225396 105331838 105415475 105475807 105512130 105527258 105528951 105530512 105519199
2013.1 105519199 105473673 105435669 105445039 105461800 105458331 105445147 105422020 105393350 105367529 105340838 105318117 105293953
2037.6 105293953 105247891 105191028 105136740 105064249 104955626 104813957 104646814 104459512 104252458 104017627
2058 104017627 103749716 103449261 103127182 102801847 102451968 102025223 101501572 100867689 100087965 99130583
2078.4 99130583 97964787 96551555 94831461 92706460 90040320 86672032 82442200 77276379
2094.7 77276379 71341085 65125847 59353733 54769915 51867038 50720209 51068592 52586401 55131060
2113.1 55131060 58742535 63396907 68813717 74480891 79830825 84456074 88203710 91125083
2129.4 91125083 93370044 95102745 96464074 97554046 98439413 99166465 99766427 100263667 100682187
2147.7 100682187 101041996 101354945 101629782 101869392 102074718 102247560 102400947 102544224 102670145 102781355
2168.1 102781355 102882671 102971077 103046441 103116262 103185487 103255951 103329670 103406787 103490603 103582561 103682673
2190.6 103682673 103788352 103889620 103987074 104087949 104180264 104257536 104335165 104427159 104534578 104651165
2211 104651165 104777598 104912150 105041707 105158722 105259943 105341816 105406392 105456114 105503619 105563426 105629241
2233.4 105629241 105691159 105750287 105807781 105859399 105905640 105948830 105986059 106012571 106027067 106042516 106074893
2255.8 106074893 106123328 106176245 106221676 106255376 106284964 106314814 106342769 106367171 106389189 106410575 106424654
2278.3 106424654 106428909 106428659 106424093 106419528 106418300 106411231 106399131 106395340 106397033 106395507 106393123 106375742 106318271 106230402
2306.8 106230402 106140566 106044054 105925655 105808818 105722094 105661225 105627263 105632758 105660009 105669129 105638146
2329.3 105638146 105567741 105473697 105375147 105278969 105208838 105198038 105236268 105319440 105435681 105519843 105553007
2351.7 105553007 105565703 105550480 105513632 105491686 105466342 105436695 105428004 105436766 105469358 105535054 105604386 105668211
2376.2 105668211 105748737 105841815 105919361 105968571 105990267 105988467 105969250 105930221 105875969 105818868 105759895 105699360
2400.6 105699360 105641198 105589688 105548263 105515742 105493081 105476153 105456114 105433357 105414248 105404818 105394852 105368066
2425.1 105368066 105331457 105292451 105243802 105191386 105144882 105095935 105037808 104977787 104919374 104857612 104796433
2447.6 104796433 104743683 104696286 104649043 104600585 104550374 104501092 104451525 104394734 104325700 104248071 104178166
2470 104178166 104118407 104055905 103995156 103941083 103887153 103837955 103792810 103745174 103706968 103681862 103656602 103625274
2494.5 103625274 103592694 103568232 103551865 103532517 103513491 103499615 103480196 103460455 103444064 103418696 103391492
2516.9 103391492 103374505 103368437 103377783 103404498 103433454 103448927 103457987 103464925 103459489 103446388 103435314 103419232
2541.4 103419232 103394687 103371966 103356147 103342211 103318512 103278542 103233659 103190422 103141797 103084993 103022730
2563.8 103022730 102959502 102890134 102803802 102705526 102606082 102511811 102429056 102354574 102277553 102197230 102117050
2586.2 102117050 102032530 101941311 101845539 101749265 101670384 101620078 101584423 101555538 101537526 101531589 101534212 101536357
2610.7 101536357 101531625 101514649 101480913 101436448 101394987 101358056 101318955 101291680 101289713 101301074 101315486 101334119
2635.2 101334119 101357269 101386547 101421595 101447046 101452279 101450479 101454329 101461422 101470757 101487052 101502287 101506019 101507914
2661.7 101507914 101514542 101517379 101513612 101499617 101477420 101458263 101437008 101415229 101414943 101441884 101468110 101470613 101458442
2688.2 101458442 101442504 101428354 101423836 101420748 101406682 101390421 101375425 101350963 101311421 101252425 101185739 101125610
2712.7 101125610 101064992 101006329 100945759 100859356 100748086 100637496 100567818 100546610 100523925 100474930 100410879
2735.1 100410879 100357509 100337923 100333202 100311136 100249910 100165105 100114608 100115144 100116229 100082636 100038421 100002015
2759.6 100002015 99964029 99919844 99865574 99793983 99697536 99570251 99430710 99329895 99270052 99195218 99088150
2782 99088150 98961443 98799169 98602343 98434722 98317981 98181295 97978401 97756881 97575557 97411799
2802.4 97411799 97221649 96995580 96740919 96492398 96262199 96010572 95720541 95400900 95047522 94666207
2822.8 94666207 94265687 93828732 93333191 92759442 92078561 91252124 90251827 89117450 87884623
2841.2 87884623 86498344 84939110 83305520 81737208 80350608 79255289 78545725 78201979 78074330
2859.5 78074330 77984041 77782774 77398211 76871854 76311320 75857806 75663477 75737405 75906891 76026773
2879.9 76026773 76065540 76035178 75954789 75818056 75606012 75306886 74925560 74505091 74059224 73528183
2900.3 73528183 72878087 72138709 71315992 70376706 69295621 68076664 66749591 65335041 63861620
2918.7 63861620 62405771 61065996 59931409 59063834 58499408 58242661 58254510 58490694 58931917
2937 58931917 59545004 60254860 60957456 61548585 61955583 62166059 62245071 62292421 62388796 62589103 62930769
2959.5 62930769 63419002 64017320 64694446 65432364 66199327 66967607 67736852 68529791 69359761 70246071
2979.9 70246071 71233237 72316158 73431742 74529952 75563610 76503354 77335918 77990776 78432035
2998.2 78432035 78726751 78965396 79247463 79628682 80048871 80408311 80647564 80695641 80437773 79763752
3018.6 79763752 78617364 77098864 75573492 74517691 74187094 74529105 75340074 76397431 77506077
3037 77506077 78489959 79258084 79842401 80269885 80483282 80406427 80026567 79385608 78570259 77760506
3057.4 77760506 77185601 77035803 77410740 78265125 79420209 80642742 81722826 82510781 82909566
3075.7 82909566 82912022 82654250 82399875 82442731 82931054 83766031 84719789 85609269 86322129 86801404
3096.1 86801404 87053925 87147778 87185657 87239897 87351835 87562883 87864131 88156438 88351250 88472265
3116.5 88472265 88568842 88652730 88728464 88767982 88738889 88672632 88615251 88559848 88480461 88376909 88273001
3139 88273001 88193911 88134342 88061053 87954235 87807876 87635899 87509161 87467170 87450951 87401074 87311077
3161.4 87311077 87196219 87072861 86951357 86834580 86714792 86583209 86442697 86298847 86154121 86006004
3181.8 86006004 85851836 85700297 85551876 85400271 85252708 85100448 84928071 84757483 84609157 84470606
3202.2 84470606 84329909 84182680 84022105 83851969 83683264 83526558 83376211 83209354 83039832 82889217
3222.6 82889217 82734144 82559168 82375336 82173353 81965119 81803322 81674111 81515831 81320471 81099856
3243 81099856 80862123 80650550 80487001 80320698 80106246 79875875 79681498 79510057 79331422 79146451
3263.4 79146451 78941429 78684199 78397286 78165531 78001577 77844816 77682912 77509534 77304339 77083665
3283.8 77083665 76871073 76651692 76387125 76107818 75885469 75711620 75541210 75350910 75099820 74779665
3304.2 74779665 74473667 74260813 74127066 73997319 73822415 73607975 73372144 73127031 72875440 72628129
3324.6 72628129 72417575 72246200 72078663 71889549 71659142 71406335 71203238 71057045 70925736 70806736
3345 70806736 70660269 70449042 70264876 70179737 70111907 69979787 69817972 69690961 69578552 69412839
3365.4 69412839 69213027 69083172 69062120 69064975 69016409 68929100 68842000 68779457 68733788 68678248 68584871
3387.8 68584871 68426299 68275851 68241286 68237931 68129557 67984158 67963678 68056822 68099993 68047118 67973357
3410.2 67973357 67927587 67945975 68001008 68003726 67978400 68007100 68030280 67953861 67833322 67769337 67738938 67686749
3434.7 67686749 67693645 67815959 67938519 67968047 67924851 67888808 67928958 68000329 68040645 68062150 68062896 68056738
3459.2 68056738 68119526 68227142 68250978 68243772 68423325 68796319 69148761 69372261 69490951 69606435
3479.6 69606435 69867057 70193762 70430523 70666176 70973700 71255046 71460646 71665192 71944779 72229111
3500 72229111 72457170 72788650 73243821 73649943 73991209 74329627 74697506 75099438 75490499 75820988
3520.4 75820988 76119459 76482081 76939106 77437794 77958053 78470600 78931689 79407740 79950744 80446899
3540.8 80446899 80826128 81227452 81813389 82497573 83103055 83680737 84298235 84871799 85377091 85852391
3561.1 85852391 86243081 86524773 87006021 87872106 88757664 89441645 90010732 90559089 91089153 91562527
3581.5 91562527 91898650 92120916 92554247 93309087 93962175 94402301 94853991 95368838 95885134 96427184
3601.9 96427184 96896517 97173017 97413987 97760761 98106158 98428959 98703671 98931956 99378270 99992359
3622.3 99992359 100379539 100372779 100297749 100722766 101353896 101833689 102176678 102417898 102599859 102696645
3642.7 102696645 102545905 102089190 101822662 102401578 103260851 103796387 104198575 104691207 105150008 105515456
3663.1 105515456 105717182 105641305 105497420 105640674 105785203 105941963 106590486 107377315 107952392 108268917
3683.5 108268917 108251750 107954347 107890117 108405149 108995593 109323955 109431672 109384489 109358370 109499478
3703.9 109499478 109549809 109288263 108914542 108943248 109387088 109708464 109712243 109538996 109392667 109372401
3724.3 109372401 109495640 109626508 109468186 108937526 108476067 108634663 109148896 109417856 109247661 108988166
3744.7 108988166 109001708 108930981 108860564 109227860 109652841 109798014 109859645 110064399 110218549 110172892
3765.1 110172892 110058224 110021687 110197961 110466278 110520351 110321307 110170341 110261607 110386252 110466909
3785.5 110466909 110568619 110635328 110624492 110469115 110192978 109966683 109744191 109615898 109773350 109951186
3805.9 109951186 110151720 110425425 110484576 110200369 109827542 109588468 109400773 109535992 109905791 110108709
3826.3 110108709 110166442 110088968 109887719 109651208 109378254 109231043 109402800 109751606 110099351 110298383
3846.7 110298383 110180831 109665024 109065509 109191358 109731579 110019720 109952819 109726441 109673345 109693456
3867.1 109693456 109571195 109540236 109704959 109927773 110019684 109843361 109672344 109641755 109660077 109798312
3887.5 109798312 109849393 109797823 109915292 110000396 109773934 109391975 109181845 109288418 109679067 110089076
3907.9 110089076 110294378 110320389 110209382 109990811 109866560 109932208 109995949 109992719 110034072 110046136 109945869
3930.3 109945869 109918308 110072958 110234070 110253918 110138893 110016298 109997165 109992504 109959567 110001421 110097265
3952.7 110097265 110145211 110132670 110096157 110062909 110056889 110059297 110040319 110005617 109958446 109906459 109885931 109915984
3977.2 109915984 109946454 109935486 109930241 109973729 110013640 110004413 109969378 109928334 109897697 109885824
3997.6 109885824
##END=$$ End of the data block
