##TITLE=N3Ac-A.5.6 $$ Begin of the data block
##JCAMP-DX=5.00 $$ ACD/SpecManager v 10.08
##SPECTROMETER/DATA SYSTEM=Alpha
##DATE=16 May 2016 10:57:36
##DATA TYPE=INFRARED SPECTRUM
##DATA CLASS=XYDATA
##ORIGIN=
##OWNER=
##NPOINTS=1667
##FIRSTX=599.64648438
##LASTX=3997.64306641
##MAXX=3997.64306641
##MINX=599.64648438
##MAXY=1.12033427
##MINY=0.58423978
##XFACTOR=1.0000000000
##YFACTOR=0.000000010000000
##FIRSTY=0.93886727
##DELTAX=2.03961372
##XUNITS=1/CM
##YUNITS=ARBITRARY UNITS
##XYDATA=(X++(Y..Y))
599.6I3886727k24537k69961l08788k75331j97870j15579n6899n3287q6349j7601J86181
622.1I2466706L01617K79904L06040L81851L61556K60496J75083P9828k4879n4627
642.5I4533575p1425k04909l62336m23628m02624l37654k58505j97590j59794j59281
662.9I1955829j78707j76829k71428l77565l40224k63595k06423k63530n62018j176316
683.3H8139194k057516l062058l887224l963864l206158k578705k626437k326077n66662
701.6F3864493K119577M314375N099029M488670L208888K078164J475954J273143J193571
720H9115864J032549P56002L88217j09637o23888q67885p05511l59481j89209l64578
740.4H8072443p56490j030511r27681n13118r1255J00035M9436j20259k91550l83281
$$ plain form
599.6 93886727 93662190 93392229 93083441 92808110 92610240 92494661 92437762 92384475 92298126 92280525 92466706
622.1 92466706 92768323 93048227 93354267 93736118 94097674 94358170 94533253 94613081 94588202 94533575
642.5 94533575 94462150 94257241 93894905 93471277 93068653 92730999 92472494 92274904 92115110 91955829
662.9 91955829 91777122 91600293 91328865 90951300 90611076 90347481 90141058 89877528 89315510 88139194
683.3 88139194 86081678 83019620 79132396 75168532 71962374 69383669 66757232 64431155 63864493
701.6 63864493 65984070 70298445 75397474 79886144 83095032 85173196 86649150 87922293 89115864
720 89115864 90148413 90904415 91292632 91182995 90559107 89691222 88985711 88626230 88437021 88072443
740.4 88072443 87315953 86285442 85357761 84844643 84753388 84853423 84902859 84782600 84491050 84107769
760.8H4107769l06732K7144N86337J216400J740038K004677J952124J672226J325780
779.1I4325763J023662P84022N98293M49872L18116K13951J39117P0739J3620J496
799.5I7938651M8435J04910J22529J08236O0093j6576o3282n3364m0913o0838j00946
822I8046935j56916k29775l21889m30525n32049o07961o53023o29651m84353k12008
842.4I3788785J15239M03864O05207O92129O60724N43827L89766K62666J83833J10012
862.8I7756052L7181k1535r4336j64908j84536j43403p7158m5473n8353o8420m3416
885.2I6891695J3584P4881J10567J16152J10936J11419R6732M9931r203o0123r4289
907.6I7412282j29938j92928k76351l57133l93510l36844j96761l8421O6352R8109
$$ plain form
760.8 84107769 83801037 83828181 84414518 85630918 87370956 89375633 91327757 92999983 94325763
779.1 94325763 95349425 96133447 96731740 97181612 97499728 97713679 97852796 97923535 97937155 97938651
799.5 97938651 97987086 98091996 98214525 98322761 98382854 98366278 98302996 98249632 98208719 98147881 98046935
822 98046935 97890019 97660244 97338355 96907830 96375781 95767820 95114797 94485146 94000793 93788785
842.4 93788785 93904024 94307888 94913095 95605224 96265948 96809775 97199541 97462207 97646040 97756052
862.8 97756052 97793233 97771698 97677362 97512454 97327918 97184515 97107357 97061884 97003531 96935111 96891695
885.2 96891695 96905279 96980160 97090727 97206879 97317815 97429234 97525966 97575897 97566694 97506571 97412282
907.6 97412282 97282344 97089416 96813065 96455932 96062422 95725578 95528817 95490396 95556748 95654857
928I5654857Q9783O1559J9580k9116r0510j83290l06857m63015o60378q62282j036853
950.5I2193478j204592j367372j486325j556969j613480j632720j450300r04334o3890
968.8H0913496Q11481J462859J744545J630062J207292O63829K05618p1252k10082
987.2H8357848l01564m44817o91432j025611j374877j391893q21525l06207m93849
1005.5H1506073r27603j039058q93485o93226n07146l36933k15871j91307j81442K0230
1025.9G6540232M37051Q11946R31192Q24928O59090N22578M04179L17037K89393L25280
1046.3H2062906M29380N74547O87087P04640O12604M38428K15131o8515m21995p44897
1066.7H4489316p90006l52705L33488P61855Q04031O85483N20742K96229N3460j35315
$$ plain form
928 95654857 95744640 95806199 95825779 95796663 95706153 95522863 95216006 94752991 94092613 93230331 92193478
950.5 92193478 90988886 89621514 88135189 86578220 84964740 83332020 81881720 80977386 80913496
968.8 80913496 81724977 83187836 84932381 86562443 87769735 88433564 88639182 88567930 88357848
987.2 88357848 88056284 87611467 86920035 85894424 84519547 83127654 82306129 81999922 81506073
1005.5 81506073 80578470 79539412 78645927 77952701 77445555 77108622 76892751 76701444 76520002 76540232
1025.9 76540232 76977283 77789229 78720421 79545349 80204439 80727017 81131196 81448233 81737626 82062906
1046.3 82062906 82492286 83066833 83753920 84458560 85071164 85509592 85724723 85656208 85234213 84489316
1066.7 84489316 83699310 83346605 83680093 84441948 85245979 85931462 86452204 86748433 86801893 86666578
1087.1H6666578k16359j58077J8084K46852M62574O08307O48433O13892N86742O02597
1107.5I0079623O20729O04278N59449N07212M59701M17405L78507L53116L44795L34066
1127.9I4658881K95157K18403J30409M8280l4690j03051j41805j59556j87915k80363
1148.3I4443750m64719p11084r00501q40294m77928o3091J10298P3445K8109l2436
1168.7I1165549k17492m58854n90581n28586l02201j6529K22481L41564L01003J21934
1189.1I0038288j20789l45284m91005n45096n48202n42361n37997n45323n94491o99681
1209.5H5068059q36706r63539j064706j149219j212192j239002j212853j132339j017004
1227.9G5240499q69584o95294n23705l71015k31260r5165K3961R3931J10239J00035
$$ plain form
1087.1 86666578 86450219 86292142 86310226 86557078 87019652 87627959 88276392 88890284 89477026 90079623
1107.5 90079623 90700352 91304630 91864079 92371291 92830992 93248397 93626904 93980020 94324815 94658881
1127.9 94658881 94954038 95172441 95302850 95351130 95316440 95213389 95071584 94912028 94724113 94443750
1148.3 94443750 93979031 93267947 92367446 91527152 91049224 90986133 91096431 91169876 91197985 91165549
1168.7 91165549 90948057 90489203 89898622 89370036 89067835 89051306 89273787 89615351 89916354 90038288
1189.1 90038288 89917499 89572215 89081210 88536114 87987912 87445551 86907554 86362231 85767740 85068059
1209.5 85068059 84231353 83267814 82203108 81053889 79841697 78602695 77389842 76257503 75240499
1227.9 75240499 74370915 73675621 73151916 72780901 72549641 72454476 72478437 72572368 72682607 72782642
1248.2G2782642Q4430O5714M0942K1351J7899J7589N347j55K3710O2222Q9276Q8209
1272.7G3299176O5547N4002J02275K56962M93890P14350Q39376Q35288P10940N32365
1293.1G7904171L62348K11609Q6957M8065J43755L44848N48649O24663N31661L37893
1313.5H1144619J66357J72257L78454O19518P63387P76470O81972N53978M36210L28893
1333.9H6022115K51186K35831K24597J16241m7273k11489m06998o29765q25066r58198
1354.3H3771181j040679j094449j095545j013750q64768o68073m46021k96259k11757
1372.7G7039880j02532j3304R3055K21097K65920K52796K87401K29204M8774M3446
1393.1G8365737J75244J78546R4270j7422o6281L4237R1350J00601J46079J37150R1970
$$ plain form
1248.2 72782642 72867072 72932786 72973728 72995079 73012978 73030567 73035914 73035759 73059469 73121691 73210967 73299176
1272.7 73299176 73364723 73418725 73521000 73777962 74271852 74986202 75825578 76660866 77371806 77904171
1293.1 77904171 78266519 78478128 78565085 78613150 78756905 79101753 79650402 80275065 80806726 81144619
1313.5 81144619 81310976 81483233 81861687 82481205 83244592 84021062 84703034 85257012 85693222 86022115
1333.9 86022115 86273301 86509132 86733729 86849970 86802697 86591208 86184210 85554445 84729379 83771181
1354.3 83771181 82730502 81636053 80540508 79526758 78661990 77993917 77547896 77251637 77039880
1372.7 77039880 76937348 76924044 77017099 77238196 77504116 77756912 78044313 78273517 78322291 78365737
1393.1 78365737 78540981 78719527 78813797 78796375 78730094 78764331 78855681 78956282 79102361 79239511 79331481
1415.5G9331481K05988M04203K79903J82647K29692K36059K86781K36810O6834L4386
1435.9H1494784k13110j023591j918286k371466k066111q67630J032186K226973K275276
1454.3G8569025K479154K630967J433706P47394Q28940Q65531N73283M52948O23089
1472.6H9204037N87893K91645O6579j06693l68237q71796j671838k448207k309829
1491H2373554j075143O22249K434897K761614J627547O34134K55006K65533n1248l46136
1511.4H9502007m22430m35043m21667l71927k86925k72107l17752l31038l71802l36886
1531.8H5934430k29251l25310m01181j45376M4405p5173j37585j32007l3950L5673
1552.2H4534675K5213K2810M60869Q39866K71380J18750J79875K04271J46139k43426
$$ plain form
1415.5 79331481 79537469 79941672 80221575 80404222 80633914 80869973 81156754 81393564 81460398 81494784
1435.9 81494784 81281674 80258083 78339797 75968331 73902220 73034590 74066776 76293749 78569025
1454.3 78569025 81048179 83679146 85112852 85860246 86689186 87554717 88128000 88580948 89204037
1472.6 89204037 89791930 90083575 90150154 90043461 89675224 88803428 87131590 84683383 82373554
1491 82373554 81298411 81920660 84355557 87117171 88744718 89378852 89633858 89899391 89848143 89502007
1511.4 89502007 89079577 88644534 88222867 87850940 87564015 87291908 86974156 86643118 86271316 85934430
1531.8 85934430 85705179 85379869 84978688 84833312 84877717 84802544 84664959 84532952 84499002 84534675
1552.2 84534675 84559888 84582698 85043567 85883433 86154813 86273563 86453438 86657709 86803848 86560422
1572.6H6560422n19395k89809K40844O64401R65965R80824O86801J49840n45943j276976
1593H7616974j696223j216853L4267J108676J441419J218224Q21114M15998L6359k61861
1613.4H9518094m01115m65626n84894o57904o84190p45666q09002q53628r10962r23651
1633.7H2481456q68088q49694q99405r39524r09537p21419n52851n58561j00171P10118
1654.1G6792324L30239O8122K37066M33594L16214p4243j71036j08033j79398J5622
1674.5G7660471K73633R7650j22487r5218J2493l49868o39510o76185p11918o16377
1694.9G4832684n03713m10283l12084n55163o46508n50044n31345m45438j78319L13360
1715.3G1013147J022559J045442O43032Q40301J240718J438052J500803J442814J751846
$$ plain form
1572.6 86560422 86041027 85751218 85992062 86656463 87622428 88603252 89290053 89439893 88893950 87616974
1593 87616974 85920751 84703898 84738165 85846841 87288260 88506484 89327598 89743596 89779955 89518094
1613.4 89518094 89116979 88651353 88066459 87408555 86724365 85978699 85169697 84316069 83405107 82481456
1633.7 82481456 81613368 80763674 79864269 78924745 78015208 77293789 76740938 76182377 76082206 76792324
1654.1 76792324 77122563 77190685 77427751 77861345 78177559 78103316 77932280 77824247 77644849 77660471
1674.5 77660471 77934104 78031754 77909267 77814049 77826542 77476674 76837164 76160979 75449061 74832684
1694.9 74832684 74328971 73918688 73606604 73051441 72404933 71854889 71323544 70878106 70699787 71013147
1715.3 71013147 72035706 73081148 73724180 74564481 75805199 77243251 78744054 80186868 81938714
1733.7H1938714J579994Q26609Q26704J011122R49031R16976R29498J056755J036429
1752I1071832Q36516R25982J087117J056540J079935Q87012O46556O23762O26302O97207
1772.4I9538761O43450M46272L75963M11295M30918M05836L36051K32971J92130J79517
1792.8A03193164R1994L7872O4290J07288J07742Q3124Q9693J12653J46151J66893
1813.2A04200864J54626J46044J45423J28317J09243J16086J19043J38962J46985J01125
1833.6A05506718P6640P2717M2117Q333L4284P8607O5780L7753J7882N626r29l171
1858.1A05942357m971k0862n4908p8904o0237m3523p0668r1993r3663r0945q4960p1621
1882.6A05175102o4814o2585l4678q512j6296q487J9848K7108L2568M4775M2510M1414
$$ plain form
1733.7 81938714 83518708 84345317 85172021 86183143 87132174 88049150 88978648 90035403 91071832
1752 91071832 91908348 92834330 93921447 94977987 96057922 96944934 97591490 98215252 98841554 99538761
1772.4 99538761 100182211 100628483 101004446 101415741 101846659 102252495 102588546 102821517 103013647 103193164
1792.8 103193164 103285158 103323030 103387320 103494608 103602350 103685474 103775167 103887820 104033971 104200864
1813.2 104200864 104355490 104501534 104646957 104775274 104884517 105000603 105119646 105258608 105405593 105506718
1833.6 105506718 105583358 105656075 105698192 105706525 105740809 105819416 105885196 105922949 105940831 105946457 105945528 105942357
1858.1 105942357 105937386 105916524 105861616 105782712 105722475 105678952 105608284 105516291 105422628 105331683 105246723 105175102
1882.6 105175102 105110288 105047703 105013025 105004513 104988217 104979730 104999578 105026686 105059254 105104029 105146539 105187953
1907.1A05187953N9688P4160O3538N2321O0582O0857M5848M5228M2128K5046J2076
1929.5A05729425P451J025j2875l5083p0357r2471q9276r6166j14179j13368r5022
1951.9A05019104p0798m2224j5545L851Q905M720J4115M0233N7125N9771O2216O7794
1976.4A05209267O7639N8938N6576O3873O8366O2668O5876P6496O5363N1105N0330
1998.8A05896497M4989L6812L4237K5189J3292J4865K0802J4103L922j169r334j3852
2023.3A06080353j1110j5128k1839k1922k5320k2662j1420k1959n1665p1406p6700
2045.8A05729222q3482j00279j15359j24442j31417j32429j46914j87397k21061k28119
2066.2A04258323k34282k54834k81537l14080l55161m23216n33378o82486q75008j113283
$$ plain form
1907.1 105187953 105247641 105321801 105385339 105437660 105498242 105559099 105604947 105650175 105692303 105717349 105729425
1929.5 105729425 105736876 105737901 105725026 105689943 105619586 105527115 105437839 105341673 105227494 105114126 105019104
1951.9 105019104 104948306 104906082 104890537 104894388 104903293 104908013 104922128 104962361 105019486 105079257 105141473 105209267
1976.4 105209267 105276906 105335844 105392420 105456293 105524659 105587327 105653203 105729699 105795062 105846167 105896497
1998.8 105896497 105941486 105978298 106012535 106037724 106051016 106065881 106086683 106100786 106104708 106103539 106094205 106080353
2023.3 106080353 106069243 106054115 106032276 106010354 105985034 105962372 105950952 105928993 105877328 105805922 105729222
2045.8 105729222 105645740 105545461 105430102 105305660 105174243 105041814 104894900 104707503 104486442 104258323
2066.2 104258323 104024041 103769207 103487670 103173590 102818429 102395213 101861835 101179349 100304341 99191058
2086.6I9191058j411122j801718k298343k889639l527498m119307m592401m923248
2102.9G3627782n044556m715049l643072j801127N02235K817738M709267N861170O165355
2121.2G8479743N732054M839664L809482K877486K138752J590639J198369R17924P11143
2139.6A02295256N61821M50599L54624K74956K13337J68181J34861J09208R4223Q0132
2160A04737198O9964O7783O0892N1796M4894L0423J1027N722N650r30o783j1277p343
2186.5A05059016R167L0494M9197P0262R8038J21367J32620J32370J22810J12664J10364
2208.9A06048369J08314R9099Q0430N9998M7577L1948J0264j0658k7561k8121j2219
2231.4A06407440N36K349M673J5556K8944L6669L6395K6822J2088P98k300M363J8918
$$ plain form
2086.6 99191058 97779936 95978218 93679875 90790236 87262738 83143431 78551030 73627782
2102.9 73627782 68583226 63868177 60225105 58423978 58926213 61743951 66453218 72314388 78479743
2121.2 78479743 84211797 89051461 92860943 95738429 97877181 99467820 100666189 101584113 102295256
2139.6 102295256 102857077 103307676 103662300 103937256 104150593 104318774 104453635 104562843 104657066 104737198
2160 104737198 104807162 104874945 104935837 104987633 105032527 105062950 105073977 105079699 105085349 105084419 105077636 105066359 105059016
2186.5 105059016 105068183 105098677 105147874 105218136 105316174 105437541 105570161 105702531 105825341 105938005 106048369
2208.9 106048369 106156683 106255782 106336212 106396210 106443787 106475735 106485999 106475341 106447780 106419659 106407440
2231.4 106407440 106407976 106410325 106414998 106430554 106459498 106496167 106532562 106559384 106571472 106572270 106569970 106574333 106593251
2257.9A06593251K6667K2722J9240K2888L3260L7098K8777K3925K1136R656L040N292
2282.3A06846952L362J431N352O676M446N794N948M387R859O878k0122l7325k0301
2308.9A06823337q190k9420m8137k6786J6510M4167M1974K7382K2161K1219p474n1558
2333.3A06825185n2476l6872l3092k0254l6633r3686j02151l0565P8416J61290J46568
2355.8A06805730P6067J4115m3571q5104j06060j20414j21593j19424j27077j23978
2376.2A06048691j00660p5102o4897o7389o3014m7541l8672m4858n2583n4622n5873
2398.6A05383480n2488m9711n7077n6696m4381l7444l7909m5466n2309n0676m7338
2421A04851985m3893l9029l9291m5729m9162m9531n0629n0425m7338m4823m6062m7064
$$ plain form
2257.9 106593251 106619918 106642640 106661880 106684768 106718028 106755126 106783903 106807828 106828964 106838620 106841660 106846952
2282.3 106846952 106850314 106851745 106857097 106863773 106868219 106874013 106879961 106884348 106894207 106901085 106880963 106843638 106823337
2308.9 106823337 106815147 106785727 106737590 106710804 106727314 106771481 106813455 106840837 106862998 106884217 106876743 106825185
2333.3 106825185 106772709 106735837 106702745 106682491 106645858 106552172 106450021 106419456 106497872 106659162 106805730
2355.8 106805730 106881797 106895912 106852341 106767237 106661177 106540763 106419170 106299746 106172669 106048691
2376.2 106048691 105948031 105872929 105808032 105740643 105677629 105630088 105591416 105546558 105493975 105439353 105383480
2398.6 105383480 105330992 105281281 105224204 105167508 105123127 105085683 105047774 105002308 104949999 104899323 104851985
2421 104851985 104808092 104769063 104729772 104684043 104634881 104585350 104534721 104484296 104436958 104392135 104346073 104299009
2445.5A04299009m0531k6858k4986l5954m1568m0710l8362l8099l8660l8063m1151
2467.9A03894067m6182m7815m3022l7909m7970n7018m8422m4787m8888m4012l3379
2490.4A03394663l0529m2272n2225m3536l4284m0782m6646m2963l8433l5453m2188
2512.8A02945352n3716n0032l8111k6381r156K182o366j4710q679j2708k6834k8729
2537.3A02672112k2089k4939l5703l7396l0518k8002l3975l9291m4620n6148o5350
2559.7A02254081o9261p1239p1800p6211q3410q9276r6870r8431q8644q4722r4294
2582.2A01329923r7227q7953q3578q8560r6882r4950p6592o5291o1226m0316j8704
2604.6A00518644j3268j5390k0754k6787l2973k9087j6117r871j1432j9395j6785O104
$$ plain form
2445.5 104299009 104258478 104231620 104206634 104170680 104129112 104088402 104050040 104011941 103973281 103935218 103894067
2467.9 103894067 103847885 103800070 103757048 103719139 103671169 103614151 103565729 103520942 103472054 103428042 103394663
2490.4 103394663 103364134 103321862 103269637 103226101 103191817 103151035 103104389 103061426 103022993 102987540 102945352
2512.8 102945352 102891636 102841604 102803493 102777112 102767956 102770138 102763772 102749062 102740383 102727675 102700841 102672112
2537.3 102672112 102650023 102625084 102589381 102551985 102521467 102493465 102459490 102420199 102375579 102319431 102254081
2559.7 102254081 102184820 102113581 102041781 101965570 101882160 101792884 101696014 101597583 101508939 101424217 101329923
2582.2 101329923 101232696 101144743 101061165 100972605 100875723 100780773 100704181 100638890 100577664 100537348 100518644
2604.6 100518644 100505376 100489986 100469232 100442445 100409472 100380385 100364268 100354397 100342965 100323570 100306785 100312889
2629.1A00312889K1445K0421J5688J0490J1087J5115J1790L183K265P451K432J275
2653.5A00435531J3125J1158J097O902J5175J1719M470p415j6630j0025n567n341P510
2680.1A00461709J8204J5020M339r060j5699j5474j3506j6499k5880k4259j7977k4009
2704.5A00336909l9744o3932p8344p5531p4709p1752p1162q3631r2161r1565p2973
2727I9521405m7577m8512o5708p7498p3910o1065n2059n7649q9723j11479q1241m0305
2751.4I8714679m4631o8546o8700o3479o9910p4608p8904r0164j04910j15919j12897
2773.9I7822011q8943o9689q0025j00428j20890j51206j66726j35475r9993j18172
2794.3I6690464j62542j68031j32925j16139j32203j61600j88035j80298j51056j46509
$$ plain form
2629.1 100312889 100334334 100354755 100370443 100380933 100392020 100407135 100418925 100422108 100424373 100431824 100434256 100435531
2653.5 100435531 100448656 100459814 100460911 100467813 100482988 100494707 100499177 100491762 100475132 100465107 100459540 100454199 100461709
2680.1 100461709 100479913 100494933 100499272 100490212 100474513 100459039 100445533 100429034 100403154 100378895 100360918 100336909
2704.5 100336909 100297165 100233233 100154889 100079358 100004649 99932897 99861735 99778104 99685943 99594378 99521405
2727 99521405 99473828 99425316 99359608 99282110 99208200 99147135 99095076 99037427 98947704 98836225 98754984 98714679
2751.4 98714679 98670048 98601502 98532802 98469323 98399413 98324805 98245901 98155737 98050827 97934908 97822011
2773.9 97822011 97733068 97663379 97583354 97482926 97362036 97210830 97044104 96908629 96808636 96690464
2794.3 96690464 96527922 96359891 96226966 96110827 95978624 95817024 95628989 95448691 95297635 95151126
2814.7I5151126j67513j90210k07376k12550k10494k18451k36017k56115k77579l06916
2835.1I2867905l37750l27849k93875l12787l74943m13656l97832l57586l34656l13550
2855.5H9403421k90621k70480k36725k13033k11192j99091j82307j62250p9387M2832
2875.9H7601167J00106R8520J00595J18685J43522J45215J21164P9554K7448J6505
2896.3H8552481K3138l8695j34003j83576k05195k44820l01290l37893l31247l00055
2916.7H6498845k70152k58768k67422k61516k33566j83893q7559J2469P4500J31029
2937H5153967J89710K13706K03151K04164K20090K00444J44601J25879J43522J29199
2957.4H6928433R5731P7659P2253P3957P2396O2192N0681O8045J13416J35249J50370
$$ plain form
2814.7 95151126 94983613 94793403 94586027 94373477 94162983 93944532 93708515 93452400 93174821 92867905
2835.1 92867905 92530155 92202306 91908431 91595644 91220701 90807045 90409213 90051627 89716971 89403421
2855.5 89403421 89112800 88842320 88605595 88392562 88181370 87982279 87799972 87637722 87558335 87601167
2875.9 87601167 87701273 87799793 87900388 88019073 88162595 88307810 88428974 88508528 88535976 88552481
2896.3 88552481 88575619 88536924 88402921 88219345 88014150 87769330 87468040 87130147 86798900 86498845
2916.7 86498845 86228693 85969925 85702503 85440987 85207421 85023528 84935969 84948438 85022938 85153967
2937 85153967 85343677 85557383 85760534 85964698 86184788 86385232 86529833 86655712 86799234 86928433
2957.4 86928433 87024164 87101823 87174076 87248033 87320429 87382621 87433302 87501347 87614763 87750012 87900382
2979.9H7900382K03610K38931K01142J24019M7517J0693L099n0175j04946q9812n1165
3002.3H8433295k1791j3465n4997j21856j70850k28799l47203n19824o81788p53170
3022.7H5519552o66398m31382j54925P1156K29848L41773L87788L30823K26146J47939
3043.1H6002320P2962p1686k83707m63342n49877n48774m50313k67518m0489J95128
3063.5H3594704L92186N15348N41431M66865L03912Q5724r0683j33812l6115J44822
3083.9H5784382L14563L87961L77637L45808K82771J71280N7476Q613K8777M8673M1283
3106.3H7849224N3858R9922R9122K6548j8162q314J6588L3396j556o8801r1708o2466
3130.8H7927651n5492j04242j52010j45918r4271o4832r0777j26893j52451j62416
$$ plain form
2979.9 87900382 88103992 88342923 88544065 88668084 88715601 88726294 88729393 88679218 88574272 88484460 88433295
3002.3 88433295 88411504 88398039 88343042 88221186 88050336 87821537 87474334 86954510 86272722 85519552
3022.7 85519552 84853154 84421772 84266847 84338003 84567851 84909624 85297412 85628235 85854381 86002320
3043.1 86002320 86075282 86003596 85719889 85256547 84706670 84157896 83707583 83440065 83399576 83594704
3063.5 83594704 83986890 84502238 85043669 85510534 85814446 85900170 85809487 85675675 85639560 85784382
3083.9 85784382 86098945 86486906 86864543 87210351 87493122 87664402 87721878 87730491 87759268 87807941 87849224
3106.3 87849224 87903082 88003004 88102126 88128674 88110512 88102198 88118786 88152182 88150626 88081825 87990117 87927651
3130.8 87927651 87872159 87767917 87615907 87469989 87375718 87310886 87220109 87093216 86940765 86778349
3151.2H6778349j19490n5480n0622q8483j13082j25510j33663j36369j35374j26845
3171.6H5693431j24753j33568j38807j44875j46949j35321j27357j30123j27393j17195
3192H4367090j14017j21266j22291j15704j18643j28609j27459j13660j08409j12939
3212.4H3184093j08099r9647j00350r7066q7929r6047j07700j03682j12891j20354
3232.8H2150328q5026m8983n4771p8201r6315j06126r9862p8469o8295q3244q7559
3255.2H1263477o3211n3656o6567o7413o9403j00076j24056q6087k5385q166j7738
3277.7H0581719l0458m4799n5504n3465n5099r2149j09291o4802j4412J3965k861p8440
3302.1G9994404j35290j05453k5940L1597L8552J0359j7667l0732l1262k6948k6738
$$ plain form
3151.2 86778349 86658859 86603379 86552757 86464274 86351192 86225682 86092019 85955650 85820276 85693431
3171.6 85693431 85568678 85435110 85296303 85151428 85004479 84869158 84741801 84611678 84484285 84367090
3192 84367090 84253073 84131807 84009516 83893812 83775169 83646560 83519101 83405441 83297032 83184093
3212.4 83184093 83075994 82976347 82875997 82778931 82691002 82594955 82487255 82383573 82270682 82150328
3232.8 82150328 82065302 82016319 81961548 81883347 81787032 81680906 81581044 81502575 81434280 81351036 81263477
3255.2 81263477 81200266 81146610 81080043 81012630 80943227 80843151 80719095 80633008 80607623 80599457 80581719
3277.7 80581719 80551261 80506462 80450958 80397493 80342394 80250245 80140954 80076152 80061740 80075705 80072844 79994404
3302.1 79994404 79859114 79753661 79727721 79759318 79797870 79808229 79790562 79759830 79728568 79701620 79674882
3324.6G9674882j2970J6784L3343K4516p701l5727p540M5192N8967O0636M0626j1659
3349G9879349O849Q4251R5242M3357J3697L3742M7815J5652n328L8832J08290J24025
3373.5H0485773Q4853N7930O0147P9972J03116R4419N1922J2743M0246J16294J39046
3395.9H1326461R2482O1763J29223K19565J98817J26637J12468J42049J93876K27315
3416.3H2830656K09772K06411K23845J98341J40094J20473J68378J95509J62512J98734
3436.7H4654725L01849L22718K55990K08664K20984K30455K15644K08962K11781J98847
3457.1H7030619J84417K13653K26122J83475J82092K52438L10397L01862K61521K24644
3477.5H9371240K21366K77304K93494K52533K59691K80261K55597K36153K58482K76029
$$ plain form
3324.6 79674882 79661912 79678696 79712039 79736555 79728854 79693127 79685587 79730779 79789746 79850382 79891008 79879349
3349 79879349 79886198 79970449 80065691 80109048 80122745 80156487 80204302 80219954 80214626 80253458 80361748 80485773
3373.5 80485773 80570626 80628556 80688703 80768675 80871791 80966210 81018132 81030875 81071121 81187415 81326461
3395.9 81326461 81418943 81480706 81609929 81829494 82028311 82154948 82267416 82409465 82603341 82830656
3416.3 82830656 83040428 83246839 83470684 83669025 83809119 83929592 84097970 84293479 84455991 84654725
3436.7 84654725 84956574 85279292 85535282 85743946 85964930 86195385 86411029 86619991 86831772 87030619
3457.1 87030619 87215036 87428689 87654811 87838286 88020378 88272816 88583213 88885075 89146596 89371240
3477.5 89371240 89592606 89869910 90163404 90415937 90675628 90955889 91211486 91447639 91706121 91982150
3497.9I1982150K62606K69461L08561L11005L00116K98804K67255K61664K85483K69162
3518.3I4816267K31964K46483K89899L01254L02243K96068K56598K21378K40111K64353
3538.7I7466618K29406J92338K41805L19463K99131K48915K61665K51323K02286J86563
3559.1I9899513J84780J83618K27737L07739K94984K31289K31564K54870K42591K06482
3579.5A02265167J91224J87635K36333L51596L41689K46477K43819K63012K48599K62844
3599.9A04838395K79653K50113K25675K44570K41149K05493J89423J64402J40309J58608
3620.3A06937790J84083J74153J45626J40118J39118J11818R6607R6154R1947Q6438
3640.7A08203852R3877Q8478M7552L5882J22249J75584J45256J23656J42539J71017
$$ plain form
3497.9 91982150 92244756 92514217 92822778 93133783 93433899 93732703 93999958 94261622 94547105 94816267
3518.3 94816267 95048231 95294714 95584613 95885867 96188110 96484178 96740776 96962154 97202265 97466618
3538.7 97466618 97696024 97888362 98130167 98449630 98748761 98997676 99259341 99510664 99712950 99899513
3559.1 99899513 100084293 100267911 100495648 100803387 101098371 101329660 101561224 101816094 102058685 102265167
3579.5 102265167 102456391 102644026 102880359 103231955 103573644 103820121 104063940 104326952 104575551 104838395
3599.9 104838395 105118048 105368161 105593836 105838406 106079555 106285048 106474471 106638873 106779182 106937790
3620.3 106937790 107121873 107296026 107441652 107581770 107720888 107832706 107929313 108025467 108117414 108203852
3640.7 108203852 108297729 108386207 108433759 108469641 108591890 108767474 108912730 109036386 109178925 109349942
3661.1A09349942J89889J80077J56093J50514J55305J29545J08862J23775J32358J33538
3681.5A10809898J16516N5229j1444K4247J13225J04475O0642L8648J7690O950L3891
3703.9A11369967N5492M0996p414m6146N96N1915M3452K1756K4390K3210K3258L9756
3728.4A11641228L0029k0349q2099o8129N2357J48940J16515o640j8477P391n7244
3750.8A11743522n3454K3937M0818J8513K1541L4964J2994k6023m6063r429M5883K9624
3775.3A11836827l7384m6373K6179N2952K6703J0443K003J0824J4031J502K4831J4425
3799.8A11936963m8221j3387J1552j8883J5032M1282K182k6477j0335m1544m6480J4388
3824.3A11816072K8718K2864p1k3461r143r215l8528l3832l612K6977P6342J12796
$$ plain form
3661.1 109349942 109539831 109719908 109876001 110026515 110181820 110311365 110420227 110544002 110676360 110809898
3681.5 110809898 110926414 110981643 110970199 110994446 111107671 111212146 111272788 111311436 111329126 111336076 111369967
3703.9 111369967 111425459 111466455 111459041 111412895 111413491 111465406 111508858 111530614 111555004 111578214 111601472 111641228
3728.4 111641228 111671257 111650908 111568809 111500680 111553037 111701977 111818492 111811852 111793375 111800766 111743522
3750.8 111743522 111690068 111714005 111754823 111773336 111794877 111829841 111842835 111816812 111770749 111761320 111807203 111836827
3775.3 111836827 111799443 111753070 111779249 111832201 111858904 111869347 111871350 111882174 111896205 111897707 111922538 111936963
3799.8 111936963 111888742 111875355 111886907 111868024 111883056 111924338 111926520 111900043 111889708 111848164 111801684 111816072
3824.3 111816072 111844790 111867654 111867583 111844122 111834979 111825764 111787236 111753404 111749792 111776769 111853111 111965907
3848.7A11965907O7520j02020j69122J705Q2886N0807l862j1909J1945j6201m4763
3871.2A11832893j4985J8800K9289j4937m5120k0933j7477O009J6450j2397R298L0458
3895.6A11817348K778j2410j4997l3402j8871K5797L9232L4380K1815j8835l0923Q631
3920.1A11820543J9717n865J132J8967j0944l0327Q262M0566L2628J0884r954j7297
3944.6A11878312n293K968l278r06J3196J2803R66r89K646n615n674R048Q344r250
3973.1A11897278j9813k396Q428j0228L22L7277K9337n078j6630j9073j5760r191
3997.6A11874473
$$ plain form
3848.7 111965907 112033427 111931407 111762285 111763990 111846876 111897683 111893821 111881912 111893857 111877656 111832893
3871.2 111832893 111817908 111836708 111865997 111851060 111805940 111785007 111767530 111773539 111789989 111777592 111786890 111817348
3895.6 111817348 111820126 111807716 111792719 111759317 111740446 111766243 111805475 111839855 111861670 111842835 111811912 111820543
3920.1 111820543 111840260 111834395 111835527 111854494 111843550 111813223 111821485 111862051 111894679 111905563 111895609 111878312
3944.6 111878312 111873019 111875987 111872709 111871803 111884999 111897802 111898768 111897779 111900425 111894810 111889136 111898184 111906528 111897278
3973.1 111897278 111877465 111875069 111883497 111873269 111873591 111910868 111940205 111935127 111918497 111899424 111883664 111874473
3997.6 111874473
##END=$$ End of the data block
