##TITLE=N3Ac-A.3-4 $$ Begin of the data block
##JCAMP-DX=5.00 $$ ACD/SpecManager v 10.08
##SPECTROMETER/DATA SYSTEM=Alpha
##DATE=16 May 2016 10:57:36
##DATA TYPE=INFRARED SPECTRUM
##DATA CLASS=XYDATA
##ORIGIN=
##OWNER=
##NPOINTS=1667
##FIRSTX=599.64648438
##LASTX=3997.64306641
##MAXX=3997.64306641
##MINX=599.64648438
##MAXY=1.12600219
##MINY=0.83086503
##XFACTOR=1.0000000000
##YFACTOR=0.000000010000000
##FIRSTY=1.02042508
##DELTAX=2.03961372
##XUNITS=1/CM
##YUNITS=ARBITRARY UNITS
##XYDATA=(X++(Y..Y))
$$ plain form
599.6 102042508 102034986 102008176 101980364 101982546 102023983 102078736 102116227 102125883 102097332 102070296 102122128 102220750
624.1 102220750 102291429 102358782 102465141 102568018 102627563 102671039 102705050 102708685 102690041 102667189 102632439
646.6 102632439 102574182 102490735 102390325 102292013 102207065 102126718 102044201 101954138 101849771 101713300 101508296
669 101508296 101309192 101146185 101007295 100904095 100793600 100561821 100023162 98937500 97121906 94689524
689.4 94689524 92206782 90199804 88499296 86728692 85311949 85263181 87020272 90033674 93291920
707.7 93291920 96001893 97900766 99143660 100015032 100693738 101242781 101669800 101962852 102073646
726.1 102073646 101924598 101524305 101030183 100653899 100488007 100424695 100248206 99834615 99277973 98813611
746.5 98813611 98595726 98586845 98643559 98637128 98526359 98339891 98126376 97979093 98055768 98484206 99276376
$$ packed form
599.6A02042508p522k6810k7812K182M1437N4753L7491R656k8551k7036N1832R8622
624.1A02220750P0679O7353J06359J02877N9545M3476L4011L635j8644k2852l4750
646.6A02632439n8257q3447j00410r8312q4948q0347q2517r0063j04367j36471k05004
669A01508296j99104j63007j38890j03200j10495k31779n38659j085662j815594k432382
689.4I4689524k482742k006978j700508j770604j416743m8768J757091L013402L258246
707.7I3291920K709973J898873J242894Q71372O78706N49043M27019K93052J10794
726.1A02073646j49048m00293m94122l76284j65892o3312j76489m13591n56642m64362
746.5I8813611k17885q881N6714o431j10769j86468k13515j47283P6675M28438P92170
$$ plain form
768.9 99276376 100323439 101457584 102532530 103449368 104177034 104750872 105204058 105557728 105831850
787.3 105831850 106019068 106131649 106213653 106273460 106295967 106301606 106331623 106408393 106526053 106644750 106717491
809.7 106717491 106732070 106724250 106735945 106767023 106789756 106775475 106711161 106616688 106503761 106330466 106075513
832.2 106075513 105767572 105426550 105092418 104850972 104779387 104896045 105164051 105526710 105926883 106316292
852.6 106316292 106654608 106915081 107116044 107287014 107425106 107533419 107619357 107666171 107677531 107690036
873 107690036 107731175 107806516 107892895 107960474 108001482 108025002 108052313 108092940 108128059 108133972 108114398 108093512
897.4 108093512 108071947 108026171 107951343 107866216 107783735 107694995 107577431 107418740 107221508 107020080 106879747
919.9 106879747 106837475 106888115 107003284 107136774 107255006 107357395 107434916 107457185 107416785 107323825 107171607
$$ packed form
768.9I9276376J047063J134145J074946R16838P27666N73838M53186L53670K74122
787.3A05831850J87218J12581Q2004N9807K2507N639L0017P6770J17660J18697P2741
809.7A06717491J4579p820J1695L1078K2733j4281o4314r4473j12927j73295k54953
832.2A06075513l07941l41022l34132k41446p1585J16658K68006L62659M00173L89409
852.6A06316292L38316K60473K00963J70970J38092J08313Q5938M6814J1360J2505
873A07690036M1139P5341Q6379O7579M1008K3520K7311M0627L5119N913j9574k0886
897.4A08093512k1565m5776p4828q5127q2481q8740j17564j58691j97232k01428j40333
919.9A06879747m2272N0640J15169J33490J18232J02389P7521K2269m0400r2960j52218
$$ plain form
942.3 107171607 106930852 106578171 106124067 105586874 104958916 104231942 103426707 102559984 101625788 100662529
962.7 100662529 99832481 99376082 99459106 100069022 101039994 102132416 103103864 103784037 104138088 104258215
983.1 104258215 104261684 104207408 104100871 103916526 103612506 103133678 102460158 101802862 101493359 101436293
1003.5 101436293 101205361 100683069 100052619 99457234 98942167 98514515 98175424 97896111 97628725 97395486
1023.9 97395486 97327602 97541547 98004359 98561132 99074978 99512726 99882007 100189340 100462067 100732780
1044.3 100732780 101024067 101350939 101709509 102076161 102422249 102719867 102936780 103036928 102987552 102751803
1064.7 102751803 102339184 101909947 101735687 101934397 102349305 102784598 103167820 103464389 103624928 103643048
1085.1 103643048 103559637 103428721 103330696 103344810 103495836 103760743 104098058 104452693 104788148 105118334
$$ packed form
942.3A07171607k40755l52681m54104n37193o27958p26974q05235q66723r34196r63259
962.7A00662529q30048m56399Q3024O09916R70972J092422R71448O80173L54051J20127
983.1A04258215L469n4276j06537j84345l04020m78828o73520o57296l09503n7066
1003.5A01436293k30932n22292o30450n95385n15067m27652l39091k79313k67386k33239
1023.9I7395486o7884K13945M62812N56773N13846M37748L69281L07333K72727K70713
1044.3A00732780K91287L26872L58570L66652L46088K97618K16913J00148m9376k35749
1064.7A02751803m12619m29237j74260J98710M14908M35293L83222K96569J60539J8120
1085.1A03643048q3411j30916r8025J4114J51026K64907L37315L54635L35455L30186
$$ plain form
1105.5 105118334 105465472 105822003 106168163 106489861 106781161 107045448 107284760 107490265 107668185 107843065
1125.9 107843065 108016527 108168006 108281648 108358634 108404529 108413494 108389568 108351588 108306956 108241141 108126640
1148.3 108126640 107926071 107612824 107226598 106893575 106748879 106802273 106928456 107011592 107018661 106941903
1168.7 106941903 106764960 106498134 106195128 105940378 105814016 105845737 106009948 106230152 106405699 106470549
1189.1 106470549 106409907 106257772 106069899 105874074 105677879 105488706 105299664 105090952 104848099 104550958
1209.5 104550958 104172039 103713608 103205061 102662385 102089787 101508200 100950110 100451767 100044966 99742198
1229.9 99742198 99542475 99441344 99436945 99525046 99701178 99958295 100262499 100560701 100827944 101064348
1250.3 101064348 101262903 101422215 101549757 101647866 101716602 101756203 101769674 101771772 101778650 101782978 101753831
$$ packed form
1105.5A05118334L47138L56531L46160L21698K91300K64287K39312K05505J77920J74880
1125.9A07843065J73462J51479J13642P6986M5895Q965k3926l7980m4632o5815j14501
1148.3A08126640k00569l13247l86226l33023j44696N3394J26183Q3136P069p6758
1168.7A06941903j76943k66826l03006k54750j26362L1721J64211K20204J75547O4850
1189.1A06470549o0642j52135j87873j95825j96195j89173j89042k08712k42853k97141
1209.5A04550958l78919m58431n08547n42676n72598n81587n58090m98343m06801l02768
1229.9I9742198j99723j01131m399Q8101J76132K57117L04204K98202K67243K36404
1250.3A01064348J98555J59312J27542R8109O8736L9601J3471K098O878M328k9147
$$ plain form
1272.7 101753831 101666832 101535642 101422346 101409924 101551104 101834273 102180028 102485454 102674747 102716005
1293.1 102716005 102620447 102420449 102155221 101897097 101752079 101790488 102001941 102301514 102561629 102681720
1313.5 102681720 102669477 102653611 102775633 103074408 103487778 103918409 104293680 104602110 104854977 105055130
1333.9 105055130 105225158 105392885 105550742 105671751 105729818 105708444 105610561 105445814 105223966 104947460
1354.3 104947460 104608083 104200828 103723216 103187501 102698791 102355349 102152038 102067721 102050591 102062440
1374.7 102062440 102122784 102240074 102395880 102571785 102735436 102861094 102959633 103060830 103172791 103289115
1395.1 103289115 103400064 103478229 103525436 103565979 103617120 103695846 103791547 103888750 103991985 104101813 104196203
1417.5 104196203 104261410 104327500 104405940 104489648 104577732 104647291 104687953 104675639 104500222 104044938 103223968
$$ packed form
1272.7A01753831q6999j31190j13296j2422J41180K83169L45755L05426J89293M1258
1293.1A02716005r5558j99998k65228k58124j45018L8409K11453K99573K60115J20091
1313.5A02681720j2243j5866J22022K98775M13370M30631L75271L08430K52867K00153
1333.9A05055130J70028J67727J57857J21009N8067k1374r7883j64747k21848k76506
1354.3A04947460l39377m07255m77612n35715m88710l43442k03311q4317j7130J1849
1374.7A02062440O0344J17290J55806J75905J63651J25658R8539J01197J11961J16324
1395.1A03289115J10949P8165M7207M0543N1141P8726R5701R7203J03235J09828R4390
1417.5A04196203O5207O6090P8440Q3708Q8084O9559M0662j2314j75417m55284q20970
$$ plain form
1440 103223968 101927602 100436115 99292076 98980141 99765420 101120090 102396238 103575563 104686391
1458.3 104686391 105400550 105862129 106255805 106616151 106919110 107151246 107317567 107451236 107544696 107555687
1478.7 107555687 107448173 107177019 106624937 105573487 104027367 102692497 102295625 102888131 104319072
1497.1 104319072 105820310 106762218 107241154 107425880 107377267 107284272 107215607 107117808 106965744 106794178
1517.5 106794178 106658995 106517160 106411958 106345367 106270003 106224179 106179845 106108451 106075406 106047404 105917895
1539.9 105917895 105798984 105781555 105787420 105800593 105825830 105873120 105942380 106018114 106020737 106006742 106116235
1562.4 106116235 106236982 106292236 106245458 106089842 105880058 105569816 105260837 105346084 105752873 106234205
1582.8 106234205 106640303 106877184 106873143 106571770 105945897 105134201 104569018 104600263 105121589 105786848
$$ packed form
1440A03223968j296366j491487j144039l11935P85279J354670J276148J179325J110828
1458.3A04686391P14159M61579L93676L60346L02959K32136J66321J33669R3460J0991
1478.7A07555687j07514k71154n52082j051450j546120j334870l96872N92506J430941
1497.1A04319072J501238R41908M78936J84726m8613r2995o8665r7799j52064j71566
1517.5A06794178j35183j41835j05202o6591p5364m5824m4334p1394l3045k8002j29509
1539.9A05917895j18911j7429N865J3173K5237M7290O9260P5734K623j3995J09493
1562.4A06116235J20747N5254m6778j55616k09784l10242l08979Q5247M06789M81332
1582.8A06234205M06098K36881m041l01373o25873q11696n65183L1245N21326O65259
$$ plain form
1603.2 105786848 106335437 106690061 106870890 106922841 106887460 106729662 106435823 106184697 105947340 105606437
1623.5 105606437 105222917 104817712 104401934 104041910 103625810 102976894 102370501 101963222 101600254 101231825
1643.9 101231825 100772583 100379598 100283730 100274360 100308776 100558078 100894153 101232469 101569891 101902378
1664.3 101902378 102170408 102352929 102503610 102680242 102889848 103129494 103364015 103572774 103697026 103675568
1684.7 103675568 103654706 103680706 103721726 103785360 103839195 103909326 104000223 104062617 104118454 104118395 104045427 103970289
1709.2 103970289 103909719 103864360 103825617 103777671 103792810 103895915 104034734 104208064 104406393 104590833
1729.6 104590833 104723561 104769051 104819036 104941547 105109656 105362880 105721664 106156087 106633222 107135963
1750 107135963 107622707 108044720 108419669 108760190 109048975 109299326 109507978 109666288 109795153 109904528
$$ packed form
1603.2A05786848N48589L54624J80829N1951l5381j57798k93839k51126k37357l40903
1623.5A05606437l83520m05205m15778l60024m16100o48916o06393m07279l62968l68429
1643.9A01231825m59242l92985r5868r370L4416K49302L36075L38316L37422L32487
1664.3A01902378K68030J82521J50681J76632K09606K39646K34521K08759J24252k1458
1684.7A03675568k0862K6000M1020O3634N3835P0131R0897O2394N5837n9p2968p5138
1709.2A03970289o0570m5359l8743m7946J5139J03105J38819J73330J98329J84440
1729.6A04590833J32728M5490M9985J22511J68109K53224L58784M34423M77135N02741
1750A07135963M86744M22013L74949L40521K88785K50351K08652J58310J28865J09375
$$ plain form
1770.4 109904528 109995174 110103965 110219991 110308778 110390198 110485768 110567975 110629129 110687160 110717559 110705400
1792.8 110705400 110696208 110702002 110700452 110694671 110696673 110706902 110722303 110737205 110760713 110804164 110855198 110902131
1817.3 110902131 110955060 111012876 111053276 111089563 111145806 111192977 111223221 111261618 111301506 111332035 111359060
1839.8 111359060 111376107 111365175 111360693 111388338 111419344 111436725 111439478 111436439 111429417 111413610 111392438 111374605
1864.2 111374605 111355639 111315262 111261773 111223233 111189318 111147034 111104846 111065352 111030173 111002767 110981977
1886.7 110981977 110962892 110946560 110934472 110926056 110930896 110949373 110968637 110979962 110987997 111001205 111022818 111050630
1911.1 111050630 111077809 111096668 111099625 111102724 111120701 111136866 111147320 111157572 111159146 111148572 111132765 111116076
1935.6 111116076 111090970 111045957 110982752 110920990 110867786 110814238 110763931 110719919 110685098 110665536 110656166 110650408
$$ packed form
1770.4A09904528R0646J08791J16026Q8787Q1420R5570Q2207O1154N8031L0399j2159
1792.8A10705400r192N794j550n781K002J0229J5401J4902K3508M3451N1034M6933
1817.3A10902131N2929N7816M0400L6287N6243M7171L0244L8397L9888L0529K7025
1839.8A11359060J7047j0932m482K7645L1006J7381K753l039p022j5807k1172j7833
1864.2A11374605j8966m0377n3489l8540l3915m2284m2188l9494l5179k7406k0790
1886.7A10981977j9085j6332j2088q416M840J8477J9264J1325Q035J3208K1613K7812
1911.1A11050630K7179J8859K957L099J7977J6165J0454J0252J574j0574j5807j6689
1935.6A11116076k5106m5013o3205o1762n3204n3548n0307m4012l4821j9562r370n758
$$ plain form
1960.1 110650408 110648930 110650408 110649979 110656989 110678911 110699725 110713208 110730588 110749769 110764623 110783076 110804939
1984.6 110804939 110820889 110832584 110845685 110860491 110875797 110893202 110912311 110923111 110921681 110921359 110923421 110918403
2009 110918403 110914218 110912418 110897267 110873020 110854685 110841405 110832918 110824132 110801351 110771585 110747421 110721767 110696006
2035.6 110696006 110677016 110652781 110613441 110562992 110509372 110458195 110405934 110343850 110271883 110194921 110114372
2058 110114372 110028529 109930074 109815657 109695780 109576559 109449625 109310114 109152520 108970404 108758593
2078.4 108758593 108492970 108148038 107711649 107162035 106460631 105554855 104383433 102887487 101021051
2096.8 101021051 98753411 96070170 93003303 89702225 86540061 84125906 83086503 83759910
2113.1 83759910 86046624 89457148 93315548 97015017 100175810 102662468 104513705 105850613
$$ packed form
1960.1A10650408j478J478m29P010K1922K0814J3483J7380J9181J4854J8453K1863
1984.6A10804939J5950J1695J3101J4806J5306J7405J9109J0800j430l22K062n018
2009A10918403m185j800j5151k4247j8335j3280q487q786k2781k9766k4164k5654k5761
2035.6A10696006j8990k4235l9340n0449n3620n1177n2261o2084p1967p6962q0549
2058A10114372q5843r8455j14417j19877j19221j26934j39511j57594j82116k11811
2078.4A08758593k65623l44932m36389n49614p01404r05776j171422j495946j866436
2096.8A01021051k267640k683241l066867l301078l162164k414155j039403O73407
2113.1H3759910K286714L410524L858400L699469L160793K486658J851237J336908
$$ plain form
2129.4 105850613 106805599 107496822 108015013 108415830 108731353 108978820 109163713 109298527 109403908 109488344
2149.8 109488344 109557950 109618556 109667444 109706068 109736824 109760785 109779632 109794343 109809196 109822071 109828126 109831321
2174.3 109831321 109833169 109826636 109812629 109798741 109783232 109767830 109762025 109775770 109808850 109846282 109886634 109939146
2198.7 109939146 109999156 110057974 110110426 110156679 110202372 110245991 110285556 110322976 110357511 110386765 110403275
2221.2 110403275 110405672 110403740 110404122 110404825 110403597 110404170 110410321 110421407 110435557 110451555 110471427 110495937 110512078
2247.7 110512078 110510957 110503745 110503983 110516095 110534561 110550284 110561979 110567558 110571373 110588193 110607100 110616875 110633826
2274.2 110633826 110656512 110669053 110678947 110694027 110701811 110703111 110710609 110720289 110728133 110741878 110759640 110772920 110787582
2300.7 110787582 110802948 110803998 110799491 110809422 110820866 110813355 110806453 110825384 110859263 110894680 110933185 110973871
$$ packed form
2129.4A05850613R54986O91223N18191M00817L15523K47467J84893J34814J05381Q4436
2149.8A09488344O9606O0606M8888L8624L0756K3961J8847J4711J4853J2875O055L195
2174.3A09831321J848o533j4007j3888j5509j5402n805J3745L3080L7432M0352N2512
2198.7A09939146O0010N8818N2452M6253M5693M3619L9565L7420L4535K9254J6510
2221.2A10403275K397j932L82P03j228N73O151J1086J4150J5998J9872K4510J6141
2247.7A10512078j121p212K38J2112J8466J5723J1695N579L815J6820J8907R775J6951
2274.2A10633826K2686J2541R894J5080P784J300P498R680P844J3745J7762J3280J4662
2300.7A10787582J5366J050m507R931J1444p511o902J8931L3879L5417L8505M0686
$$ plain form
2325.2 110973871 111010802 111039698 111053538 111051810 111049294 111041701 111025059 111010718 110978591 110914910 110883367 110934758
2349.7 110934758 111052012 111187136 111295831 111367512 111401737 111385357 111321414 111223781 111103106 110985947
2370.1 110985947 110889697 110810292 110746109 110699582 110669374 110648870 110630405 110612893 110604835 110605276 110601127 110593402
2394.5 110593402 110582316 110563552 110551548 110550272 110543704 110529041 110513961 110503411 110494244 110480511 110466540 110454690
2419 110454690 110447717 110449779 110448837 110435510 110418880 110407472 110400319 110392880 110381675 110372901 110375381 110380173 110374403 110365367
2447.6 110365367 110363030 110360169 110353470 110352302 110357153 110359538 110355401 110345507 110336518 110332763 110332024 110330677 110326111 110321963
2476.1 110321963 110317552 110311985 110311127 110308766 110299671 110291874 110289359 110288215 110282195 110271370 110262179 110256565 110252202 110250735
2504.7 110250735 110248971 110241592 110236728 110231483 110215008 110197043 110187435 110185230 110193419 110209930 110218382 110215771 110215533 110215390
$$ packed form
2325.2A10973871L6931K8896J3840j728k516p593j6642j4341l2127o3681l1543N1391
2349.7A10934758J17254J35124J08695P1681L4225j6380o3943r7633j20675j17159
2370.1A10985947r6250p9405o4183m6527l0208k0504j8465j7512q058M41m149p725
2394.5A10593402j1086j8764j2004j276o568j4663j5080j0550r167j3733j3971j1850
2419A10454690o973K062r42j3327j6630j1408p153p439j1205q774K480M792n770r036
2447.6A10365367k337k861o699j168M851K385m137r894q989l755p39j347m566m148
2476.1A10321963m411n567q58k361r095p797k515j144o020j0825r191n614m363j467
2504.7A10250735j764p379m864n245j6475j7965r608k205Q189J6511Q452k611k38j43
$$ plain form
2533.2 110215390 110210466 110209167 110209727 110203779 110199475 110205102 110212481 110216796 110217774 110212922 110211432 110214520 110209191 110200012 110196221
2563.8 110196221 110193181 110184503 110169446 110152686 110135460 110115898 110100472 110093331 110086536 110075331 110061574 110043776
2588.3 110043776 110023165 110003233 109979594 109954977 109935617 109922278 109920812 109926295 109927177 109925234 109922051 109911668 109893250
2614.8 109893250 109876609 109867597 109859002 109847224 109835315 109827518 109829867 109838581 109841299 109830821 109816658 109815633 109826267
2641.3 109826267 109831595 109825432 109816122 109811091 109809566 109812939 109822702 109828031 109827554 109829307 109832394 109833241 109830296 109824896 109820294
2671.9 109820294 109814858 109798956 109780037 109779286 109798419 109819174 109823000 109812391 109801936 109796000 109792817 109785056 109765399
2698.4 109765399 109753680 109760988 109763145 109747922 109717727 109684181 109660971 109646583 109639347 109630084 109606826 109579468
2722.9 109579468 109557939 109549570 109562528 109579194 109575057 109551728 109533465 109530687 109529829 109517217 109482753 109437203
$$ packed form
2533.2A10215390m924j299N60n948m304N627P379M315R78m852j490L088n329r179l791
2563.8A10196221l040q678j5057j6760j7226j9562j5426p141o795j1205j3757j7798
2588.3A10043776k0611j9932k3639k4617j9360j3339j466N483Q82j943l183j0383j8418
2614.8A09893250j6641r012q595j1778j1909p797K349Q714K718j0478j4163j025J0634
2641.3A09826267N328o163r310n031j525L373R763N329m77J753L087Q47k945n400m602
2671.9A09820294n436j5902j8919p51J9133K0755L826j0609j0455n936l183p761j9657
2698.4A09765399j1719P308K157j5223l0195l3546k3210j4388p236r263k3258k7358
2722.9A09579468k1529q369J2958J6666m137k3329j8263k778q58j2612l4464m5550
$$ plain form
2747.4 109437203 109411490 109416676 109428084 109424901 109407473 109377873 109349692 109333313 109317958 109295535 109270966 109238446
2771.8 109238446 109196413 109172976 109173524 109167874 109142816 109101760 109036756 108956921 108903062 108875072 108836746 108779740
2796.3 108779740 108724093 108692420 108671737 108637261 108580995 108502245 108428419 108378267 108328569 108264184 108190346
2818.8 108190346 108109951 108029318 107953155 107869482 107767260 107649457 107523167 107383621 107221258 107075810
2839.1 107075810 106975627 106861758 106693876 106503630 106340265 106212330 106083703 105941534 105797040 105667782
2859.5 105667782 105568314 105481029 105394244 105327392 105268121 105195200 105168390 105235410 105342948 105441332 105534303
2882 105534303 105637956 105755091 105861437 105945003 106004477 106030285 106054366 106101692 106116199 106061304 105985630
2904.4 105985630 105916500 105816090 105663526 105495644 105363739 105282056 105232835 105189860 105127192 105047190 104959416
$$ packed form
2747.4A09437203k5713N186J1408l183j7428k9600k8181j6379j5355k2423k4569l2520
2771.8A09238446m2033k3437N48n650k5058m1056o5004p9835n3859k7990l8326n7006
2796.3A08779740n5647l1673k0683l4476n6266p8750p3826n0152m9698o4385p3838
2818.8A08190346q0395q0633p6163q3673j02222j17803j26290j39546j62363j45448
2839.1A07075810j00183j13869j67882j90246j63365j27935j28627j42169j44494j29258
2859.5A05667782r9468q7285q6785o6852n9271p2921k6810O7020J07538R8384R2971
2882A05534303J03653J17135J06346Q3566N9474K5808K4081M7326J4507n4895p5674
2904.4A05985630o9130j00410j52564j67882j31905q1683m9221m2975o2668q0002q7774
$$ plain form
2926.8 104959416 104887819 104888821 104950547 105016088 105092359 105197096 105291700 105356300 105436397 105555308 105678689
2949.3 105678689 105774581 105865574 105969739 106050146 106090689 106112206 106135499 106166446 106197762 106226838 106243539
2971.7 106243539 106260157 106314683 106385839 106453478 106570017 106729436 106853271 106908524 106900156 106870353 106865156
2994.2 106865156 106848216 106808496 106793225 106796956 106807387 106817508 106779230 106672955 106538582 106397140 106211984
3016.6 106211984 105937946 105572402 105162787 104813504 104619992 104574513 104626501 104747820 104936242 105168903
3037 105168903 105349529 105430472 105474246 105514932 105480397 105295658 105000246 104686916 104409480 104206812 104108500
3059.4 104108500 104123306 104249084 104462242 104741120 105044830 105288649 105404234 105372036 105240119 105122936
3079.8 105122936 105117083 105239701 105446947 105662775 105853033 106036365 106180406 106236601 106226516 106207550
$$ packed form
2926.8A04959416p1597J002O1726O5541P6271J04737R4604O4600Q0097J18911J23381
2949.3A05678689R5892R0993J04165Q0407M0543K1517K3293L0947L1316K9076J6701
2971.7A06243539J6618N4526P1156O7639J16539J59419J23835N5253q368k9803n197
2994.2A06865156j6940l9720j5271L731J0431J0121l8278j06275j34373j41442j85156
3016.6A06211984k74038l65544m09615l49283j93512m5479N1988J21319J88422K32661
3037A05168903J80626Q0943M3774M0686l4535j84739k95412l13330k77436k02668r8312
3059.4A04108500J4806J25778K13158K78878L03710K43819J15585l2198j31917j17183
3079.8A05122936n853J22618K07246K15828J90258J83332J44041N6195j0085j8966
$$ plain form
3100.2 106207550 106212771 106228292 106228828 106234777 106287920 106336665 106301653 106232798 106203675 106224251 106280029 106317365
3124.7 106317365 106290317 106228864 106187963 106159186 106097734 105995309 105898821 105860889 105851078 105805576 105730021
3147.1 105730021 105635750 105521309 105455291 105468452 105478919 105441642 105380106 105308795 105231678 105154777 105085111
3169.6 105085111 105021119 104963350 104909682 104831469 104730952 104645777 104580140 104515100 104437077 104355085 104290581
3192 104290581 104240930 104181814 104101002 104013133 103930855 103853142 103783917 103722119 103648710 103559232 103480446 103412318
3216.5 103412318 103327119 103244412 103185785 103117180 103021765 102921021 102809739 102692270 102625251 102608728 102579820
3238.9 102579820 102518046 102424204 102298844 102185941 102124393 102075016 101988208 101895654 101844394 101803696 101740468
3261.3 101740468 101675701 101605797 101492369 101346469 101247537 101221430 101205289 101173842 101141918 101097226 101030397
$$ packed form
3100.2A06207550N221J5521N36N949N3143M8745l5012o8855k9123K0576N5778L7336
3124.7A06317365k7048o1453m0901k8777o1452j02425r6488l7932r811m5502p5555
3147.1A05730021r4271j14441o6018J3161J0467l7277o1536p1311p7117p6901o9666
3169.6A05085111o3992n7769n3668p8213j00517q5175o5637o5040p8023q1992o4504
3192A04290581m9651n9116q0812q7869q2278p7713o9225o1798p3409q9478p8786o8128
3216.5A03412318q5199q2707n8627o8605r5415j00744j11282j17469o7019j6523k8908
3238.9A02579820o1774r3842j25360j12903o1548m9377q6808r2554n1260m0698o3228
3261.3A01740468o4767o9904j13428j45900r8932k6107j6141l1447l1924m4692o6829
$$ plain form
3283.8 101030397 100960565 100892544 100796783 100684619 100609756 100574827 100557029 100539303 100472331 100339603 100215662
3306.2 100215662 100173378 100207651 100252700 100251818 100219584 100186968 100147986 100099683 100050652 100019169 100019515 100028908
3330.7 100028908 100018501 99973786 99913466 99889630 99900758 99919689 99950510 99951309 99885720 99850154 99923557 100015152
3355.2 100015152 100029325 99997419 99988884 100005794 99991786 99945635 99942058 100009322 100082552 100112724 100131357 100170040
3379.6 100170040 100219476 100265455 100298357 100315976 100312030 100310063 100362194 100440156 100471699 100482833 100558960 100691020
3404.1 100691020 100791335 100838697 100892472 100991333 101115310 101232767 101331115 101428699 101544154 101645124
3424.5 101645124 101704109 101753032 101834428 101939106 102036178 102164721 102351069 102529550 102669811 102791536
3444.9 102791536 102905965 103032196 103165364 103286076 103397346 103492320 103576028 103686261 103799796 103860009
$$ packed form
3283.8A01030397o9832o8021r5761j12164p4863l4929j7798j7726o6972j32728j23941
3306.2A00215662m2284L4273M5049q82l2234l2616l8982m8303m9031l1483L46R393
3330.7A00028908j0407m4715o0320k3836J1128J8931L0821P99o5589l5566P3403R1595
3355.2A00015152J4173l1906q535J6910j4008m6151l577O7264P3230L0172J8633L8683
3379.6A00170040M9436M5979L2902J7619l946j967N2131P7962L1543J1134P6127J32060
3404.1A00691020J00315M7362N3775R8861J23977J17457R8348R7584J15455J00970
3424.5A01645124N8985M8923Q1396J04678R7072J28543J86348J78481J40261J21725
3444.9A02791536J14429J26231J33168J20712J11270R4974Q3708J10233J13535O0213
$$ plain form
3465.3 103860009 103908265 104035032 104232383 104414523 104547024 104642558 104741240 104883218 105024087 105134809
3485.7 105134809 105261993 105406690 105522060 105609405 105711627 105848897 105993426 106108749 106220973 106364644
3506.1 106364644 106521547 106655979 106753314 106852758 106975138 107085741 107165945 107240117 107347703 107484996
3526.5 107484996 107609653 107725394 107840049 107917202 107979667 108072853 108151746 108184028 108226120 108339107 108488810
3548.9 108488810 108608031 108710074 108804142 108865917 108903956 108946550 109021413 109097290 109135675 109193790 109299576
3571.3 109299576 109402430 109481525 109559262 109627438 109672928 109714401 109775591 109885395 110026896 110148191 110250199
3593.8 110250199 110339856 110410881 110495055 110613751 110732329 110834384 110937524 111030722 111094570 111151397 111212111
3616.2 111212111 111233616 111235976 111305439 111424577 111514211 111516559 111500907 111529529 111548769 111555982 111574221 111605263
$$ packed form
3465.3A03860009M8256J26767J97351J82140J32501R5534R8682J41978J40869J10722
3485.7A05134809J27184J44697J15370Q7345J02222J37270J44529J15323J12224J43671
3506.1A06364644J56903J34432R7335R9444J22380J10603Q0204P4172J07586J37293
3526.5A07484996J24657J15741J14655P7153O2465R3186P8893L2282M2092J12987J49703
3548.9A08488810J19221J02043R4068O1775L8039M2594P4863P5877L8385N8115J05786
3571.3A09299576J02854P9095P7737O8176M5490M1473O1190J09804J41501J21295J02008
3593.8A10250199Q9657P1025Q4174J18696J18578J02055J03140R3198O3848N6827O0714
3616.2A11212111K1505K360O9463J19138Q9634K348j5652K8622J9240P213J8239L1042
$$ plain form
3640.7 111605263 111652541 111711359 111733854 111659777 111596584 111650038 111709440 111699998 111700106 111760736 111852980 111946094
3665.2 111946094 112016666 112056196 112111390 112173045 112162292 112137532 112172449 112227905 112273991 112285662 112242019
3687.6 112242019 112207937 112247634 112294304 112319148 112343466 112357736 112347651 112351179 112387192 112421799 112407351 112346768
3712.1 112346768 112335479 112386751 112436485 112456298 112464380 112468910 112474978 112500918 112526155 112506354 112419891 112329757
3736.5 112329757 112352908 112474585 112568402 112570798 112580431 112600219 112540853 112458467 112442172 112456846 112452865 112448215
3761 112448215 112465870 112476063 112460995 112419856 112390041 112410855 112435889 112409878 112369215 112379932 112408388 112422311
3785.5 112422311 112431157 112431872 112441909 112457907 112460017 112483978 112498307 112446702 112433124 112454927 112441885 112446690
3810 112446690 112475359 112474537 112448967 112442005 112410617 112366343 112376189 112401533 112422514 112433612 112426519 112417960 112403619
$$ packed form
3640.7A11605263M7278N8818K2495p4077o3193N3454N9402r442J08O0630R2244R3114
3665.2A11946094P0572L9530N5194O1655j0753k4760L4917N5456M6086J1671m3643
3687.6A12242019l4082L9697M6670K4844K4318J4270j0085L528L6013L4607j4448o0583
3712.1A12346768j1289N1272M9734J9813Q082M530O068K5940K5237j9801q6463r0134
3736.5A12329757K3151J21677R3817K396R633J9788n9366q2386j6295J4674l981m650
3761A12448215J7655J0193j5068m1139k9815K0814K5034k6011m0663J0717K8456J3923
3785.5A12422311Q846P15J0037J5998K110K3961J4329n1605j3578K1803j3042M805
3810A12446690K8669q22k5570o962l1388m4274R846K5344K0981J1098p093q559j4341
$$ plain form
3836.5 112403619 112373471 112356043 112361205 112369430 112402081 112484324 112560451 112496936 112341642 112307608 112350774 112395573
3861 112395573 112419975 112434173 112449956 112440670 112404597 112370634 112363565 112397349 112417638 112395048 112354827 112301803
3885.4 112301803 112288582 112310326 112310660 112320900 112354374 112373328 112370181 112351370 112314856 112292337 112298167 112310743
3909.9 112310743 112334132 112350821 112331450 112309134 112318289 112324846 112307620 112315631 112347150 112343085 112313104 112307775
3934.4 112307775 112330115 112352550 112355089 112335682 112319577 112314379 112304747 112301111 112309372 112311041 112297440 112285447 112296367
3960.9 112296367 112321544 112329209 112322605 112322330 112315321 112289691 112269485 112287092 112310719 112285352 112249768 112268209
3985.4 112268209 112311602 112327516 112316155 112289286 112261724 112249458
3997.6 112249458
$$ packed form
3836.5A12403619l0148j7428N162Q225L2651Q2243P6127o3515j55294l4034M3166M4799
3861A12395573K4402J4198J5783r286l6073l3963p069L3784K0289k2590m0221n3024
3885.4A12301803j3221K1744L34J0240L3474J8954l147j8811l6514k2519N830J2576
3909.9A12310743K3389J6689j9371k2316R155O557j7226Q011L1519m065k9981n329
3934.4A12307775K2340K2435K539j9407j6105n198r632l636Q261J669j3601j1993J0920
3960.9A12296367K5177P665o604k75p009k5630k0206J7607K3627k5367l5584J8441
3985.4A12268209M3393J5914j1361k6869k7562j2266
3997.6A12249458
##END=$$ End of the data block
