##TITLE=N3Ac-2 $$ Begin of the data block
##JCAMP-DX=5.00 $$ ACD/SpecManager v 10.08
##SPECTROMETER/DATA SYSTEM=Alpha
##DATE=16 May 2016 10:57:36
##DATA TYPE=INFRARED SPECTRUM
##DATA CLASS=XYDATA
##ORIGIN=
##OWNER=
##NPOINTS=1667
##FIRSTX=599.64648438
##LASTX=3997.64306641
##MAXX=3997.64306641
##MINX=599.64648438
##MAXY=1.11464274
##MINY=0.10748878
##XFACTOR=1.0000000000
##YFACTOR=0.000000010000000
##FIRSTY=0.88234884
##DELTAX=2.03961372
##XUNITS=1/CM
##YUNITS=ARBITRARY UNITS
##XYDATA=(X++(Y..Y))
599.6H8234884k712459k017134n51576J005274K064884K434814K077383J243257M86041
618I2265368K17425K33305J13791k6292O0702K50149K98088J51205q0245k82520l81905
640.4I2819071l17729j65492j31762k12246k56622k44689k63655l22080l62420l99482
660.8I0142894m63230n52368r24438j285440p09259k77800j17075L9887J467m54426
681.2H5400212j413119k758783m114890m810381m575163m453028n729061p471943o963843
699.6D3110001l175577K060127O495640Q880853Q879322P208228N204040L797030L011662
717.9H5471326K462083J858652J228255P34430M40884L20476K69819J76817l6699m25791
738.3I2500252j063318j924335k627475k725863k444750k563852l292865l849560l459537
$$ plain form
599.6 88234884 85522425 83505291 82953715 83958989 86023873 88458687 90536070 91779327 92265368
618 92265368 92482793 92716098 92829889 92803597 92864299 93114448 93412536 93563741 93483496 93200976 92819071
640.4 92819071 92501342 92335850 92204088 91991842 91735220 91490531 91226876 90904796 90542376 90142894
660.8 90142894 89679664 89127296 88202858 86917418 86208159 85930359 85813284 85853171 85854638 85400212
681.2 85400212 83987093 81228310 77113420 72303039 67727876 63274848 57545787 50073844 43110001
699.6 43110001 39934424 41994551 48490191 57371044 66250366 73458594 78662634 82459664 85471326
717.9 85471326 87933409 89792061 91020316 91754746 92195630 92516106 92785925 92962742 92926043 92500252
738.3 92500252 91436934 89512599 86885124 84159261 81714511 79150659 75857794 72008234 68548697
756.7F8548697k370167j324629m92871M52775J657009K958870M057794M641778M544341
775.1H2673597L891278L026610K229548J569402J067680P32958M94212L01880J66100
793.4I6153265O6501l7682j29831j69533j77813k09176k63662l07559l42101l88730
813.8I4193679m27109m02790l01939j75995p7689j3065M536o9839k28590m34351o71482
836.2I1395366r10377j079089j068330q38834m45389J3464M14658O71834P53104O78707
856.6H9585114N17743L57318K63024K42054K59471K66093K45798K27099K27571K35826
877I2427111K21538J69283R4140O157r2345k09797l65102n56642p61920r47219j117128
899.5H8868076j280046j297247r43011k01708N46115Q74198P68453M32056L779l50553
$$ plain form
756.7 68548697 66178530 64853901 64361030 64813805 66470814 69429684 73487478 78129256 82673597
775.1 82673597 86564875 89591485 91821033 93390435 94458115 95191073 95685285 95987165 96153265
793.4 96153265 96219766 96182084 96052253 95882720 95704907 95495731 95232069 94924510 94582409 94193679
813.8 94193679 93766570 93363780 93061841 92885846 92808157 92795092 92799628 92729789 92501199 92066848 91395366
836.2 91395366 90484989 89405900 88337570 87498736 87053347 87066811 87481469 88153303 88906407 89585114
856.6 89585114 90102857 90460175 90723199 90965253 91224724 91490817 91736615 91963714 92191285 92427111
877 92427111 92648649 92817932 92912072 92918229 92825884 92616087 92250985 91694343 90932423 89985204 88868076
899.5 88868076 87588030 86290783 85347772 85146064 85692179 86566377 87334830 87766886 87770665 87420112
919.9H7420112m40347k04921K11370N59807O75887N50663K73228o6263m26835q17757
940.3H7734944j249081j694167k116609k437228k528816k305335j734042q48573J26242
958.6G2947335Q19183J025569Q96740P52479P74854R15027J023745J012612Q82178
977H1049722O72359M23157J46389j60110m49544o57690p81256q58092r92853j327073
997.4G7065009j531875q86137J58453K69795n50896j430863k137804k808327l462374
1015.7F4684981m024750m374939m339349l753552k606222j176661N2320P98321J223514
1034.1D6483663J571291J808721J857189J805293J805782J952190K232957K494251
1050.4F2011337K528334K260417J766026J197326P44909N53846O00666O78086N95791
$$ plain form
919.9 87420112 86979765 86774844 86986214 87546021 88221908 88772571 89045799 88979536 88552701 87734944
940.3 87734944 86485863 84791696 82675087 80237859 77709043 75403708 73669666 72821093 72947335
958.6 72947335 73766518 74792087 75688827 76441306 77216160 78131187 79154932 80167544 81049722
977 81049722 81722081 82145238 82291627 82131517 81681973 81024283 80243027 79384935 78392082 77065009
997.4 77065009 75533134 74646997 74805450 75075245 74524349 73093486 70955682 68147355 64684981
1015.7 64684981 60660231 56285292 51945943 48192391 45586169 44409508 44461828 45260149 46483663
1034.1 46483663 48054954 49863675 51720864 53526157 55331939 57284129 59517086 62011337
1050.4 62011337 64539671 66800088 68566114 69763440 70508349 71062195 71662861 72340947 72936738
1068.8G2936738M12774L01671L02815M41414P96545J266384J545346J432502J001406
1087.1H0437595M84150P9888j53452k44903j92964k939K10315L09235K82180K29609
1107.5H1438714K33174K79760L09503K86150K35003K21551L05903N24252Q19129J040983
1127.9H5694122J092059R91243P97307N45848K73281J6588k02411l60263m58228n41771
1148.3H7847775o87271r49782j215565j177526o68198p444L33136L13634J28793k26712
1168.7H3690840q25697j521802j990938j973814j454300o37895J56707N67514M01967
1187.1G6412582j86103q62694j392841j740569k002084k293689k660274l062677l506595
1205.4E8705056m127217m975193n821419o306458o222751n617169m678507l626698
$$ plain form
1068.8 72936738 73349512 73651183 73953998 74395412 75191957 76458341 78003687 79436189 80437595
1087.1 80437595 80921745 81001633 80848181 80603278 80410314 80407375 80617690 80926925 81209105 81438714
1107.5 81438714 81671888 81951648 82261151 82547301 82782304 83003855 83309758 83834010 84653139 85694122
1127.9 85694122 86786181 87777424 88574731 89120579 89393860 89410448 89208037 88847774 88389546 87847775
1148.3 87847775 87160504 86210722 84995157 83817631 83149433 83141989 83475125 83788759 83917552 83690840
1168.7 83690840 82865143 81343341 79352403 77378589 75924289 75286394 75443101 76010615 76412582
1187.1 76412582 76226479 75363785 73970944 72230375 70228291 67934602 65274328 62211651 58705056
1205.4 58705056 54577839 49602646 43781227 37474769 31252018 25634849 20956342 17329644
1221.7A7329644k643147j805686j118991n54415n9178M11629Q47703J211865J486819
1240.1A5106243J679557J819315J923434K001058K031981J973929J813295J592577
1256.4B9941389J406166J360956J502812J777339K064278K241683K285475K223644
1272.7D4803742K088382J920209J722458J526069J489807J756370K224505K607566
1289F0139108K671396K380813J826840J108867L29286l88652q96019j008326o40994
1307.4F5522319J6534N56732O18392J23036n62364p76541j62816Q85284J757586K198898
1327.8G0177060K295179K176177J920646J628221J392412J196009Q85051M24075r7644
1346.2H1997186o43641j246440k010793l087294m419774n476594n625498m373032j882881
$$ plain form
1221.7 17329644 14686497 12880811 11761820 11207405 11148227 11559856 12407559 13619424 15106243
1240.1 15106243 16785800 18605115 20528549 22529607 24561588 26535517 28348812 29941389
1256.4 29941389 31347555 32708511 34211323 35988662 38052940 40294623 42580098 44803742
1272.7 44803742 46892124 48812333 50534791 52060860 53550667 55307037 57531542 60139108
1289 60139108 62810504 65191317 67018157 68127024 68456310 68067658 67171639 66163313 65522319
1307.4 65522319 65538853 66095585 66713977 66837013 66274649 65498108 65335292 66220576 67978162 70177060
1327.8 70177060 72472239 74648416 76569062 78197283 79589695 80785704 81670755 82094830 81997186
1346.2 81997186 81353545 80107105 78096312 75009018 70589244 65112650 59487152 55114120 53231239
1364.5E3231239J05352O80160J80763r33456j934183j836130n77799J325810L162200
1382.9E3403956M238683M690414M339314L295719K577883K274752J919371J549196
1399.2G8289288J218868Q94093O92248N08196K58541L4010j22225k85238n36972o96999
1419.6H0253810o03789o52850p83283q35228r32925q88575q76820j343161j917332
1437.9G1419847k548784l917974m528737k764416M51124K918094L497219L113866L191507
1456.3G0831746L649449K811694K004463J885646J955909J685864J297527J055175
1472.6H7177473Q13622M42886Q1050l02767q63910j854181l474796m833544l500086
1491G3685747k19696K106022L490419L522861K394050J222640K97296j34086J70153
$$ plain form
1364.5 53231239 53336591 54016751 54197514 53264058 51329875 49493745 48915946 50241756 53403956
1382.9 53403956 57642639 62333053 66672367 69968086 72545969 74820721 76740092 78289288
1399.2 78289288 79508156 80402249 81094497 81602693 81861234 81895244 81773019 81487781 80950809 80253810
1419.6 80253810 79650021 78997171 78213888 77378660 76445735 75557160 74680340 73337179 71419847
1437.9 71419847 68871063 64953089 60424352 57659936 58111060 61029154 64526373 67640239 70831746
1456.3 70831746 74481195 77292889 79297352 81182998 83138907 84824771 86122298 87177473
1472.6 87177473 87991095 88433981 88515031 88212264 87348354 85494173 82019377 77185833 73685747
1491 73685747 73466051 75572073 79062492 82585353 84979403 86202043 86499339 86365253 86535406
1509.3H6535406K12884n454j86693j76627p0542j770K16198L38995L83932M05287L02840
1531.8H7954456L09568L61818J14841r9886L03507O63680O56557N08380M19271M10700
1552.2I1602892L39502J43462L1853N82784P36916L64030L075l88038p29996r83488
1572.6I1702992j460284j314736J41275J011056J115346R28527N08499r7954q68589
1590.9I1666132j783275k493686k153933o45113R09281J584214J408934R00722L84033
1609.3H9777309N960l02863p37011j022721p77393q54063j254475j310528j314384
1627.6H2209831j317316j202816j518529k240485j896262j276058j282871j443780
1643.9G0031714j843923j632804p14266n32764j24413R02629J134843J061541R67991
$$ plain form
1509.3 86535406 86748290 86742836 86556143 86379516 86308974 86307204 86523402 86862397 87246329 87651616 87954456
1531.8 87954456 88264024 88625842 88740683 88640797 88944304 89607984 90264541 90772921 91192192 91602892
1552.2 91602892 91942394 92085856 92117709 92700493 93437409 93801439 93804514 93416476 92686480 91702992
1572.6 91702992 90242708 88927972 89069247 90080303 91195649 92124176 92632675 92534721 91666132
1590.9 91666132 89882857 87389171 85235238 84590125 85499406 87083620 88492554 89393276 89777309
1609.3 89777309 89783269 89480406 88743395 87720674 86943281 86089218 84834743 83524215 82209831
1627.6 82209831 80892515 79689699 78171170 75930685 74034423 72758365 71475494 70031714
1643.9 70031714 68187791 66554987 65840721 65307957 65183544 66086173 67221016 68282557 69250548
1662.3F9250548Q19600M24391j54645m46796k30807K4253L93337P09510O62488L21668
1682.7G1773547j7285o9571l13866o41233p94738j221282j471662j497746j813674
1701.1F3932490j605743j904839k515519k453929k266777k122253k200722k744943
1717.4D6117765k719936k346900k658355l067169l261697l579489l850235m719130
1733.7A9914854m280623k441655j633716q09982L69692J548138K992203N090570O912078
1752B7661559P339421P944289Q361605P645690P092327N762035M278057L518916K916717
1770.4H2520616K649504K359992J817602J438272J281941J175505J072967R35811P23791
1788.8I5976001M97448M73804N19639M41474L27247K88594L27706K94179K23941J74081
$$ plain form
1662.3 69250548 70070148 70494539 70339894 69893098 69662291 69686544 70079881 70789391 71451879 71773547
1682.7 71773547 71756262 71686691 71372825 70731592 69936854 68715572 67243910 65746164 63932490
1701.1 63932490 62326747 60421908 57906389 55452460 53185683 51063430 48862708 46117765
1717.4 46117765 43397829 41050929 38392574 35325405 32063708 28484219 24633984 19914854
1733.7 19914854 15634231 13192576 11558860 10748878 11118570 12666708 15658911 20749481 27661559
1752 27661559 35000980 42945269 51306874 58952564 66044891 71806926 76084983 79603899 82520616
1770.4 82520616 85170120 87530112 89347714 90785986 92067927 93243432 94316399 95252210 95976001
1788.8 95976001 96473449 96947253 97466892 97908366 98235613 98524207 98851913 99146092 99370033 99544114
1809.2I9544114K38603L38423L60668L46875L59166L31163K55728K60163K68805K78377
1829.6A02582085L67713L71075K58612K04754J71292O7794K6167J85227K89727K35044
1850A04759490J64056J09864Q9800P5459P1300N5766o92r0885q7762P0310J28639M2367
1874.4A05387712m5991q3983j06442j16182j25217j44172j45244o1584J2469J3054
1894.8A04584420M9972Q3232P5972O4659O2764N5027P7951J32382J40619Q4245M2034
1917.3A05453277Q1563J03581J06835J33157J11818O1238M0638L3295K7144R740n4598
1939.7A06107688j13893q9323o6602j15455j55580j68490j60098j24288q8203o1929
1960.1A04963827l0088j3089j0109L7980Q7905Q5091P3743Q1706Q3387P7224Q1062
$$ plain form
1809.2 99544114 99782717 100121140 100481808 100828683 101187849 101519012 101774740 102034903 102303708 102582085
1829.6 102582085 102949798 103320873 103579485 103784239 103955531 104023325 104049492 104234719 104524446 104759490
1850 104759490 104923546 105033410 105123210 105198669 105269969 105325735 105325043 105234158 105146396 105216706 105345345 105387712
1874.4 105387712 105341721 105257738 105151296 105035114 104909897 104765725 104620481 104558897 104571366 104584420
1894.8 104584420 104634392 104717624 104793596 104858255 104921019 104976046 105053997 105186379 105326998 105411243 105453277
1917.3 105453277 105534840 105638421 105745256 105878413 105990231 106051469 106092107 106125402 106152546 106162286 106107688
1939.7 106107688 105993795 105904472 105837870 105722415 105566835 105398345 105238247 105113959 105025756 104963827
1960.1 104963827 104933739 104920650 104910541 104948521 105036426 105121517 105195260 105276966 105360353 105437577 105518639
1982.5A05518639P7140O3062N4050N5265Q8763J26636J12927Q2076O0403L5286J5819
2005A06290066k897k5224l5131l8207n3286n5731l8874m4226o3098p0941q9705j17827
2029.4A05654919j27017j25671j17278j06943j22499j46341j69325k17354k79511l39472
2049.8A03903508l91757m21894m34101m50027m82165n29039n84924o38223o85764p42292
2070.2I8543322q00657q57079r30071j039797j204449j440239j768518k191454k709585
2088.6H5601473l331322m068118m923922n826336o647164p266885p595434p577390
2104.9C8364902p108170o044191m389393k343944j09182K257852M755953P183713R034812
2123.3D1602352R810546R408248Q186322O678540N273461M129034L240192K551598
$$ plain form
1982.5 105518639 105595779 105658841 105712891 105768156 105856919 105983555 106096482 106178558 106238961 106274247 106290066
2005 106290066 106287169 106261945 106226814 106188607 106135321 106079590 106040716 105996490 105933392 105862451 105772746 105654919
2029.4 105654919 105527902 105402231 105284953 105178010 105055511 104909170 104739845 104522491 104242980 103903508
2049.8 103903508 103511751 103089857 102655756 102205729 101723564 101194525 100609601 99971378 99285614 98543322
2070.2 98543322 97742665 96885586 95955515 94915718 93711269 92271030 90502512 88311058 85601473
2088.6 85601473 82270151 78202033 73278111 67451775 60804611 53537726 45942292 38364902
2104.9 38364902 31256732 25212541 20823148 18479204 18370022 20627874 25383827 32567540 41602352
2123.3 41602352 51412898 60821146 69007468 75686008 80959469 85088503 88328695 90880293
2139.6I0880293K023273J624716J316428J072442Q85982P37655O11889M98951L94863
2157.9A00046492K99060K20013J58965R8753L8421j5700o3610r9289j09243r8467p2277
2180.4A00403118l1292J6260O1011R3877J20652J50466J82498K13301K37644K48384
2200.8A01695919K49982K47526K45273K49875K65932K89714K90036K53427K05422J55508
2221.2A04148614R8622M8483K9921N4431R6405J18172J06549P5770N8496O4182Q2576
2243.6A04982221J04177J07646R1231P5734O6518O5887P6569Q3446P5221O4564O6233
2266A05859447P7676Q4961Q3029Q0872P7962P2730P4482P8797P6044P1084P0584P3195
2290.5A06780863P5722P9739Q3303Q2409Q0979O5709K5236p629j3137k1649n0282o6769
$$ plain form
2139.6 90880293 92903566 94528282 95844710 96917152 97803134 98540789 99152678 99651629 100046492
2157.9 100046492 100345552 100565565 100724530 100823283 100861704 100846004 100782394 100683105 100573862 100475395 100403118
2180.4 100403118 100371826 100388086 100449097 100542974 100663626 100814092 100996590 101209891 101447535 101695919
2200.8 101695919 101945901 102193427 102438700 102688575 102954507 103244221 103534257 103787684 103993106 104148614
2221.2 104148614 104247236 104295719 104325640 104380071 104476476 104594648 104701197 104776967 104835463 104899645 104982221
2243.6 104982221 105086398 105194044 105285275 105361009 105427527 105493414 105569983 105653429 105728650 105793214 105859447
2266 105859447 105937123 106022084 106105113 106185985 106263947 106336677 106411159 106489956 106566000 106637084 106707668 106780863
2290.5 106780863 106856585 106936324 107019627 107102036 107183015 107248724 107273960 107266331 107253194 107231545 107181263 107114494
2315A07114494m8554k7943j7893J6844N3787M4167J7214q559m2105o4826p8869p6687
2339.5A06881070m5585k6620J5438J15835J57869J26708R3424P0953N8735M5562j3209
2361.9A07480180n4323l7969k3901j3995M983J2588J5378K8682M8804N7042L9697Q118
2386.4A07565284j0979j4675k0552l2997m6134n2345n1057n4026n6123m1140k8598
2408.8A07156658l2306l7741l9089l8516l8922l9602m2760n4872p1692q2934q8716
2431.2A06589508r0921r0861r0790q8704q0096o3908m7946l0363l040K1446K7251K4450
2455.7A06076026K7847L1984K3162J1123O938j705r596j1564j3053j1253r537l946
2480.2A06116426O199N090k479K300J5474K4259K1350J1015J4675K6607K1887J2672
$$ plain form
2315 107114494 107065940 107037997 107020104 107036948 107090735 107134902 107152116 107143557 107101452 107036626 106957757 106881070
2339.5 106881070 106835485 106808865 106824303 106940138 107098007 107224715 107318139 107389092 107447827 107493389 107480180
2361.9 107480180 107425857 107387888 107363987 107349992 107354975 107367563 107382941 107411623 107460427 107517469 107557166 107565284
2386.4 107565284 107554305 107539630 107519078 107486081 107439947 107387602 107336545 107282519 107226396 107185256 107156658
2408.8 107156658 107124352 107086611 107047522 107009006 106970084 106930482 106887722 106832850 106761158 106678224 106589508
2431.2 106589508 106498587 106407726 106316936 106228232 106148136 106084228 106036282 106005919 106002879 106024325 106051576 106076026
2455.7 106076026 106103873 106135857 106159019 106170142 106177080 106175375 106165779 106154215 106141162 106129909 106120372 106116426
2480.2 106116426 106122625 106127715 106125236 106127536 106143010 106167269 106188619 106199634 106214309 106240916 106262803 106275475
2504.7A06275475J1420Q297M399j800j0955j2327r572l529J2958K3258J7977J0466
2529.1A06326067Q965N400l755p760q476j6678k3532k0229j7727j4353j2898k1183
2553.6A06193841k4367k1744k6416l2175l0303k7716l2056m2033m6754m5287m4692
2576A05820298m1270l9756m3404m2558m2844m8327m8495m9412n4896m2343q953K1148
2600.5A05379188L4916L7599L8016L7777L1817K0147P724k098j0097j7011j9181j5092
2625A05523705N007L4356M4394L7980L7837N1999O7878O6602N0509L4773K6286K5332
2649.5A06006658K6977L3271L9280K7072J0646P784J0169P093k444j4949j6785o389
2673.9A06128383j3125k4200n805K2912K6619P367j0121j3935n341L577j669j5199
$$ plain form
2504.7 106275475 106286895 106295192 106299591 106297791 106286836 106274509 106264937 106261408 106274366 106297624 106315601 106326067
2529.1 106326067 106335032 106340432 106336677 106328917 106320441 106303763 106280231 106260002 106242275 106227922 106215024 106193841
2553.6 106193841 106169474 106147730 106121314 106089139 106058836 106031120 105999064 105957031 105910277 105864990 105820298
2576 105820298 105779028 105739272 105695868 105653310 105610466 105562139 105513644 105464232 105409336 105366993 105358040 105379188
2600.5 105379188 105414104 105451703 105489719 105527496 105559313 105579460 105587184 105585086 105574989 105557978 105538797 105523705
2625 105523705 105528712 105563068 105607462 105645442 105683279 105735278 105803156 105869758 105920267 105955040 105981326 106006658
2649.5 106006658 106033635 106066906 106106186 106133258 106143904 106151688 106161857 106168950 106166506 106151557 106134772 106128383
2673.9 106128383 106115258 106091058 106085253 106108165 106134784 106142151 106132030 106118095 106112754 106116331 106114662 106099463
2698.4A06099463j2458j705p772k2018l5000m0674l4714k3067r691j6582m6874o4563
2722.9A05784345n3394j0121K7287J6069j3256l6823l4643R54J7703o271m6336n9689
2747.4A05585825k0086K6190K6333M65j0681j6177k7156l4153m3809n7960o7973q4162
2771.8A05276656r4580n6899q643q201l0983n7196r4986j18471q7607m3070n3859r8002
2796.3A04524159j01614n5277l9148p3469j04904j13928j00267q3626q4519r5248j07265
2818.8A03564894j24287j43850j53852j68562k03657k54273l16763l93355m80592n38123
2839.1A00787580n80859o74552p83956q34036p96622o88994n28252l05551p8887O3670
2859.5I5579541R7501L3289q6361j81991k31802k37179j26714K6876M6718k6250r1260
$$ plain form
2698.4 106099463 106087005 106085300 106077528 106055510 106020510 105979836 105945122 105922055 105912364 105895782 105848908 105784345
2722.9 105784345 105730951 105720830 105748117 105764186 105750930 105714107 105679464 105680418 105698121 105691850 105645514 105585825
2747.4 105585825 105565739 105591929 105618262 105618727 105608046 105591869 105564713 105530560 105486751 105428791 105360818 105276656
2771.8 105276656 105182076 105125177 105116534 105108333 105077350 105020154 104925168 104806697 104719090 104676020 104622161 104524159
2796.3 104524159 104422545 104367268 104328120 104254651 104149747 104035819 103935552 103851926 103767407 103672159 103564894
2818.8 103564894 103440607 103296757 103142905 102974343 102770686 102516413 102199650 101806295 101325703 100787580
2839.1 100787580 100206721 99532169 98748213 97914177 97117555 96428561 95900309 95594758 95515871 95579541
2859.5 95579541 95677042 95710331 95623970 95441979 95210177 94972998 94846284 94873160 94919878 94893628 94802368
2882I4802368j41621j64050j77228k01500k32041k62570k42031j88863k12186l04282
2902.4I2675996l79932m39948n24527o42621p58350q21990q57681r09489r42004r14180
2922.8H5485274q16304o66308m82130k68966p3892Q5711K35147L57461M06616L73179
2943.2H4635788K94680J97517Q9616J1557J7655Q5408J58602K35092L20417L87293
2963.6H6433625M24052M38928M23586L82215L59726L79122L90392L94672M43787M90486
2984I0560591M69733L97878L07703K49982K36047J90836J41918J50454J76913K07585
3004.4I3089640K20233J59592N7035k3293j16181k72990m71884o68168p87878p27439
3024.7I0458667n04398k58404l8385K00217M53347O14161N73444L89540J97739J9568
$$ plain form
2882 94802368 94660747 94496697 94319469 94117969 93885928 93623358 93381327 93192464 92980278 92675996
2902.4 92675996 92296064 91856116 91331589 90688968 89930618 89108628 88250947 87341458 86399454 85485274
2922.8 85485274 84668970 84002662 83520532 83251566 83177674 83263385 83498532 83855993 84262609 84635788
2943.2 84635788 84930468 85127985 85217601 85229158 85246813 85332221 85490823 85725915 86046332 86433625
2963.6 86433625 86857677 87296605 87720191 88102406 88462132 88841254 89231646 89626318 90070105 90560591
2984 90560591 91030324 91428202 91735905 91985887 92221934 92412770 92554688 92705142 92882055 93089640
3004.4 93089640 93309873 93469465 93526500 93503207 93387026 93114036 92642152 91973984 91186106 90458667
3024.7 90458667 89954269 89695865 89657480 89857697 90311044 90925205 91498649 91888189 92085928 92105496
3045.1I2105496k13766n10049p72935r42820r91208q51309n48351j76424K21145O05506
3065.5H7925285R06676J049185J007259Q09395N10252K24185P1031R3567K68066N01633
3085.9I3366534O70641P35432P16984N96798L88604J93405J05876J28400J91236K37578
3106.3I7331488K72674L07452K72083J63681J05530J18679J41155J41883J04422M5490
3126.7I9004537J4174L4010M7541N537m0889k6667K8771M6969J5485j2535m0942m8161
3151.2I9027830K8789J06669R3925N3489K9194Q232L46K759K551n442j2499j3172k0498
3177.7I9302173k3610k0069j4019p158k2036l2121q774Q875m232j6987j1206p259j6970
3204.2I9126607k3514j5598j3823k5660k2470q196j4538j4794j746j7410l7474l6061
$$ plain form
3045.1 92105496 91891730 91381681 90608746 89665926 88674718 87823409 87275058 87098634 87319779 87925285
3065.5 87925285 88831961 89881146 90888405 91697800 92208052 92432237 92503268 92596835 92864901 93366534
3085.9 93366534 94037175 94772607 95489591 96086389 96474993 96668398 96774274 96902674 97093910 97331488
3106.3 97331488 97604162 97911614 98183697 98347378 98452908 98571587 98712742 98854625 98959047 99004537
3126.7 99004537 99018711 99052721 99100262 99105799 99064910 99038243 99067014 99113983 99129468 99116933 99075991 99027830
3151.2 99027830 99056619 99163288 99257213 99310702 99339896 99348128 99348474 99351233 99353784 99348342 99335843 99322671 99302173
3177.7 99302173 99278563 99258494 99244475 99237317 99215281 99183160 99174386 99183261 99179029 99162042 99150836 99143577 99126607
3204.2 99126607 99103093 99087495 99073672 99048012 99025542 99017346 99002808 98988014 98986268 98968858 98931384 98895323
3228.7I8895323o0653q0443j9544L9512K2626j6880n4276q5056o3724K540J5044m5449
3253.2I8549020o4200p242J4764k1422m0078n5998j17273j59877r6631p165K4569K9558
3277.7I8048025Q011l0088n4717o0612q0192j49829j78736j07658k8366J0824j7130
3300.1I7359532j48803k76923k45744q7887L6853L7599m3690j00178j14381j20956
3320.5I6295422j21510r9814k8205M5634O3669M4156j0318n6666p039P3397J01000
3342.9I6299726J06215M3404o1154j5837J32489J51974N1588j0425J5193L1507l7074
3365.4I6707606o7472L9983J74188J82194J02281O7038P4988J01388J19811Q1551O837
3387.8I7590393o2418k7245J10727J36107J1325m1145R7174K38132J78462N4556L3302
$$ plain form
3228.7 98895323 98834670 98754227 98734683 98774195 98796821 98779941 98725665 98640609 98576885 98579425 98594469 98549020
3253.2 98549020 98484820 98477578 98492342 98470920 98430842 98374844 98257571 98097694 98001063 97993898 98018467 98048025
3277.7 98048025 98056036 98025948 97971231 97910619 97830427 97680598 97501862 97394204 97365838 97376662 97359532
3300.1 97359532 97210729 96933806 96688062 96600175 96637028 96674627 96630937 96530759 96416378 96295422
3320.5 96295422 96173912 96074098 96045893 96091527 96155196 96199352 96189034 96132368 96125329 96198726 96299726
3342.9 96299726 96405941 96449345 96388191 96372354 96504843 96656817 96708405 96697980 96713173 96744680 96707606
3365.4 96707606 96640134 96680117 96854305 97036499 97138780 97205818 97280806 97382194 97502005 97583556 97590393
3387.8 97590393 97527975 97500730 97611457 97747564 97758889 97717744 97814918 98053050 98231512 98286068 98319370
3410.2I8319370P2455J37418J73581J18667Q1748J17808R6715p624o0683n746K1124
3432.7I9064833k1619N4801K17849K22003Q5289k9958m4584K7919N2643j085m2266
3455.1I9585825q3422j08457k3186J9127j25253j70803R7847L82065L58880J57332
3475.5A00089955n60J5509K17235K67089J09160R9122J86098J25515Q917m697P3147
3497.9A01186490P2658L517J28436K66087J66726L0351j3590M3130J24681J02734K098
3520.4A02113318n8949K6107J59300J75428J53470J28675N8698O9094J53148J08755
3540.8A03087044r597J9885J92177K64656J84930J66261J94549J34910O4754O0451
3561.1A04360020M7350m2879P224K75766L67761K53952J56402J16551Q1015N7137J4412
$$ plain form
3410.2 98319370 98391825 98529243 98702824 98821491 98903239 99021047 99117762 99110138 99049455 99043709 99064833
3432.7 99064833 99043214 99098015 99315864 99537867 99623156 99593198 99548614 99576533 99629176 99628091 99585825
3455.1 99585825 99502403 99393946 99370760 99389887 99264634 99093831 99191678 99573743 99932623 100089955
3475.5 100089955 100089395 100104904 100322139 100589228 100698388 100797510 100983608 101109123 101118040 101113343 101186490
3497.9 101186490 101259148 101262665 101391101 101657188 101823914 101854265 101840675 101883805 102008486 102111220 102113318
3520.4 102113318 102054369 102080476 102239776 102415204 102568674 102697349 102756047 102825141 102978289 103087044
3540.8 103087044 103077447 103097332 103289509 103554165 103739095 103905356 104099905 104234815 104299569 104360020
3561.1 104360020 104407370 104364491 104371715 104647481 105015242 105269194 105425596 105542147 105623162 105680299 105694711
3583.6A05694711m3607N8520K58816K33638J02472Q0013J09506J24025J72890J72162
3604A06963146O4468J2744O3979O6018O2085N4073q106Q5711K46275J82294n3918j87099
3628.5A07551670P7617K68054J87111J02139O2167L7682J753j14656l08537l01683
3648.8A07563317J65450M26567K45547J10424J83809K24971J96505J10853l6836q7273
3669.2A09103334O8092Q1909M4751K90096M04012L01564J63853j5187j86837p1323
3689.6A10184264K60937L18849J84942O4838k6191l7777M2570K7656j12116k03300
3710A10704672l6037K12241J89781J8132q8895o9237p403O0678Q5211m8733k53451
3732.5A10766959k70867K825K45440J90735n1153j67370k9039m6396q1802J42825K31767
$$ plain form
3583.6 105694711 105651104 105709624 105968440 106202078 106304550 106384563 106494069 106618094 106790984 106963146
3604 106963146 107027614 107040358 107104337 107170355 107232440 107286513 107278407 107364118 107610393 107792687 107738769 107551670
3628.5 107551670 107629287 107897341 108084452 108186591 108248758 108286440 108288193 108173537 107865000 107563317
3648.8 107563317 107728767 108155334 108400881 108511305 108695114 108920085 109116590 109227443 109190607 109103334
3669.2 109103334 109171426 109253335 109298086 109588182 109992194 110293758 110457611 110442424 110255587 110184264
3689.6 110184264 110445201 110764050 110948992 111013830 110987639 110949862 110992432 111020088 110907972 110704672
3710 110704672 110668635 110880876 111070657 111088789 110999894 110930657 110923254 110983932 111069143 111020410 110766959
3732.5 110766959 110496092 110498917 110744357 110935092 110883939 110716569 110687530 110641134 110559332 110702157 110933924
3754.9A10933924J02758K5010Q7404Q2672j4388n8794l9649P4136J62458O4564j03164
3777.3A11316931j10256L7050P1752M3249N6410M0483Q655o0618j32036j00446j06037
3799.8A11065137r7346N8687P6794P1967J45710O1524j41287k03836j17779j13428
3820.2A10806143L1507J92917J26600L9875m5418j18923j33670j55091j02723P1478
3840.6A10712695J80316J92404J47700J8788k06268l68357n6803K65467K03073K3198
3861A11112213r2792k9552J8930o9308m8793O4958J19531O3729r8824j10662k9493
3883.4A10899937j4412O9177L8767l7408O5696P2980j08480k17534j48665M53J71923
3905.8A10792434K17498J18780L1328l5107j07479o9321L9375M1998M768L8993K5964
$$ plain form
3754.9 110933924 111036682 111061692 111149096 111231768 111217380 111158586 111118937 111193073 111355531 111420095 111316931
3777.3 111316931 111206675 111243725 111315477 111358726 111415136 111455619 111464274 111403656 111271620 111171174 111065137
3799.8 111065137 110967791 111026478 111103272 111175239 111320949 111382473 111241186 111037350 110919571 110806143
3820.2 110806143 110837650 111030567 111157167 111197042 111151624 111032701 110899031 110743940 110641217 110712695
3840.6 110712695 110893011 111085415 111233115 111251903 111045635 110677278 110620475 110885942 111089015 111112213
3861 111112213 111019421 110989869 111008799 110939491 110890698 110955656 111075187 111138916 111040092 110929430 110899937
3883.4 110899937 110885525 110954702 110993469 110956061 111021757 111094737 110986257 110768723 110620058 110620511 110792434
3905.8 110792434 111009932 111128712 111160040 111124933 111017454 110948133 110987508 111029506 111034274 111073267 111099231
3928.3A11099231o0546l6562Q0264J01864L2449m8697o7019p749K646k4426P308L8373
3952.7A11117136K2221j514j7536k3865r752l993j3638j7511k6417l0649m804K3317
3977.2A11012995R215j6034N317M1700K7215q690j6344j6653j5319p63
3997.6A11022639
$$ plain form
3928.3 111099231 111038685 111002123 111082387 111184251 111216700 111168003 111100984 111093235 111095881 111071455 111078763 111117136
3952.7 111117136 111139357 111137843 111120307 111096442 111086690 111082697 111069059 111051548 111025131 110994482 110989678 111012995
3977.2 111012995 111022210 111006176 111011493 111053193 111080408 111071718 111055374 111038721 111023402 111022639
3997.6 111022639
##END=$$ End of the data block
