##TITLE=N-hexadecenyl  succinic anhydride L# 042414L1 $$ Begin of the data block
##JCAMP-DX=5.00 $$ ACD/SpecManager v 10.08
##SPECTROMETER/DATA SYSTEM=Alpha
##DATE=10 Jul 2014 09:55:42
##DATA TYPE=INFRARED SPECTRUM
##DATA CLASS=XYDATA
##ORIGIN=
##OWNER=
##NPOINTS=1667
##FIRSTX=599.63549805
##LASTX=3997.56909180
##MAXX=3997.56909180
##MINX=599.63549805
##MAXY=1.11706686
##MINY=0.10007299
##XFACTOR=1.0000000000
##YFACTOR=0.000000010000000
##FIRSTY=1.03049898
##DELTAX=2.03957605
##XUNITS=1/CM
##YUNITS=ARBITRARY UNITS
##XYDATA=(X++(Y..Y))
599.6A03049898j69289k24364k67863k70569j94407o4444M7600P8285J227j53136l05676
$$ 103049898 102880609 102656245 102388382 102117813 101923406 101858962 101906562 101984847 101986074 101832938 101527262
622.1A01527262l89099l42262k02263p4303n161j5510p4374r8789p1144n6911n2488
$$ 101527262 101138163 100795901 100593638 100519335 100514174 100498664 100424290 100325501 100254357 100197446 100144958
644.5A00144958K2364J20938J27053P5007K5296m8244j18554j53708j84477j81531
$$ 100144958 100167322 100288260 100415313 100490320 100515616 100467372 100348818 100195110 100010633 99829102
664.9I9829102r4557Q0263J37395J06961J00755R6274R5677J02401J08421J40989J85143
$$ 99829102 99734545 99814808 99952203 100059164 100159919 100256193 100351870 100454271 100562692 100703681 100888824
687.3A00888824J80078J52791J47080J28508O0105m8137j70636k84183m06086n82600
$$ 100888824 101068902 101221693 101368773 101497281 101557386 101509249 101338613 101054430 100648344 100065744
707.7A00065744q30305j119148j439351j815015k157933k145153j504904n88197M0675
$$ 100065744 99235439 98116291 96676940 94861925 92703992 90558839 89053935 88465738 88506413
726.1H8506413L34084N53292Q47309J153154J340043J374477J300705J179641J053232
$$ 88506413 88840497 89393789 90241098 91394252 92734295 94108772 95409477 96589118 97642350
744.4I7642350R39077Q21489O89507N73003M56178L31152K38895J71984J23739R5308
$$ 97642350 98581427 99402916 100092423 100665426 101121604 101452756 101691651 101863635 101987374 102082682
764.8A02082682N9080K1922J5986J0729j8740m2092o1906r6917j26624j15144p0441
$$ 102082682 102141762 102163684 102179670 102190399 102171659 102129567 102067661 101970744 101844120 101728976 101658535
787.3A01658535k2066J3113K7752K8456J4555J5318O7139J22142J33669J26541J03164
$$ 101658535 101636469 101649582 101677334 101705790 101720345 101735663 101802802 101924944 102058613 102185154 102288318
809.7A02288318M7421p415l2282l3831j7226K1589O6113Q9765R7334R6918J08134J47867
$$ 102288318 102335739 102328324 102296042 102262211 102244985 102266574 102332687 102422452 102519786 102616704 102724838 102872705
834.2A02872705J56534R8729L2556l886k8860m6230n7637q6368j25730j59967j77717
$$ 102872705 103029239 103127968 103160524 103156638 103127778 103081548 103023911 102937543 102811813 102651846 102474129
856.6A02474129j81925j92976k09296k30121k52641k66754k76447k94077l30925l99989
$$ 102474129 102292204 102099228 101889932 101659811 101407170 101140416 100863969 100569892 100238967 99838978
877I9838978n17690p07239r96691j384372j842713k340841k842069l311145l756279
$$ 99838978 99321288 98614049 97617358 96232986 94390273 92049432 89207363 85896218 82139939
895.4H2139939m200774m587812m840117m916895m735046m210389l414124k557776j775974
$$ 82139939 77939165 73351353 68511236 63594341 58859295 54648906 51234782 48677006 46901032
913.7D6901032j041087k73889N96430J599110K664151L656453M455054M959357N084300
$$ 46901032 45859945 45586056 46182486 47781596 50445747 54102200 58557254 63516611 68600911
932.1F8600911M822165M267662L569204K871490K248805J688564J159024O71405K77764
$$ 68600911 73423076 77690738 81259942 84131432 86380237 88068801 89227825 89899230 90176994
950.4I0176994J8119j33299k60431m65685q43305j433902k122403k573824k477997
$$ 90176994 90195113 90061814 89801383 89335698 88492393 87058491 84936088 82362264 79884267
968.8G9884267j931471j295298o62142J76865J228875K131152K556336K497416K122254
$$ 79884267 77952796 76657498 75995356 76172221 77401096 79532248 82088584 84586000 86708254
987.2H6708254J602810J065350O07699L10886J75786J53267K00880K71439L26455L47769
$$ 86708254 88311064 89376414 89984113 90294999 90470785 90624052 90824932 91096371 91422826 91770595
1007.5I1770595L25150K56919J50949J7131j42676l27432n24712p06661q25995q48794
$$ 91770595 92095745 92352664 92503613 92520744 92378068 92050636 91525924 90819263 89993268 89144474
1027.9H9144474p73716o70469o80917q55052j103008j348716j605785j948613k401370
$$ 89144474 88370758 87700289 87019372 86164320 85061312 83712596 82106811 80158198 77756828
1046.3G7756828k826017l054273l047246k839857k493418k109390j756865j399273
$$ 77756828 74930811 71876538 68829292 65989435 63496017 61386627 59629762 58230489
1062.6E8230489r34040k42806P17116J851874K958984L792882M190719M162574L861588
$$ 58230489 57296449 57053643 57770759 59622633 62581617 66374499 70565218 74727792 78589380
1081G8589380L460729L060758K674502K288807J911139J566041J272010J028747Q37159
$$ 78589380 82050109 85110867 87785369 90074176 91985315 93551356 94823366 95852113 96689272
1099.3I6689272P05147O23357N64808N05554M18443K97206J74064O9570l0839j32346
$$ 96689272 97394419 98017776 98582584 99088138 99506581 99803787 99977851 100047421 100016582 99884236
1119.7I9884236k03866j92577p0917J17779K80523L48639L19732K36630J63210J24824
$$ 99884236 99680370 99487793 99416876 99534655 99815178 100163817 100483549 100720179 100883389 101008213
1140.1A01008213J00278Q1480N4121L922n1212j02437j59252k13432k55215k93672
$$ 101008213 101108491 101189971 101244092 101248014 101196802 101094365 100935113 100721681 100466466 100172794
1160.5A00172794l21448l21424l09831k98893k74361k44295k22641k04969k07686k58142
$$ 100172794 99851346 99529922 99220091 98921198 98646837 98402542 98179901 97974932 97767246 97509104
1180.9I7509104l64470n25779p41696r95398j239562j437575j582861j681953j761818
$$ 97509104 97144634 96618855 95877159 94881761 93642199 92204624 90621763 88939810 87177992
1199.3H7177992j856917j975823k082622k111912k036619j883244j677150j434403
$$ 87177992 85321075 83345252 81262630 79150718 77114099 75230855 73553705 72119302
1215.6G2119302j163543q49819m82112q6045L06087O81883J040769J373106J644707
$$ 72119302 70955759 70105940 69623828 69537783 69843870 70525753 71566522 72939628 74584335
1233.9G4584335J806486J850128J800549J679009J509011J306307J100642R26798P99781
$$ 74584335 76390821 78240949 80041498 81720507 83229518 84535825 85636467 86563265 87363046
1252.3H7363046P17265O71470O43516O05815N51331N05853M92460M94980M84604M32610
$$ 87363046 88080311 88751781 89395297 90001112 90552443 91058296 91550756 92045736 92530340 92962950
1272.7I2962950L43937K70403K43520K36947K23672K01750J60920J23233J44333K34985
$$ 92962950 93306887 93577290 93820810 94057757 94281429 94483179 94644099 94767332 94911665 95146650
1293.1I5146650L61472M79621N40882N31161M69804L87800L17329K84976K84910K85995
$$ 95146650 95508122 95987743 96528625 97059786 97529590 97917390 98234719 98519695 98804605 99090600
1313.5I9090600K83718K76703K50071K00701J49011R2340L2127J585J5557L9256L3331
$$ 99090600 99374318 99651021 99901092 100101793 100250804 100343144 100375271 100376856 100392413 100431669 100465000
1335.9A00465000K2494P2361J89197K60269K19548J21498P5710J15716J66953J54972
$$ 100465000 100487494 100559855 100749052 101009321 101228869 101350367 101426077 101541793 101708746 101863718
1356.3A01863718P7510l2270j69551k74742l03459l09658l79038p38019j411354j539511
$$ 101863718 101941228 101908958 101739407 101464665 101161206 100851548 100472510 99734491 98323137 96783626
1376.7I6783626m92608J031994J872456J771009J359308R18627N18274K55490L8468
$$ 96783626 96291018 97323012 99195468 100966477 102325785 103244412 103762686 104018176 104056644
1395.1A04056644k04026m99749q35598j272321j861632k190649k086192j602096o53022
$$ 104056644 103852618 103352869 102517271 101244950 99383318 97192669 95106477 93504381 92851359
1413.4I2851359M52661J471692K170784J822090J127309N69093l3415o13463r97263
$$ 92851359 93304020 94775712 96946496 98768586 99895895 100464988 100431573 99818110 98820847
1431.8I8820847j085567j155800j093572p75838o45638p06160q84294j293147j831317
$$ 98820847 97735280 96579480 95485908 94710070 94064432 93358272 92473978 91180831 89349514
1450.1H9349514k302831k486205k382064j644540p43651o27888p27295K33119K604097
$$ 89349514 87046683 84560478 82178414 80533874 79790223 79162335 78435040 78668159 81272256
1468.5H1272256N365777P275451N578434K627409J308369Q26526N93257M34244L46219
$$ 81272256 86638033 93913484 99491918 102119327 103427696 104254222 104847479 105281723 105627942
1486.8A05627942L12769K53261J77157J55758J64688J28186J04511J14369J36828J20378
$$ 105627942 105940711 106193972 106371129 106526887 106691575 106819761 106924272 107038641 107175469 107295847
1507.2A07295847M3583L3855N8854Q1372Q7178O7437M5836L2377K0766K8658M9245
$$ 107295847 107339430 107373285 107432139 107513511 107600689 107668126 107713962 107746339 107767105 107795763 107845008
1529.7A07845008O2418N1511M4357P2325Q1026K0719r048O771K4986L6931M0758N3918
$$ 107845008 107907426 107958937 108003294 108075619 108156645 108177364 108168316 108175087 108200073 108237004 108277762 108331680
1554.1A08331680O9511L9768n2130m4524M375K6774K6357Q392J4675K9445K920k9623
$$ 108331680 108401191 108440959 108388829 108344305 108348680 108375454 108401811 108410203 108424878 108454323 108457243 108427620
1578.6A08427620j7178J359L099l993j2243j5914j9706k5749l1698l1089l0530l6752
$$ 108427620 108410442 108411801 108414900 108410907 108398664 108382750 108363044 108337295 108305597 108274508 108243978 108207226
1603.1A08207226m1402l9434m7660n8734m0114l5846o9118o5732m1544m5717m8363
$$ 108207226 108165824 108126390 108078730 108019996 107979882 107944036 107874918 107809186 107767642 107721925 107673562
1625.5A07673562n4431p1359n7471n8496j42085j93918j34659p8547l2735l5083p8988
$$ 107673562 107619131 107547772 107490301 107431805 107289720 107095802 106961143 106882596 106849861 106814778 106735790
1648A06735790o9332j05977k20681j80053j37461j80757k42495k08390l2258J66273
$$ 106735790 106666458 106560481 106339800 106159747 106022286 105841529 105599034 105390644 105358386 105524659
1668.4A05524659K95401K55894J51468N3453j7428m3905j12128k57373k80857k43998
$$ 105524659 105820060 106075954 106227422 106280875 106263447 106219542 106107414 105850041 105569184 105325186
1688.8A05325186k73347k85351l78525n10228o32560q79431q12638p55906p55083n24193
$$ 105325186 105051839 104766488 104387963 103877735 103245175 102365744 101553106 100797200 100042117 99517924
1709.2I9517924k60437m2665J21915J96386J39290K1434j09005k49362l80272m82261
$$ 99517924 99257487 99214822 99336737 99533123 99672413 99693847 99584842 99335480 98955208 98472947
1729.5I8472947n68384p56377q18265o83808p67159q94738r48423j084798j294434
$$ 98472947 97904563 97148186 96329921 95646113 94878954 93984216 93035793 91950995 90656561
1747.9I0656561j669121j980001k042502k367485k873313l359252m322368n032581
$$ 90656561 88987440 87007439 84964937 82597452 79724139 76364887 72042519 67009938
1764.2F7009938n766541p104594q298224r519461q773621o414287m787894l440408
$$ 67009938 61243397 54138803 45840579 36321118 27547497 21133210 16345316 12904908
1780.5A2904908k047166q50443J96430J202649K805651N235280O907084P741914Q639440
$$ 12904908 10857742 10007299 10203729 11406378 14212029 19447309 26354393 34096307 42735747
1798.9D2735747Q808371P634503O027489M865808M080975L432566K761662K170747
$$ 42735747 51544118 59178621 65206110 70071918 74152893 77585459 80347121 82517868
1815.2H2517868J777542J409209J037246P36016M91863K31773j5438k37274m17125
$$ 82517868 84295410 85704619 86741865 87477881 87969744 88201517 88186079 87948805 87531680
1833.6H7531680n74201p40797q63027r83423j257998j533103j674050j947499k358466
$$ 87531680 86957479 86216682 85353655 84370232 83112234 81579131 79905081 77957582 75599116
1851.9G5599116k844745l302950l482115l044075j744627K68852K601105N015278O374937
$$ 75599116 72754371 69451421 65969306 62925231 61180604 61449456 64050561 69065839 75440776
1870.3G5440776N988998N199253M393381L446960K601165J953524J489604J138902
$$ 75440776 81429774 86629027 91022408 94469368 97070533 99024057 100513661 101652563
1886.6A01652563R12165P51615N97715M87888M17757L58451L11648K74873K37024K13635
$$ 101652563 102564728 103316343 103914058 104401946 104819703 105178154 105489802 105764675 106001699 106215334
1907A06215334J97756J77527J52075J36411J18542J02365R7167Q9145P4291O8128O8295
$$ 106215334 106413090 106590617 106742692 106879103 106997645 107100010 107197177 107286322 107360613 107428741 107497036
1929.4A07497036N6279M8852M4429M5944N0771M5085K5952J8632L0160M3237N8174
$$ 107497036 107553315 107602167 107646596 107692540 107743311 107788396 107814348 107832980 107863140 107906377 107964551
1951.9A07964551O3920N8580N4300N9056O1274O2775O0070N1605M8543M8971M5645
$$ 107964551 108028471 108087051 108141351 108200407 108261681 108324456 108384526 108436131 108484674 108533645 108579290
1974.3A08579290L7241L2067K6953K6548K8181K6668K1278J2732N805O998R596J765
$$ 108579290 108616531 108648598 108675551 108702099 108730280 108756948 108778226 108790958 108796763 108803761 108813357 108815122
1998.8A08815122o843r441o748p248j5985k4868j6987m041p141n793J0335K4784L1769
$$ 108815122 108808279 108798838 108792090 108784842 108768857 108743989 108727002 108722961 108715820 108710027 108720362 108745146 108776915
2025.3A08776915L4905L8123M5263M7589M1127L9828M8148M8340L7348L0744K9183
$$ 108776915 108811820 108849943 108895206 108942795 108983922 109023750 109071898 109120238 109157586 109188330 109217513
2047.7A09217513K8884L0744L7432M1210L4404K6739K3329J8537J6403J7608J4531
$$ 109217513 109246397 109277141 109314573 109355783 109390187 109416926 109440255 109458792 109475195 109492803 109507334
2070.2A09507334J4878K1946K2101J0896j776k062Q678J1063K062K86N889J419p224
$$ 109507334 109522212 109544158 109566259 109577155 109575379 109573317 109581995 109593058 109595120 109595406 109601295 109602714 109595490
2096.7A09595490r895j0550j0407j5879k8026l5035l6395l6108l1984l0029l4142l6597
$$ 109595490 109585595 109575045 109564638 109548759 109520733 109485698 109449303 109413195 109381211 109351182 109317040 109280443
2121.1A09280443k6679j3435j0502j2004p749K909Q869M637n484n590N340J3054J6415
$$ 109280443 109253764 109240329 109229827 109217823 109210074 109212983 109221852 109226489 109221005 109215415 109220755 109233809 109250224
2147.7A09250224J7559K1088K4391K1934K5082L4403L1066J8800K2041L6943L8088
$$ 109250224 109267783 109288871 109313262 109335196 109360278 109394681 109425747 109444547 109466588 109503531 109541619
2170.1A09541619K8074K0170J6725J9979K5952K7585J8490Q630J4961K3699J6344P808
$$ 109541619 109569693 109589863 109606588 109626567 109652519 109680104 109698594 109707224 109722185 109745884 109762228 109770036
2194.6A09770036J0907J6094J4960J3328J2922J1587J3507J4067P927m077p212j91
$$ 109770036 109780943 109797037 109811997 109825325 109838247 109849834 109863341 109877408 109885335 109881258 109874046 109873855
2219A09873855M923M578n960j5474j1670Q3M125l207r847p653l910n186q666j5962
$$ 109873855 109878778 109883356 109877396 109861922 109850252 109850335 109854460 109851253 109841406 109833753 109829843 109824657 109815991 109800029
2247.6A09800029k0385k0719k1910k5165k9028k7442k3722k3294k3734j7739n841N36
$$ 109800029 109779644 109758925 109737015 109711850 109682822 109655380 109631658 109608364 109584630 109566891 109561050 109561586
2272.1A09561586m780j1659p855K253O532K969L349P594M29o938J931J1945J3387J1158
$$ 109561586 109556806 109545147 109537292 109539545 109546077 109549046 109552395 109559989 109560418 109553480 109555411 109567356 109580743 109591901
2300.6A09591901J312j0944q142M828J4365K0671J8477P057P129R966O91O569K0945
$$ 109591901 109593213 109582269 109574127 109578955 109593320 109613991 109632468 109639525 109646654 109656620 109657311 109663880 109684825
2327.1A09684825K6905L0578K4259J8835J4293m65j2946l8028o3479k7787L5083P1525
$$ 109684825 109711730 109742308 109766567 109785402 109799695 109799230 109786284 109748256 109684777 109656990 109692073 109763598
2351.6A09763598P5376N5719J5795j4055R66k909m2891n9307n5063m1735k9647k6798
$$ 109763598 109838974 109894693 109910488 109896433 109897399 109894490 109851599 109792292 109737229 109695494 109665847 109639049
2376.1A09639049j4961j240J454L386p75j4460j0073L254q631k5475k6166k4545k2519
$$ 109639049 109624088 109622848 109624302 109627688 109626913 109612453 109602380 109605634 109597003 109571528 109545362 109520817 109498298
2402.6A09498298j8143j4890l028J4961J7381J2529J6916J9526K3520K8312J7607N460
$$ 109498298 109480155 109465265 109462237 109477198 109494579 109507108 109524024 109543550 109567070 109595382 109612989 109618449
2427.1A09618449J2255K2340J8394J2564J1075Q917O425K158n734r036n913m077m911
$$ 109618449 109630704 109653044 109671438 109684002 109695077 109703994 109710419 109712577 109706843 109697807 109691894 109687817 109682906
2453.6A09682906r942r776m005r727k1041k3115j7201r752r978k0063k2220j4877j7441
$$ 109682906 109672964 109663188 109659183 109649456 109628415 109605300 109588099 109578347 109568369 109548306 109526086 109511209 109493768
2480.1A09493768k7454k6250q428O712j228j8907k3388j5140q512j5759k4343k0516
$$ 109493768 109466314 109440064 109431636 109438348 109437120 109418213 109394825 109379685 109371173 109355414 109331071 109310555
2504.6A09310555j9633k2793k3377k6953k7037k6369l2568l0792j6510j5605k8753
$$ 109310555 109290922 109268129 109244752 109217799 109190762 109164393 109131825 109101033 109084523 109068918 109040165
2527A09040165k5523j7941j8406j0836q166j3232q273o497j3602j3649r692j2314k0087
$$ 109040165 109014642 108996701 108978295 108967459 108959293 108946061 108937788 108931291 108917689 108904040 108894348 108882034 108861947
2553.5A08861947k2876j5724j2505j9586k3449k0837j5641j5175k3293l0291l5108
$$ 108861947 108839071 108823347 108810842 108791256 108767807 108746970 108731329 108716154 108692861 108662570 108627462
2576A08627462l6382k9028k1481j9861k2697k8360k9492k4045j5747j4508k5416k6094
$$ 108627462 108591080 108562052 108540571 108520710 108498013 108469653 108440161 108416116 108400369 108385861 108360445 108334351
2600.4A08334351j4735j1408j1778j2326k1410k7311k1958j8514k0027k2614k2876
$$ 108334351 108319616 108308208 108296430 108284104 108262694 108235383 108213425 108194911 108174884 108152270 108129394
2622.9A08129394j9920j4460j0312j5747k2864k5595k8646k3555j7953k7323l0589
$$ 108129394 108109474 108095014 108084702 108068955 108046091 108020496 107991850 107968295 107950342 107923019 107892430
2645.3A07892430k2292k5213l1555l1245l7992m4083m2403m9138n7745n3334m5860
$$ 107892430 107870138 107844925 107813370 107782125 107744133 107700050 107657647 107608509 107550764 107497430 107451570
2667.7A07451570m3166k9468j0562q631q607O533K5809L5309L8481M0174M5359N8877
$$ 107451570 107408404 107378936 107368374 107359743 107351136 107357669 107383478 107418787 107457268 107497442 107542801 107601678
2692.2A07601678O0976M8554M0388L3128K0504O938o902j8620k2591k6834l2496k8658
$$ 107601678 107662654 107711208 107751596 107784724 107805228 107812166 107805264 107786644 107764053 107737219 107704723 107676065
2716.7A07676065l4595o1464q3613r0766q3018n7029j8370J8894M1306N7888P3004
$$ 107676065 107641470 107580006 107496393 107405627 107322609 107265580 107247210 107266104 107307410 107365298 107438302
2739.1A07438302P2515N9021L8945K3031K8027M2760M5705K7036o508k4319k0468k1255
$$ 107438302 107510817 107569838 107608783 107631814 107659841 107702601 107748306 107775342 107768834 107744515 107724047 107702792
2763.6A07702792l4499n1499o6745q5259j01816r2185p9977j03581j37508j53542j63483
$$ 107702792 107668293 107616794 107550049 107464790 107362974 107270789 107190812 107087231 106949723 106796181 106632698
2786A06632698j71876j65093j56105j72388k05040k23113k23016k29633k57778l01266
$$ 106632698 106460822 106295729 106139624 105967236 105762196 105539083 105316067 105086434 104828656 104527390
2806.4A04527390l35741l45135l55315m05145m89866n71430o58023p75481r11283j071555
$$ 104527390 104191649 103846514 103491199 103086054 102596188 102024758 101366735 100591254 99679971 98608416
2826.8I8608416j279682j557415j939428k467537l194445m192621n509537o962443
$$ 98608416 97328734 95771319 93831891 91364354 88169909 83977288 78467751 71505308
2843.1G1505308q083606q428984p788927o096142l442681k78563K712554M915464N972821
$$ 71505308 63421702 54992718 47203791 41107649 37664968 37386405 40098959 45014423 50987244
2861.5E0987244N800593M519462K589023R38076M83114J199406K103758K324062J759667
$$ 50987244 56787837 61307299 63896322 64834398 65317512 66516918 68620676 70944738 72704405
2879.9G2704405Q09931j54727r69172j590538k019143k260572k341532k343190k348197
$$ 72704405 73514336 73359609 72390437 70799899 68780756 66520184 64178652 61835462 59487265
2898.2E9487265k380693k465200k643186k933189l338587l829730m331923m727402
$$ 59487265 57106572 54641372 51998186 49064997 45726410 41896680 37564757 32837355
2914.5C2837355m842460m500572l665206k458298j116387J53438J267631K199574L060262
$$ 32837355 27994895 23494323 19829117 17370819 16254432 16407870 17675501 19875075 22935337
2932.9B2935337L931615M695865N178580N243915M777429L731334K199322N01460q37106
$$ 22935337 26866952 31562817 36741397 41985312 46762741 50494075 52693397 53194857 52357751
2951.2E2357751j409995j139221k35489R31376K099943L146184L978783M506123M649609
$$ 52357751 50947756 49808535 49573046 50504422 52604365 55750549 59729332 64235455 68885064
2969.6F8885064M459590M053432L523814K972573K468133K045608J702636J419115
$$ 68885064 73344654 77398086 80921900 83894473 86362606 88408214 90110850 91529965
2985.9I1529965J208866J062787R51987Q67605P94286P37476P09099O75940O36101
$$ 91529965 92738831 93801618 94753605 95621210 96415496 97152972 97862071 98538011 99174112
3004.3I9174112O13380N85907N42295N05603M84132M57168M07791L39317K63513K09570
$$ 99174112 99787492 100373399 100915694 101421297 101905429 102362597 102770388 103109705 103373218 103582788
3024.7A03582788J86932J71339J68431J85418K12181K32732K30586K28656K42281K64942
$$ 103582788 103769720 103941059 104109490 104294908 104507089 104739821 104970407 105199063 105441344 105706286
3045.1A05706286K71714K38383K10547K08354J90723J65344J47104J14870P0918M6563
$$ 105706286 105978000 106216383 106426930 106635284 106826007 106991351 107138455 107253325 107324243 107370806
3065.5A07370806P0011R9147P5769L1471N85q059K4939O7961Q2624Q7511Q4007P4637
$$ 107370806 107440817 107539964 107615733 107647204 107647789 107639730 107664669 107732630 107815254 107902765 107986772 108061409
3089.9A08061409Q1265Q1456N9306L0816K6667M9365M2736P880P295L6824L1996l219
$$ 108061409 108142674 108224130 108283436 108314252 108340919 108390284 108433020 108440900 108448195 108485019 108517015 108513796
3114.4A08513796n400K3544N7781Q1157O5995K9742J4115K3043L3641K2089j2397k1399
$$ 108513796 108508396 108531940 108589721 108670878 108736873 108766615 108780730 108803773 108837414 108859503 108847106 108825707
3138.9A08825707J8681M9364M0650J4198k0325k8121J2374N0103M7326K0564j347j002
$$ 108825707 108844388 108893752 108934402 108948600 108928275 108900154 108912528 108962631 109009957 109030521 109029174 109028172
3163.4A09028172J4675K1756J3852O044q23j478O390R405J8883K3699J192j3697K456
$$ 109028172 109042847 109064603 109078455 109084499 109083676 109082198 109088588 109097993 109116876 109140575 109141767 109128070 109130526
3189.9A09130526K1910K7812J8751O462O210J0443J2982J5044K5630L3677K1708J1205
$$ 109130526 109152436 109180248 109198999 109205461 109211671 109222114 109235096 109250140 109275770 109309447 109331155 109342360
3214.3A09342360K933p296Q047L1138K5212P749o116l7872n0545J2612P1848M9638
$$ 109342360 109345293 109337997 109346044 109377182 109402394 109410143 109404027 109366155 109315610 109328222 109400070 109449708
3238.8A09449708J2625j765k1565k2816J0383L0053Q106j2374Q082L2032K5236O795
$$ 109449708 109462333 109460568 109439003 109416187 109426570 109456623 109464729 109452355 109460437 109492469 109517705 109524500
3263.3A09524500o520l1710n7340k6297L0017M5943L5190K4474K4080K4164J4258q321
$$ 109524500 109517980 109486270 109428930 109402633 109432650 109478593 109513783 109538257 109562337 109586501 109600759 109592438
3287.8A09592438m3965n0842j8526J9312M8650L8528j7774o5148n0771K0206P8273
$$ 109592438 109548473 109497631 109479105 109498417 109547067 109585595 109567821 109502673 109451902 109472108 109550381
3310.2A09550381O7103K7084K5558L9959K0659k7179n3168j3959M5562M7707Q464k8944
$$ 109550381 109617484 109644568 109670126 109710085 109730744 109703565 109650397 109636438 109682000 109729707 109738171 109709227
3334.7A09709227n5277l1281J9801L2627L3558J2851l6466j3984O0213O3121N675k4987
$$ 109709227 109653950 109622669 109642470 109675097 109708655 109721506 109685040 109671056 109731269 109794390 109800065 109775078
3359.1A09775078q881j979l6788n1665m828O3145Q8525N1189Q177L255K1648L7634
$$ 109775078 109766197 109764218 109727430 109675765 109670937 109734082 109822607 109873796 109881973 109885228 109906876 109944510
3383.6A09944510L3105j0312n9509k7299N0139M5968l7861p0155J8537J03772P3933
$$ 109944510 109977615 109967303 109907794 109880495 109930634 109976602 109938741 109868586 109887123 109990895 110064828
3406.1A10064828J5092M196K0433N5814Q1026M6468J657N758L970k9088l8743j8298
$$ 110064828 110079920 110084116 110104549 110160363 110241389 110287857 110289514 110295272 110299242 110270154 110231411 110213113
3430.5A10213113j9932l2270Q059P8857J04475O8569J7607J252J9467K7883J2135P03
$$ 110213113 110193181 110160911 110168970 110247827 110352302 110420871 110438478 110439730 110459197 110487080 110499215 110499918
3455A10499918j3268l2842j4662J847l3164m9019J6070R1529Q0859K3544k3436l3796
$$ 110499918 110486650 110453808 110439146 110440993 110407829 110358810 110374880 110466409 110547268 110570812 110547376 110513580
3479.5A10513580K0337N2762J3483K241L1745K1589j4031l0172k1589j5485m852O4469
$$ 110513580 110533917 110586679 110600162 110602403 110634148 110655737 110641706 110611534 110589945 110574460 110569608 110634077
3504A10634077J11496N5826k5428n6362k968P3194P0847q524q1372k1172J01793R5570
$$ 110634077 110745573 110801399 110775971 110719609 110716641 110789835 110860682 110852158 110770786 110749614 110851407 110946977
3528.4A10946977K5487k1219q5879o8223L6001J455j26708r1016J17969J95897Q7797
$$ 110946977 110972464 110951245 110865366 110797143 110833144 110834599 110707891 110616875 110734844 110930741 111018538
3550.9A11018538M5717M7267j0991o5947k7037J25885J95778J2541j71221q8834K7489
$$ 111018538 111064255 111111522 111100531 111034584 111007547 111133432 111329210 111341751 111170530 111081696 111109185
3573.3A11109185J1111m7589j16038j79970j64748m1902Q5986l994j27768r7966j25003
$$ 111109185 111120296 111072707 110956669 110776699 110611951 110570049 110656035 110652041 110524273 110426307 110301304
3595.7A10301304k38109k39289j57439j01602n3025n1522j16324j47856j47807j15276
$$ 110301304 110063195 109823906 109666467 109564865 109511840 109460318 109343994 109196138 109048331 108933055
3616.1A08933055r3400j27649q7834L7301J24216R1517j9086k9826M2212J07873J23441
$$ 108933055 108839655 108712006 108624172 108661473 108785689 108877206 108858120 108828294 108870506 108978379 109101820
3638.6A09101820J15335J30439J77038J98209P6806l2019N4645Q4973l851k6131P3469
$$ 109101820 109217155 109347594 109524632 109722841 109799647 109767628 109822273 109907246 109903395 109877264 109950733
3661A09950733J46926J50776J46067J21200P7355O8974L2950l7337m0757n019M0507
$$ 109950733 110097659 110248435 110394502 110515702 110593057 110662031 110694981 110657644 110616887 110611868 110652375
3683.4A10652375N8997K1183J0765N0473L6419L2794Q0824R2530L1257N996P4601J38224
$$ 110652375 110711372 110732555 110743320 110793793 110830212 110863006 110943830 111036360 111067617 111073613 111148214 111286438
3707.9A11286438J17802L82p2229j3006N3573N6684M7290M4417J4544J8930P2933P8928
$$ 111286438 111404240 111404622 111332393 111319387 111372960 111429644 111476934 111521351 111535895 111554825 111627758 111706686
3732.4A11706686m6468k10392j60325N2047J65665N8270n1654l2007r4259j47569p4137
$$ 111706686 111660218 111449826 111289501 111341548 111507213 111565483 111513829 111481822 111387563 111239994 111165857
3754.8A11165857l6716n8878m1127J1254J6462p474k8861n0127l3772R060J0299j8072
$$ 111165857 111129141 111070263 111029136 111040390 111056852 111049378 111020517 110970390 110936618 110945678 110955977 110937905
3779.3A10937905K158K5511L850j6832q679K3067M2630L8886N4192M9186k4772n8102
$$ 110937905 110940063 110965574 110969424 110952592 110943913 110966980 111009610 111048496 111102688 111151874 111127102 111069000
3803.8A11069000m9138m0865J2576N3788N2988L6872K4890j8930o4898l0577K253O795
$$ 111069000 111019862 110978997 110991573 111045361 111098349 111135221 111160111 111141181 111076283 111045706 111047959 111054754
3828.2A11054754J5629J8203O115k0146l5131j8072j4341j9467K9147J10686J32775
$$ 111054754 111070383 111088586 111094701 111074555 111039424 111021352 111007011 110987544 111016691 111127377 111260152
3850.7A11260152K2387j21355q2981p499L2902M4549K0647J5044Q166k5904l6085j4138
$$ 111260152 111282539 111161184 111078203 111070704 111103606 111148155 111168802 111183846 111192012 111166108 111130023 111115885
3875.2A11115885K9659L4046m709k0813r752J7882Q952k9087n472M8876M7982L862
$$ 111115885 111145544 111179590 111174881 111154068 111144316 111162198 111171150 111142063 111136591 111185467 111233449 111237311
3899.6A11237311k8586m9281n5921k1434J1766K2125K7597J4877l135J955L040j2267
$$ 111237311 111208725 111159444 111103523 111082089 111093855 111115980 111143577 111158454 111155319 111157274 111160314 111148047
3924.1A11148047j1336R060M05k3520k599K7681J8477k563p141O163J2577q917k1219
$$ 111148047 111136711 111145771 111146176 111122656 111120057 111147738 111166215 111163652 111156511 111162674 111175251 111166334 111145115
3950.6A11145115r000P39n448j7059m29J7249M18p558p63j2183k3353j3745K217O366
$$ 111145115 111136115 111136854 111131406 111114347 111113918 111131167 111131585 111124027 111123264 111111081 111087728 111073983 111076200 111082566
3979.2A11082566k766j0204j419Q142L886R311J3172l135j2815
$$ 111082566 111079800 111069596 111068177 111076319 111080205 111089516 111102688 111099553 111086738
3997.5A11086738
$$ 111086738
##END=$$ End of the data block
