##TITLE=Microcapsulas de Zeina mais ext aquoso $$ Begin of the data block
##JCAMP-DX=5.00 $$ ACD/SpecManager v 10.08
##SPECTROMETER/DATA SYSTEM=Alpha
##DATE=17 Dec 2013 14:46:08
##DATA TYPE=INFRARED SPECTRUM
##DATA CLASS=XYDATA
##ORIGIN=
##OWNER=
##NPOINTS=1765
##FIRSTX=399.75695801
##LASTX=3997.56933594
##MAXX=3997.56933594
##MINX=399.75695801
##MAXY=0.89995033
##MINY=0.59466654
##XFACTOR=1.0000000000
##YFACTOR=1.000000000000000e-9
##FIRSTY=0.82997042
##DELTAX=2.03957629
##XUNITS=1/CM
##YUNITS=ARBITRARY UNITS
##XYDATA=(X++(Y..Y))
399.8 829970419 826456845 828575253 831332147 828765035 825270474 827083349 830042064 828518450
416.1 828518450 825880945 827600896 829436958 826746106 823430598 824751973 827481091 825646222
432.4 825646222 822268009 823622704 826537073 824459910 820062637 820227802 822660148 820694625 816677690
450.7 816677690 817254007 820558965 819567144 815305531 815275550 818329155 817506671 813626528 813771307
469.1 813771307 817451119 817116976 813103437 812864184 816255033 816247463 812348306 811712742 815257251
487.5 815257251 815827906 811938822 810536563 813679874 814683020 811228096 809593141 812311113 813130915
505.8 813130915 809206247 806484222 808441818 809664607 806274772 803437173 805478811 807381928
522.1 807381928 804668069 801778972 803624690 806082428 804050863 801008701 802259028 804849207
538.4 804849207 803183913 799674451 800207257 802982748 801923513 798128724 797688127 800290108 800002217
556.8 800002217 796623468 795890927 798527896 799201787 796498597 795442462 798097074 799529433 797104716
575.2 797104716 795554578 798058569 800168395 798300862 796351671 798242569 800738394 799493134
591.5 799493134 797193944 798570216 801380992 800805449 798616648 799708426 802773654 802738011 800254524
609.8 800254524 800450087 803430557 804235339 802100360 802058220 805559278 807742953 806434810 806176960
628.2 806176960 809540451 812243938 811171830 810279846 813255847 816593051 816110790 814780653 817157090
646.5 817157090 820708096 820550621 818773389 820349276 823720157 823804736 821575761 822339058 826041162
664.9 826041162 827708066 825381935 825817525 829573929 831481755 829873621 829675913 833272278 835800052
683.3 835800052 834363639 833449423 836314678 838786781 836943328 834306479 835411966 837716520 836864293
701.6 836864293 835284293 837765813 842361927 843656003 842464030 844034374 848119736 849481165
717.9 849481165 847743332 848262250 851982534 853736877 852023125 851710439 854937971 857189476 855753839
736.3 855753839 854715645 857272863 859695792 858338118 856545091 858480573 861505866 861241877 859639764
754.6 859639764 861231983 864661336 865064263 863112509 863802075 867143512 868219793 866300106 866111398
773 866111398 869083345 870724201 869067311 868308127 870925069 873135805 871932268 870689750 872873545
791.4 872873545 875613928 875047684 873373985 874713302 877531886 877564371 875725091 876425266 879405677
809.7 879405677 880191505 878350496 878345132 881201506 882485092 880576134 879646242 881861985 883494198
828.1 883494198 881961167 880657792 882718384 885241449 884663820 883278310 884835243 887469113 887115777
846.4 887115777 885053396 885548353 888017952 888249338 886286020 886291504 888764322 889548600 887472153
864.8 887472153 886464000 888187170 888923883 886599481 884816229 886375487 888266921 887225509 885620534
883.1 885620534 886817217 888795912 887962461 885874569 886395991 888560534 888417244 886431813 886570215
901.5 886570215 888848603 889329135 887379646 886697233 888425648 889052212 886938572 885407329 886645615
919.8 886645615 887769878 886307418 884792328 885963798 887620807 886685669 884856820 885395288 887098193
938.2 887098193 886562884 884469092 884299695 885875344 885646641 883247972 882158935 883317411 883495152
956.6 883495152 881289899 879687130 880514860 881084144 879184425 877146780 877477229 878218055 876611114
974.9 876611114 874117911 873661578 874285758 873014390 870463014 869792044 870944858 870778620 868813574
993.3 868813574 868018627 869244456 869568884 867620945 866063893 866646349 867007732 865052879 862751722
1011.6 862751722 862457454 862568498 860525072 857599556 856608510 856824219 855433226 852772474 851728320
1030 851728320 852443278 852109730 850163639 849209487 850078464 850201249 848256469 846559346 846850395
1048.3 846850395 847247660 845824003 844190180 844534099 845540643 844792604 843253553 843458891 844780087
1066.7 844780087 844591498 843055308 842732310 843857467 843968868 842532754 841965020 843213081 844001532
1085 844001532 842927396 841941297 842679918 843418002 842246652 840590954 840577781 841161847 840242863 838703811
1105.4 838703811 838777006 839908600 839718282 838295937 838024199 839220047 839573264 838371694 837795973
1123.8 837795973 839006484 840235353 840274155 840693533 842727661 844733059 844867468 844209015 844674408
1142.2 844674408 845434546 844454587 842316151 841276646 841297567 840307295 838189423 837080538 837465346
1160.5 837465346 837359428 835987449 835108995 835778773 836592913 836544514 837040007 839219511 841558158
1178.9 841558158 842183828 841916978 842652500 843957424 844028652 843113482 843070507 843900442 843669534 842045069
1199.3 842045069 840971649 841241002 841272771 840196848 839451611 840026975 840455830 839299440 837672710
1217.6 837672710 837186694 837052405 835637867 833550155 832550466 832344890 831239522 829368293 828526735
1236 828526735 828958154 828977346 828052998 827730894 828788400 829747021 829532325 829388201 830436230 831494510
1256.4 831494510 831241846 830633640 831189096 832297444 832386792 831818521 832227409 833482385 833892822
1274.7 833892822 833341956 833452940 834565878 835178137 834770858 834776163 835921347 836804271 836348355 835706770
1295.1 835706770 836092293 836526752 835697711 834472299 834410250 834979534 834602714 833631039 833759487 834977388
1315.5 834977388 835647821 835426152 835775912 837154508 838048398 837700605 837447405 838235795 838993132
1333.9 838993132 838761032 838474095 839149654 839912772 839756548 839474797 840311706 841659725 841959417
1352.2 841959417 841440856 841618240 842596412 842827559 841399729 839437366 838291943 837693274 837404549
1370.6 837404549 838103771 839402080 839531124 837906837 835648894 834136188 833797097 833984792 834445536
1388.9 834445536 835983574 838220179 839131594 838269889 837259471 836510420 835244536 833115757 831189394
1407.3 831189394 830239296 829240441 827649653 826751053 827174902 827076316 825363517 823549569 822434008
1425.7 822434008 821371019 819051087 815736711 813312352 811405838 808146775 804659009 802570045
1442 802570045 801652908 800849319 799615204 798995614 800086021 802755117 806699872 810593247 813392580
1460.3 813392580 816075444 818355918 819771051 821960688 826196969 831291378 834814906 836895704
1476.6 836895704 838114321 837760031 835807979 833515704 831239581 827158272 820225656 813338935
1493 813338935 807827890 801863968 794926405 788909793 785039544 781733513 774922550 766355515 759590924
1511.3 759590924 754225492 750064671 747325122 746456385 746253550 744617462 741846859 739103317 737357080
1529.7 737357080 736470103 735361516 734705925 736281097 739614308 741884708 743782341 747254789 752390206
1548 752390206 758700132 765753090 773979664 783327043 793734372 801871002 806309521 811161935
1564.3 811161935 816568613 821255565 825030565 827984810 830665946 831903398 831078291 830040812
1580.7 830040812 828643143 825948477 822207034 818120241 813401222 807498634 800665319 793871105
1597 793871105 787231266 779803813 771424174 763036191 754943669 746251166 737094820 728938341 721517503
1615.3 721517503 712971210 704893112 698039353 690687180 682817757 674648046 666346133 659498632
1631.6 659498632 653840661 646537423 638385057 632171035 627685130 624359608 621268868 618160427
1648 618160427 616587758 616491258 615869641 615294993 616486430 619418263 623276770 627327561 631802022
1666.3 631802022 637508750 643538654 648664296 654376268 660804689 666774035 672954261 680735886
1682.6 680735886 690151632 697959721 704832077 713024080 722300470 733580709 745840728 757509887
1699 757509887 769928515 780191302 788832545 797179103 804478943 811359048 817872524 823841989
1715.3 823841989 829194903 832912385 835271895 837418020 839853346 842768073 845891535 848687649
1731.6 848687649 851193845 852988303 854435980 855994701 857412815 859215438 861645579 864029944
1747.9 864029944 865785062 867110848 868572474 870116234 871306539 872578979 874105096 875099599
1764.2 875099599 875824451 877052009 878872633 880141377 879952967 879619777 880253136 881262481 881718159
1782.6 881718159 881854475 882423759 883633256 884864450 885237157 885184050 885690331 886361420 886512876
1800.9 886512876 886487782 886882305 887445688 887715280 887827873 888138413 888543963 888632536 888623357 889161885
1821.3 889161885 890128076 890675068 890806019 891120315 891266823 890990198 890731275 890902281 891542196 892318904
1841.7 892318904 892685831 892500103 892393470 892408431 892192841 892054260 892378211 892791688 892767310 892566442
1862.1 892566442 892905951 893784940 894217849 893685400 893193364 893302262 893395305 893175364 893117964 893428802
1882.5 893428802 893637598 893562675 893616736 893903255 894090474 893918991 893576980 893589079 893864810 893843174
1902.9 893843174 893628061 893791914 894199252 894168615 893787086 893839240 894344389 894467831 894105852 893866062
1923.3 893866062 893964112 894064367 893823981 893529594 893595636 893758237 893617749 893478096 893737793 893967628
1943.7 893967628 893669188 893155694 893014967 893254697 893298686 892962754 892781019 893016815 893162310 892924786
1964.1 892924786 892722249 892832220 892915785 892665565 892374754 892483771 892754257 892620385 892228425 892185152
1984.5 892185152 892475903 892527640 892281532 892202914 892365277 892345428 891985476 891762733 891939700 892035782
2004.9 892035782 891730547 891469359 891659558 891940653 891817808 891506493 891504765 891687453 891565859 891219199
2025.3 891219199 891215861 891535819 891564667 891222835 891088903 891353011 891507268 891270876 891078234 891284883
2045.7 891284883 891494870 891312361 891104281 891309559 891577244 891415536 891141295 891298473 891661108 891633272
2066.1 891633272 891312540 891267121 891517758 891569793 891349912 891351223 891723692 891970456 891818881 891701460
2086.5 891701460 891954899 892203033 892081380 891921461 892138720 892466128 892404199 892161727 892284513 892624497
2106.9 892624497 892634869 892392457 892456591 892850339 893039882 892863095 892766058 893001914 893198192 893051326
2127.3 893051326 892917097 893163502 893461704 893407583 893248260 893396378 893694818 893705666 893505931 893586516
2147.7 893586516 893950224 894072533 893867016 893838942 894138992 894302011 894115329 894004107 894267678 894517004
2168 894517004 894377649 894197464 894384086 894665182 894621670 894443631 894581616 894910634 894918203 894661307
2188.4 894661307 894665956 894960761 895065069 894865632 894837379 895175278 895385087 895179152 894996107 895175517
2208.8 895175517 895374775 895233929 895032108 895192504 895493031 895434856 895174086 895250857 895585060 895634413
2229.2 895634413 895388246 895358860 895670235 895829260 895595789 895423234 895603776 895759344 895606279 895478189
2249.6 895478189 895700216 895974159 895874560 895639062 895735323 895995200 895973444 895759404 895810604 896118701
2270 896118701 896172881 895884395 895776927 896010220 896093190 895838857 895735741 896031439 896273792 896126211
2290.4 896126211 895937502 896106422 896379769 896346569 896226227 896443367 896834671 896950126 896829665 896925509
2310.8 896925509 897288561 897447586 897346616 897512376 898054659 898407161 898302376 898185074 898399889 898628175
2331.2 898628175 898517251 898391008 898639143 898956299 898826897 898368299 898027718 897924721 897990525 898273170
2351.6 898273170 898851156 899552345 899950325 899851203 899559677 899312437 898957372 898399949 897915244 897680402
2372 897680402 897358119 896711707 896090806 895818353 895681441 895355284 894976974 894925177 895112872 895092726
2392.4 895092726 894821227 894701004 894839406 894869506 894654512 894532025 894679725 894766748 894545197 894315243
2412.8 894315243 894365788 894459069 894315541 894124746 894170165 894296467 894176781 893913567 893829226 893904865
2433.2 893904865 893872082 893664777 893547416 893669367 893749833 893568993 893378973 893417418 893465936 893293500
2453.6 893293500 893110514 893173218 893275857 893128157 892889023 892842174 892893255 892789125 892584026 892531812
2474 892531812 892616391 892557204 892327726 892203331 892244697 892207265 891995072 891851962 891940176 892031431 891896904
2496.4 891896904 891682982 891627073 891683400 891616881 891430795 891390622 891511321 891520381 891358972 891260326 891325414
2518.9 891325414 891332805 891136825 890974641 891039908 891119003 891001999 890836716 890812457 890836656 890751064 890607834
2541.3 890607834 890566587 890612066 890546918 890326560 890168130 890179634 890156448 889980614 889850259 889881670 889881313
2563.7 889881313 889704704 889515877 889472008 889461339 889324546 889127493 889066219 889115989 889058590 888858914
2584.1 888858914 888706088 888695419 888655961 888461471 888294458 888314307 888331950 888141930 887903214 887842417
2604.5 887842417 887866139 887745321 887522757 887453258 887524962 887469888 887268841 887180924 887253284 887212932 886975586
2626.9 886975586 886835515 886935294 887002945 886837065 886621654 886566043 886560440 886416972 886247337 886263669 886371553
2649.4 886371553 886309981 886105537 886018574 886043072 885932148 885702670 885623932 885720313 885695219 885448396 885256112
2671.8 885256112 885255754 885234594 885051310 884862840 884829640 884820819 884622216 884323716 884204924 884222686 884083450
2694.3 884083450 883831084 883754909 883804739 883658528 883292377 883028448 882992268 882892549 882552147 882258773
2714.6 882258773 882219970 882187605 881938338 881638229 881531239 881491482 881240726 880923033 880855262 880943716
2735 880943716 880834103 880481720 880224288 880196810 880171835 880023956 879881322 879835606 879719555 879383266
2755.4 879383266 879031360 878883064 878764749 878484368 878205717 878130555 878127754 877942085 877634227 877409875
2775.8 877409875 877223790 876930535 876583457 876388609 876365066 876246750 875881493 875468433 875206053 875004053
2796.2 875004053 874708235 874363959 874100864 873873174 873534858 873139799 872829676 872523069 872081399 871624887
2816.6 871624887 871354580 871186078 870862067 870368659 869930565 869600832 869178712 868564665 867916942 867322624
2837 867322624 866434872 864907801 862994850 861086965 859137774 857013941 854993284 853511333 852596998
2855.4 852596998 851877809 851001680 849847496 848307908 846255898 843959689 842133641 841271102 841116846
2873.7 841116846 841247737 841738045 842691541 843760133 844509840 844860375 844977438 844862401 844321370
2892.1 844321370 843377411 842297018 841178238 839948177 838625908 837297499 835932970 834364235
2908.4 834364235 832543314 830587387 828482747 826131403 823627353 821264088 819310129 817738473
2924.7 817738473 816422582 815471888 814995885 814963400 815331459 816091001 817255259 818636417 819690168
2943.1 819690168 819893539 819175661 817784548 815925896 813746750 811668694 810330033 809998393 810490012
2961.4 810490012 811673760 813582420 816020072 818624914 821349978 824275136 827175677 829815567
2977.8 829815567 832259834 834639788 836977839 839187682 841193497 843100667 844894230 846291363
2994.1 846291363 847221196 847852528 848330140 848722160 848926902 848930120 848996162 849199653 849219084 848892808
3014.5 848892808 848452687 848035634 847499669 846812069 846125364 845509529 844938457 844383359 843928516 843585551
3034.9 843585551 843147159 842613757 842193484 841874003 841443241 840801001 840100348 839546323 839128792 838651359
3055.3 838651359 838029981 837480247 837187052 837014854 836844265 836722672 836649656 836602926 836593628 836674333
3075.6 836674333 836850941 836943090 836810768 836567640 836385667 836319506 836286306 836168647 836048484 836027861
3096 836027861 835933149 835572064 835044444 834608495 834291339 833873630 833326936 832890570 832575321 832073450
3116.4 832073450 831304669 830415368 829404116 828246474 827112377 826174140 825289547 824184954 822923422
3134.8 822923422 821831048 820881248 819653988 818085015 816555977 815222383 813953102 812613666
3151.1 812613666 811043501 809282601 807539105 805774271 803953528 802228153 800563693 798742771
3167.4 798742771 796757519 794840395 793030024 791130126 789109170 787158132 785343647 783497989
3183.7 783497989 781538427 779608130 777803004 776023984 774208724 772467017 770866334 769298673
3200.1 769298673 767682970 766122460 764747739 763482690 762152255 760781527 759530663 758380473
3216.4 758380473 757110596 755648136 754197836 752882004 751536965 750036716 748550594 747184217
3232.7 747184217 745640278 743728161 741735637 739888966 738051593 736112773 734154105 732186735
3249 732186735 730130613 727977395 725787818 723648608 721576214 719496608 717378914 715303779 713355660
3267.4 713355660 711470187 709503531 707464874 705466092 703489304 701491475 699559748 697772443
3283.7 697772443 696068943 694358230 692698419 691142917 689597189 687969983 686292291 684711814
3300 684711814 683268726 681869566 680441320 678922892 677330256 675728202 674165606 672663927 671179593
3318.4 671179593 669660807 668105960 666553617 664986014 663342237 661660612 660037816 658517540
3334.7 658517540 657016695 655356765 653521538 651687980 649924278 648189068 646487296 644730270
3351 644730270 642840385 640907645 638981760 637069464 635163486 633250415 631410599 629658937 627842665
3369.3 627842665 625813603 623657286 621626854 619827330 618167996 616534889 614937186 613460481
3385.7 613460481 612166822 611031175 609825075 608344555 606854618 605762005 604907870 603774190
3402 603774190 602323771 601004243 599962234 599039793 598186195 597354054 596535087 595885575 595425308
3420.3 595425308 595049083 594771862 594666541 594784021 595026076 595375657 595901608 596376061 596648991 597025573
3440.7 597025573 597729743 598649740 599670827 600703299 601743817 602902591 604282081 605880082 607544303
3459.1 607544303 609074295 610585034 612436175 614512384 616293907 617694974 619183004 620984495
3475.4 620984495 623016179 625126302 627054274 628885210 630898416 633008718 635111511 637315810
3491.7 637315810 639627099 641933680 644145548 646420181 648857892 651078105 653010130 655113339
3508 655113339 657444835 659789383 662096322 664333165 666571319 668968439 671617150 674277663 676662147
3526.4 676662147 678865969 681041300 683342397 685921669 688542247 690974593 693599761 696663558
3542.7 696663558 699777126 702448487 704793334 707281530 709903479 712508380 715295196 718365192
3559 718365192 721492589 724603236 727970541 731471121 734433889 737009585 739880264 743186653 746664345
3577.4 746664345 750161171 753753006 757599354 761661530 765423954 768560410 771662951 775184274
3593.7 775184274 778833568 782359183 785853267 789258063 792533636 795943499 799608111 803167045
3610 803167045 806480050 809672594 812783480 815993786 818969846 821303964 823659658 826663733 830060422
3628.4 830060422 832634211 834260941 835906029 837666810 839403689 841276586 843390584 845833123
3644.7 845833123 848652422 851307929 852588475 852777898 853291094 854398310 855378151 856074691 856822133
3663 856822133 857880831 859324992 860918939 862090766 862946212 863736689 863777637 863384306 863394618 863995075
3683.4 863995075 865231395 867032170 868418217 868514001 868207216 868296087 868747294 869380355 869941294
3701.8 869941294 870159924 870402038 871152818 872139990 872487903 872076213 871775746 871928275 872344136 872768164
3722.2 872768164 872978926 872980654 873077273 873682678 874827623 875768721 875743270 875106215 874704659 874939978
3742.6 874939978 875471234 875658095 875799358 875850976 875208437 874486208 874303579 874312818 874088049 873887599
3763 873887599 873997092 874225914 874306560 874038041 873614907 873568892 874003232 874377787 874239385 873961985
3783.4 873961985 873789549 873554289 873416722 873542964 873880982 874365926 874830663 875242412 875441194 875147998
3803.8 875147998 874744594 874330223 873846292 873739004 874223113 874957144 875490904 875760734 875417709 874611914
3824.2 874611914 874139726 874051094 874175131 874562919 875160158 875690579 875668049 875107050 874522686 874014318
3844.6 874014318 873657584 873822153 874615550 875435174 875165105 874198794 873623967 873677433 874021888 874167562
3865 874167562 874153256 874273062 874271631 873930216 873502195 873288155 873445332 873645604 873694897 873686373 873419344
3887.4 873419344 873144627 873046994 872816086 872666836 872954726 873477638 873804867 873662531 873033702 872305632
3907.8 872305632 871907473 871852160 871960998 872191131 872394621 872347832 872186840 872138560 872131824 872090518 872059643
3930.2 872059643 872001588 871884704 871780157 871728003 871714115 871706128 871685982 871720433 871739149 871623993 871517003
3952.7 871517003 871480882 871421874 871387124 871421933 871402085 871279120 871205389 871285677 871414244 871442854 871417105
3975.1 871417105 871434331 871473968 871532261 871576786 871510804 871397793 871377528 871444404 871507943 871466577 871322453
3997.5 871322453
##END=$$ End of the data block
