##TITLE=Microcapsulas de Zeina mais ext alcoolico $$ Begin of the data block
##JCAMP-DX=5.00 $$ ACD/SpecManager v 10.08
##SPECTROMETER/DATA SYSTEM=Alpha
##DATE=17 Dec 2013 14:46:08
##DATA TYPE=INFRARED SPECTRUM
##DATA CLASS=XYDATA
##ORIGIN=
##OWNER=
##NPOINTS=1765
##FIRSTX=399.75695801
##LASTX=3997.56933594
##MAXX=3997.56933594
##MINX=399.75695801
##MAXY=0.88953936
##MINY=0.53229380
##XFACTOR=1.0000000000
##YFACTOR=1.000000000000000e-9
##FIRSTY=0.81741971
##DELTAX=2.03957629
##XUNITS=1/CM
##YUNITS=ARBITRARY UNITS
##XYDATA=(X++(Y..Y))
399.8H17419708M990935K775788L66867r08852j057565n94675r27270l840566n949556
$$ 817419708 822410643 825186431 825553298 824644446 823586881 822992206 822064936 818224370 812274814
418.1H12274814j073957L423155K792835J772523N91576m09544m49776m93944p38084
$$ 812274814 811200857 814624012 817416847 819189370 819780946 819371402 818921626 818427682 817689598
436.5H17689598j101971j752138j590550p51734q47697j065314r28938j065612k066493
$$ 817689598 816587627 814835489 813244939 812493205 811645508 810580194 809651256 808585644 806519151
454.8H06519151k961934p47561J750588J114249n52058j279533r36150o50466q9168
$$ 806519151 803557217 802809656 804560244 805674493 805122435 803842902 802906752 802256286 802167118
473.2H02167118P83264R18091M50968q38518j784861n65410R47297J81437j278580
$$ 802167118 802950382 803868473 804319441 803480923 801696062 801130652 802077949 802259386 800980806
491.5H00980806p16924Q35597O64771j474738k583742q75295M15743m45187j402378
$$ 800980806 800263882 801099479 801764250 800289512 797705770 796830475 797246218 796801031 795398653
509.9G95398653j139164o59228j245200j778484q95381L19243J53005o67453o24895
$$ 795398653 794259489 793600261 792355061 790576577 789681196 790000439 790153444 789485991 788861096
528.3G88861096O5923O46293N4359j171171j089514K32935N84960r62734j888335n55038
$$ 788861096 788927019 789573312 789627671 788456500 787366986 787599921 788184881 787222147 785333812 784778774
548.6G84778774P48932L0220j252055r50695L70801M75585q59260j351953j39594Q55208
$$ 784778774 785527706 785557926 784305871 783355176 783725977 784201562 783342302 781990349 781850755 782705963
569G82705963J19149j144707p88987O67632P52747l02851m91560L31581P83086m77
$$ 782705963 782825112 781680405 780891418 781559050 782311797 782008946 781517386 781848967 782632053 782631576
589.4G82631576o88612O4671J032173P73847j40667k61128M99130Q32498J66714m55916
$$ 782631576 781942964 782007635 783039808 783813655 783672988 783411860 783910990 784743488 784910202 784454286
609.8G84454286n5313P60913Q35657J66357J8239Q70704J398146R03726M00186P32302
$$ 784454286 784398973 785159886 785995543 786161900 786180139 787050843 788448989 789352715 789752901 790485203
630.2G90485203J418770J322090N07236L79681J294375J862347J272201M28141N36918
$$ 790485203 791903973 793226063 793733299 794112980 795407355 797269702 798541903 798970044 799506962
648.6G99506962J370609J458764M96447j01864O11424J487434J111925L30925O71863
$$ 799506962 800877571 802336335 802832782 802730918 803342342 804829776 805941701 806272626 806944489
666.9H06944489J623810J050830K97129L71277J215041J808345J198232L14176N61238
$$ 806944489 808568299 809619129 809916258 810287535 811502576 813310921 814509153 814823329 815384567
685.3H15384567J380801J224339L6597p99298n00023N3584m4346k11298P44104K484322
$$ 815384567 816765368 817989707 818026304 817227006 816726983 816780567 816736221 816524923 817269027 819753349
705.7H19753349L111362K129853J346946J857161K365470J579523M46737O45757J668990
$$ 819753349 822864711 824994564 826341510 828198671 830564141 832143664 832590401 833236158 834905148
724H34905148J718044P02679K99513J168609J780152R84609l3557K28703J129746J147032
$$ 834905148 836623192 837325871 837625384 838793993 840574145 841558754 841525197 841753900 842883646 844030678
744.4H44030678K94566K4379R00328J640618J115620K57611O25551J692474J687288
$$ 844030678 844325244 844349623 845249951 846890569 848006189 848263800 848889351 850581825 852269113
762.8H52269113N98371J59502R72271J613259Q84951j68562J31905J254022J384675
$$ 852269113 852867484 853026986 853999257 855612516 856497467 856328905 856460810 857714832 859099507
781.2H59099507M28796Q2851R63568J588345Q75771o1631K01165J126171J170277K90156
$$ 859099507 859528303 859611154 860574722 862163067 863038838 862977207 863178372 864304543 865474820 865764976
801.6H65764976j46211M51208J185834R73523J69336J69039J070261J307368L03150
$$ 865764976 865618765 866069973 867255807 868229330 868398666 868567705 869637966 870945334 871248484
819.9H71248484m86315J02342J008391O26504m05550j39534J218498J558125N88297
$$ 871248484 870762169 870864511 871872902 872499406 872093856 871954322 873172820 874730945 875319242
838.3H75319242M6254P23362J421511Q44240l46303m85063M99070J018882L62933k49327
$$ 875319242 875365496 876088858 877510369 878354609 878008306 877523243 878022313 879041195 879404128 879154801
858.7H79154801K26140Q86619M66943n61177p51913l457L02791l29017o26207K85805
$$ 879154801 879380941 880267560 880734503 880173326 879421413 879417956 879720747 879391730 878765523 879051328
879.1H79051328J214564P76112l06368l91126N06103Q12471l636n54144N4717Q04007
$$ 879051328 880265892 881042004 880735636 880344510 880850613 881663084 881659448 881105304 881160021 881964028
899.4H81964028M68194m57644m81069L30388M80533m15564j079619o02722R5785j34349
$$ 881964028 882432222 881974578 881493509 881823897 882304430 881888866 880809247 880206525 880302310 880167961
919.8H80167961p34508m50551N24520P84576p033n21362O3837P29978L62337m50910
$$ 880167961 879433453 878982902 879507422 880291998 880284965 879763603 879827440 880557418 880919755 880468845
940.2H80468845m71890J57059K39193m31955q13186l80278J00553j60694p37488p20203
$$ 880468845 879996955 880154014 880393207 879961252 879148066 878767788 878868341 878707647 877970159 877249956
960.6H77249956k07901p3790n69284r61721p05839l00645m05133q18432q76486n25296
$$ 877249956 877042055 876968265 876398981 875437260 874731421 874430776 874025643 873207211 872330725 871805429
981H71805429l75509o39081q16285n67079j86741j46211m01556m87864l22223k72214
$$ 871805429 871429920 870790839 869974554 869407475 869220734 869074523 868672967 868185103 867862880 867590666
1001.4H67590666n16951q28684r30667q90016r94384j314283j598894j614750j481950
$$ 867590666 867073715 866245031 865314364 864424348 863429964 862115681 860516787 858902037 857420087
1019.8H57420087j490057j604318j545787j262844r50157q16584q58426q55684p33793
$$ 857420087 855930030 854325712 852779925 851517081 850566924 849750340 848891914 848036230 847302437
1038.1H47302437p10190r21607j062274q53240n40376m77731o31571o30200l52263
$$ 847302437 846592247 845670640 844608366 843755126 843214750 842737019 842105448 841475248 841122985
1056.5H41122985j75119l77893o25074m85837k35320l72707p68245q81672n73873l00050
$$ 841122985 840947866 840569973 839944899 839459062 839223742 838851035 838082790 837201118 836627245 836327195
1076.9H36327195l98159n27859k76386Q1837M232m81010p45475n29647m10139p40469
$$ 836327195 835929036 835401177 835124791 835206628 835210860 834729850 833984375 833454728 833044589 832304120
1097.3H32304120j024604p48455j72437M8459j06275j48058j9133p1406l89934o45578
$$ 832304120 831279516 830531061 830358624 830407083 830300808 830152750 830133617 830062211 829672277 829026699
1117.7H29026699n91695l89040l52204l84390o318P64847J228213J034141O41703M52638
$$ 829026699 828435004 828045964 827693760 827309370 827303052 828067899 829296112 830330253 830971956 831424594
1138.1H31424594K91347j29640p19845j096606j161158j193285j298428j295805j087725
$$ 831424594 831715941 831586301 830866456 829769850 828608692 827415407 826116979 824821174 823733449
1156.4H23733449p98702o13332n81026o13392o26087n31375k19584L53277J056194
$$ 823733449 822934747 822321415 821740389 821126997 820500910 819969535 819749951 820103228 821159422
1174.8H21159422J480997J362205Q78989K75553j91093k42829o2585r4712l42131n44369
$$ 821159422 822640419 824002624 824881613 825157166 824966073 824723244 824660659 824565947 824223816 823679447
1195.2H23679447o37173p53344r80258j123488r28819n57780m58240p30336r90570
$$ 823679447 823042274 822288930 821308672 820185184 819256365 818698585 818240345 817510009 816519439
1213.5H16519439j034915j140356j478792j780688j722336j457334j454234j694977
$$ 816519439 815484524 814344168 812865376 811084688 809362352 807905018 806450784 804755807
1229.9H04755807j657784j185000p63357p34746p23899k71022L86536O23822M38393
$$ 804755807 803098023 801913023 801149666 800414920 799691021 799419999 799806535 800430357 800868750
1248.2H00868750M44114P70271Q79347M59611q94J88291P03454O40929J36137L6657
$$ 800868750 801312864 802083135 802962482 803422093 803421199 803609490 804312944 804953873 805090010 805126667
1268.6H05126667N21481R07660O25491J60157K47539O27458N59389J15633R3460O27399
$$ 805126667 805648148 806555808 807181299 807341456 807588995 808216453 808775842 808891475 808984935 809612334
1289H09612334Q27014K81751k52485j77264O7174j63614o24478o28054j36435J20997
$$ 809612334 810439348 810721099 810468614 810291350 810358524 810194910 809570432 808942378 808805943 808926940
1309.4H08926940j88589k02954M06563Q95024J096844J055599Q93533R32515P92503
$$ 808926940 808738351 808535397 808941960 809836984 810933828 811989427 812882960 813815475 814607978
1327.8H14607978K44200j63674k73228o95348j182914k08139J585662J931489J166642
$$ 814607978 814852178 814688504 814415276 813719928 812537014 812328875 813914537 815846026 817012668
1346.1H17012668N49435M15981N60224O00398L35812o84023k159237k078593n74768
$$ 817012668 817562103 817978084 818538308 819138706 819474518 818790495 816631258 814552665 813977897
1364.5H13977897o58154r98617p5459M4286J95742Q00192q285j399696k527892l301680
$$ 813977897 813319743 812321126 812245667 812289953 812485695 813285887 813277602 811877906 809350014 806048334
1384.9H06048334j906097J735449K480268l25799j704931o74367L45409N48005j108587
$$ 806048334 804142237 805877686 808357954 808032155 806327224 805652857 805998266 806546271 805437684
1403.2H05437684k144813j152456j099408j650214j937866l312827m638612j711964
$$ 805437684 803292871 802140415 801041007 799390793 797452927 794140100 789501488 787789524
1419.5G87789524J974642J132727m08948k056539l603280l612935n028069o828547
$$ 787789524 789764166 790896893 790487945 788431406 784828126 781215191 776187122 769358575
1435.9G69358575l169655N32567p13587k554297l348887k218902J14798M351k537369
$$ 769358575 766188920 766721487 766007900 763453603 760104716 757885814 758000612 758004963 755467594
1454.2G55467594k424002O498396J1280835O201506K317011L659368L452420O3956
$$ 755467594 753043592 759541988 770822823 777024329 779341340 783000708 786453128 786517084
1470.5G86517084R08792O681800Q321940N239487J086235j920759m882396q782923
$$ 786517084 787425876 794107676 802429616 807669103 808755338 806834579 801952183 793169260
1486.8G93169260j0214567o813407m950583q811176j1333167p284761m551172p898450
$$ 793169260 782954693 776141286 771190703 762379527 751046360 743761599 739210427 731311977
1503.2G31311977j5115082j4963746l462375j349568n475879p877826o394446l738582
$$ 731311977 716196895 701233149 697770774 696421206 690945327 683067501 676673055 672934473
1519.5F72934473j885713O74963P64728P7665n07236k910852k723098o82950l654718
$$ 672934473 671048760 671723723 672488451 672566116 672058880 669148028 666424930 665741980 662087262
1537.8F62087262n079627L794670J0119974J0442555Q725763P666170P557094O174088
$$ 662087262 657007635 660802305 670922279 681364834 690090597 697756767 705313861 711487949
1554.1G11487949K601385L704906J7330169J8497646J1004806O718993M647016O272912
$$ 711487949 714089334 717794240 735124409 753622055 764626861 771345854 775992870 782265782
1570.5G82265782O032050J401126J235962M740715K924919o83009k578497l918171
$$ 782265782 788297832 789698958 790934920 795675635 798600554 797917545 795339048 791420877
1586.8G91420877n377710o631911p428884p788599p831335q353650r307623r751857
$$ 791420877 786043167 779411256 771982372 764193773 756362438 748008788 738701165 728949308
1603.1G28949308r923756j0389685j0518194r956717j0491967j2442291j0987103o562650
$$ 728949308 719025552 708635867 698117673 688160956 677668989 665226698 654239595 647676945
1619.4F47676945p690788j0008394q642793p838964p792235q350730j1490166j2377799
$$ 647676945 639986157 629977763 621334970 613496006 605703771 597353041 585862875 573485076
1635.7E73485076n662381k352178m335106p159292q752168m946410k192378n040229
$$ 573485076 567822695 565470517 561135411 553976119 545223951 540277541 538085163 533044934
1652E33044934p51137P028818N253195K097607K015233M405499L935396K131105M358649
$$ 533044934 532293797 539322615 544575810 546673417 548688650 553094149 557029545 559160650 563519299
1670.4E63519299O466508O347179P766486P636010M426360K422274P999241J3994574
$$ 563519299 569985807 576332986 584099472 591735482 596161842 598584116 606583357 620577931
1686.7F20577931J2492955J1248708R018361P311464Q839488J1009097J6650975J7294526
$$ 620577931 633070886 644319594 653337955 660649419 669488907 680498004 697148979 714443505
1703G14443505J3515889J3537765J2566805Q640349M159331J368106M358172J0540605
$$ 714443505 727959394 741497159 754063964 762704313 766863644 768231750 772589922 783130527
1719.3G83130527R934783O131470M261076K638757M26054j775026o65903N420685N581319
$$ 783130527 793065310 799196780 803457856 806096613 806522667 804747641 804081738 809502423 815083742
1737.7H15083742K550781K835810L322721J975715N11467J758278N545795N651831
$$ 815083742 817634523 820470333 823793054 825768769 826280236 828038514 833584309 839236140
1754H39236140K873838J777947J306832J947701L230929J272858j536727k410174J61529
$$ 839236140 842109978 843887925 845194757 847142458 850373387 851646245 850109518 847699344 847860873
1772.4H47860873M640758M509747J646817O61015J287878J463055J222015m64023k579271
$$ 847860873 852501631 857011378 858658195 859319210 860607088 862070143 863292158 862828135 860248864
1790.7H60248864m13180L186047K270878R9599N10275K186001K093494N97059l48567
$$ 860248864 859835684 863021731 865292609 865392208 865902483 868088484 870181978 870779037 870430470
1809.1H70430470L37362J495421J274287O28412N52237j55687j415312j218081n94079
$$ 870430470 870767832 872263253 873537540 874165952 874718189 874562502 873147190 871929109 871335030
1827.4H71335030j35243K143204K808452J061797L33488p8380j995028k439558J055598
$$ 871335030 871199787 873342991 876151443 877213240 877546728 877468348 875473320 873033762 874089360
1845.8H74089360L042341K041280R55045L77297J64032J17004J12355l1948p59840
$$ 874089360 877131701 879172981 880128026 880505323 880669355 880786359 880898714 880866766 880106926
1864.2H80106926k165079j865387J342356K904534J562536L92974J09911Q94o4850
$$ 880106926 877941847 876076460 877418816 880323350 881885886 882278860 882388771 882389665 882324815
1882.5H82324815r5964n44548r54389N2750Q59260M80652M69089M98175J81914P6711
$$ 882324815 882228851 881684303 880729914 880782664 881641924 882122576 882591665 883089840 883271754 883348465
1902.9H83348465n0485m52578m15385L44813N60760n87225j345992k07722N91099N36502
$$ 883348465 883297980 882845402 882430017 882774830 883335590 882748365 881402373 881194651 881785750 882322252
1923.3H82322252Q53419O43432J87755J20997M0293j01626k39432p06672j019121r9718
$$ 882322252 883175671 883819103 884006858 884127855 884168148 884066522 883827090 883120418 882101297 882001579
1943.7H82001579Q19802P10130L90708O3420k30790j67846Q3387J19269q0109m55618
$$ 882001579 882821381 883531511 883922219 883985639 883754849 883587003 883670390 883789659 883709550 883253932
1964.1H83253932n31554J56522N86509J80722q4043O3300J20878k7954j43230j08302
$$ 883253932 882722378 882878900 883465409 883646131 883562088 883625388 883746266 883718312 883575082 883466780
1984.5H83466780j25348m10736o84679j35064O90401N68151M2141j18971j2934R8765
$$ 883466780 883341432 882930696 882246017 882110953 882801354 883369505 883411646 883292675 883279741 883378506
2004.9H83378506K2173j40071j51217r9302k19583k26259P0154K29419J87754J06096
$$ 883378506 883400679 883260608 883109391 883010089 882790506 882564247 882634401 882863820 883051574 883157670
2025.3H83157670m5061j06275J1325J08063R954j81496k07543K3305K07484O9737r7632
$$ 883157670 883112609 883006334 883017659 883125722 883135676 882954180 882746637 882769942 882977426 883047163 882949531
2047.7H82949531J8835J68026N4001j25467p6771Q6129N0664j31429p2777J71185K16543
$$ 882949531 882968366 883136392 883190393 883064926 882988155 883074284 883124948 882993519 882920742 883091927 883308470
2070.2H83308470N6267p1645j2576J39355J84119L8683r6797j2577J30475J25944N126
$$ 883308470 883364737 883293092 883280516 883419871 883603990 883642673 883545876 883533299 883663774 883789718 883794844
2092.6H83794844j8596J32560K19584O7532j04130j9609K07483K08736l6538j14918
$$ 883794844 883776248 883908808 884128392 884195924 884091794 884072185 884279668 884488404 884451866 884336948
2113H84336948R6977K47479J06513p5042j2338J72853J68026k0027n9367R2328J80542
$$ 884336948 884433925 884681404 884787917 884712875 884700537 884873390 885041416 885021389 884962022 885054350 885234892
2135.4H85234892P5639p6115j1266J91748J84715k0385q6307Q9109K28345R1672j11699
$$ 885234892 885310531 885234416 885223150 885414898 885599613 885579228 885492921 885582030 885810375 885902047 885790348
2157.9H85790348m5240J74523J81257l1292j18971O8307K44558J18017j15931p3671
$$ 885790348 885745108 885919631 886100888 886069596 885950625 886018932 886263490 886381507 886265576 886191905
2178.2H86191905J46269J57178l7849j01566O0379J78218P4148p7248l8802J09672
$$ 886191905 886338174 886495352 886457503 886355937 886416316 886594534 886668682 886591434 886552632 886662304
2198.6H86662304J32800P629p2241K4438J50383R4294p3671q4102R3102J73807K5213
$$ 886662304 886795104 886802733 886730492 886754930 886905313 886999607 886925936 886841834 886934936 887108743 887133956
2221.1H87133956r9659L278J47879Q6725q7142j10626L9875J30713K5630p8618J8477
$$ 887133956 887034297 887037575 887185454 887272179 887185037 887074411 887114286 887244999 887270629 887192011 887210488
2243.5H87210488J42992O7294p4089m4823Q1301J05858K7120l3557J0371J03175R4712
$$ 887210488 887353480 887420774 887346685 887301862 887383163 887489021 887516141 887482584 887492955 887596130 887690842
2265.9H87690842j7345r1195k6464O9201J3530j08123p5221R3698J61648L3379r6798
$$ 887690842 887673497 887582302 887555838 887625039 887638569 887530446 887455225 887548923 887710571 887743950 887647152
2288.4H87647152l8505R7871J07825L7670M2319J10031J54972J12533J7643M3929J64568
$$ 887647152 887608647 887706518 887814343 887852013 887894332 888004363 888159335 888271868 888289511 888333440 888498008
2310.8H88498008J49668J4066k8193J09315K41459J34766r0242j23024O1512J00196
$$ 888498008 888647676 888661742 888633549 888742864 888984323 889119089 889028847 888905823 888967335 889067531
2331.2H89067531j19448k05040N126J94907O4314k14935l06606p8082K08497K98560
$$ 889067531 888948083 888743043 888748169 888943076 889007390 888792455 888485849 888407767 888616264 888914824
2351.6H88914824K02953J43528K02120P5936k78056m42624k34842m6372j68145l33965
$$ 888914824 889117777 889261305 889463425 889539361 889261305 888818681 888583839 888537467 888369322 888035357
2372H88035357k26736n4002j81496m10318l77775j59323l6359j07526j93596j10388
$$ 888035357 887808621 887754619 887573123 887162805 886785030 886625707 886589348 886481822 886288226 886177838
2392.4H86177838L6657K5749j22905j61171m2140K9921o6399j94192j12176Q0228N7637
$$ 886177838 886214495 886240244 886117339 885956168 885914028 885943949 885877550 885683358 885571182 885651410 885709047
2414.8H85709047j38759k04444p1466K1279q2851j83642r0837N6445L7730j47641k20954
$$ 885709047 885570288 885365844 885294378 885315657 885232806 885049164 884958327 885014772 885052502 884904861 884683907
2437.3H84683907o0141O4850l4571j82032j37568L4511N2333j25945k19166r5367L9100
$$ 884683907 884623766 884688616 884654045 884472013 884334445 884368956 884421289 884295344 884076178 883980811 884019911
2459.7H84019911l7193k13563j96755k265M1902j59324k76088j09554O7115r417j84000
$$ 884019911 883982718 883769155 883572400 883570135 883612037 883452713 883176625 883067071 883134186 883124769 882940769
2482.1H82940769j79112l0041O199j21116j80602q8573j3470n5910j33574j19269k5153
$$ 882940769 882761657 882731616 882737815 882616699 882436097 882347524 882334054 882278144 882144570 882025301 882000148
2504.6H82000148J8776o7532j45853o4194K7776k5928j38343j33812M053M8518r4533
$$ 882000148 882018924 881951392 881805539 881741345 881769121 881743193 881604850 881471038 881475091 881523609 881429076
2527H81429076j96814j05262J7583l4451j52767j34647l0279p75j19626k36988j56105
$$ 881429076 881232262 881127000 881144583 881110132 880957365 880822718 880792439 880791664 880672038 880435050 880278945
2549.4H80278945j1861m6909j93894k11179p9573j8298j24097k38895j86682n7578
$$ 880278945 880267084 880220175 880026281 879815102 879735529 879717231 879593134 879354239 879167557 879109979
2569.8H79109979p3672j75297j54138l9458m0233j73449k31386j50621n3346q3744
$$ 879109979 879036307 878861010 878706872 878667414 878627181 878453732 878222346 878071725 878018379 877934635
2590.2H77934635j95384j81020p3552n4061j37329j91629j36376p0274j08301j99080
$$ 877934635 877739251 877558231 877484679 877430618 877293289 877101660 876965284 876895010 876786709 876587629
2610.6H76587629j97112q3506j729n2154j61350j51157k9266j4663j25944j55986n4657
$$ 876587629 876390517 876307011 876305282 876253128 876091778 875940621 875911355 875896692 875770748 875614762 875560105
2633.1H75560105p451r8943j49012o1572J192n9306j32799r4533j5080k9862j21772
$$ 875560105 875552654 875453711 875304699 875243127 875244319 875185013 875052214 874957681 874942601 874912739 874790967
2655.5H74790967j79172j37270q0525j07050j57297j47164q7201n0307p9751j24395
$$ 874790967 874611795 874474525 874394000 874286950 874129653 873982489 873895288 873844981 873765230 873640835
2675.9H73640835j33753j36971j80841k18927j64211j04964j30415j63019j81079k02417
$$ 873640835 873507082 873370111 873189270 872970343 872806132 872701168 872570753 872407734 872226655 872024238
2696.3H72024238j87516j74761j99079j84000j30475j38700k21133k84433k70546k43604
$$ 872024238 871836722 871661961 871462882 871278882 871148407 871009707 870788574 870504141 870233595 869989991
2716.7H69989991k64287k76208k30014j68204j91331k79606k73525j81675j33932j63853
$$ 869989991 869725704 869449496 869219482 869051278 868859947 868580341 868306816 868125141 867991209 867827356
2737.1H67827356k25067k27094j47939j06156j62899k22385k21372k11596k42770k90632
$$ 867827356 867602289 867375195 867227256 867121100 866958201 866735816 866514444 866302848 866060078 865769446
2757.5H65769446l00169k56300k11299k47895l03626k48432j80543k24411l33071l92676
$$ 865769446 865469277 865212977 865001678 864753783 864450157 864201725 864021182 863796771 863463700 863071024
2777.9H63071024l36468k59101k83778l25858k65658k40982l47793m24802l61562k88725
$$ 863071024 862734556 862475455 862191677 861865819 861600161 861359179 861011386 860586584 860225022 859936297
2798.3H59936297l61323m38631m22359l86416l42131l87609m85778m41074l41595l38792
$$ 859936297 859574974 859136343 858713984 858327568 857985437 857597828 857112050 856670976 856329381 855990589
2818.7H55990589l89576m47989m70698m41551m77135n94616o76274p16925q49485j258433
$$ 855990589 855601013 855153024 854682326 854240775 853763640 853169024 852492750 851775825 850926340 849667907
2839.1H49667907j834512k225041k445400k705813k883672k645314k011061j384198
$$ 849667907 847833395 845608354 843162954 840457141 837573469 834928155 832917094 831532896
2855.4H31532896r82047r21428j312494j980662k624631k886474k427042j367152k89619
$$ 831532896 830550849 829629421 828316927 826336265 823711634 820825160 818398118 817030966 816741347
2873.7H16741347M49360R92000J378298J413643J100719O08802J34289k32756n84662
$$ 816741347 817190707 818182707 819561005 820974648 822075367 822684169 822818458 822585702 822001040
2892.1H22001040r57370j301467j570761j684964j716077j857281k081275k253592
$$ 822001040 821043670 819742203 818171442 816486478 814770401 812913120 810831845 808578253
2908.4H08578253k435267k740860l086567l274500l280223l188431k941787k466858
$$ 808578253 806142986 803402126 800315559 797041059 793760836 790572405 787630618 785163760
2924.7G85163760j812160j171946p57456l35574L94404J121342J506328J574517J236558
$$ 785163760 783351600 782179654 781422198 781086624 781481028 782602370 784108698 785683215 786919773
2943.1G86919773L65913q38340j990914k748251l002465k731740j881123o59645O35863
$$ 786919773 787285686 786447346 784456432 781708181 778705716 775973976 774092853 773433208 774069071
2961.4G74069071J794457K620876L106058L410876L647506L742635L603697L447056
$$ 774069071 775863528 778484404 781590462 785001338 788648844 792391479 795995176 799442232
2977.8G99442232L418266L261626K963245K761662K676129K605200K331555J806677
$$ 799442232 802860498 806122124 809085369 811847031 814523160 817128360 819459915 821266592
2994.1H21266592J321375R76503O98447M72009K49207O8188J9252L7074n4359k78473
$$ 821266592 822587967 823564470 824262917 824734926 824984133 825052321 825071573 825108647 825054288 824775815
3014.5H24775815m64499n59270o64235q11874r46761r64403q69214p66099o25431m87387
$$ 824775815 824311316 823752046 823087811 822275937 821329176 820364773 819495559 818729460 818104029 817616642
3034.9H17616642m39704m39823n21004o69837p51197p27534o70135o46770o95408p19190
$$ 817616642 817176938 816737115 816216111 815546274 814795077 814067543 813397408 812750638 812055230 811336040
3055.3H11336040o26146n45621m89176l33249j08421M9591M2617k861O7413J77205
$$ 811336040 810709894 810164273 809675097 809341848 809233427 809283018 809325635 809322774 809390187 809567392
3075.6H09567392J74105M4584J848Q1301P3254L0875M2737r478j23322j39892q8453
$$ 809567392 809741497 809786081 809787929 809869230 809942484 809973359 810016096 810006618 809883296 809743404 809654951
3098.1H09654951j41621k40623l15488l82960m37021n35607n99444n87762o21497p32482
$$ 809654951 809513330 809272707 808957219 808574259 808137238 807601631 807002187 806414425 805792928 805060446
3118.5H05060446r41336j147568j181007j102209j062512j212835j414359j349449
$$ 805060446 804119110 802971542 801790535 800688326 799625814 798412979 796998620 795649171
3134.8G95649171j175463j233638j537799j761020j722395j636565j578212j547932
$$ 795649171 794473708 793240070 791702271 789941251 788218856 786582291 785004079 783456147
3151.1G83456147j753509k077222k151847k068579k038896k042950k080082k153814
$$ 783456147 781702638 779625416 777473569 775404990 773366094 771323144 769243062 767089248
3167.4G67089248k209187k210080k205134k260685k318203k250374k173423k199829
$$ 767089248 764880061 762669981 760464847 758204162 755885959 753635585 751462162 749262333
3183.7G49262333k155781k022505j964926j968086j951873j920820j794457j593411
$$ 749262333 747106552 745084047 743119121 741151035 739199162 737278342 735483885 733890474
3200.1G33890474j494825j471102j457751j466572j390517j268149j247525j266420
$$ 733890474 732395649 730924547 729466796 728000224 726609707 725341558 724094033 722827613
3216.4G22827613j228392j168191j182556j296461j403272j439393j414120j423895
$$ 722827613 721599221 720431030 719248474 717952013 716548741 715109348 713695228 712271333
3232.7G12271333j611471j806498j851141j928688k077341k080857j961470k052665
$$ 712271333 710659862 708853364 707002223 705073535 702996194 700915337 698953867 696901202
3249F96901202k286911k318322k215505k237678k317071k330839k344132k305865k192080
$$ 696901202 694614291 692295969 690080464 687842786 685525715 683194876 680850744 678544879 676352799
3267.4F76352799k102017k147258k256334k193987k025723j957894j956105j890421
$$ 676352799 674250782 672103524 669847190 667653203 665627480 663669586 661713481 659823060
3283.7F59823060j790345j745701j693665j581193j507341j501441j479686j408815
$$ 659823060 658032715 656287014 654593349 653012156 651504815 650003374 648523688 647114873
3300F47114873j301885j222074j282274j398147j368522j248241j200855j223802j201212
$$ 647114873 645812988 644590914 643308640 641910493 640541971 639293730 638092875 636869073 635667861
3318.4F35667861j147628j128674j126647j179814j237631j218796j230478j274228
$$ 635667861 634520233 633391559 632264912 631085098 629847467 628628671 627398193 626123965
3334.7F26123965j210571j137375j193524j232922j222253j251757j260936j308739
$$ 626123965 624913394 623776019 622582495 621349573 620127320 618875563 617614627 616305888
3351F16305888j427591j472891j393377j301945j351833j457989j385450j202941j225651
$$ 616305888 614878297 613405406 612012029 610710084 609358251 607900262 606514812 605311871 604086220
3369.3F04086220j445889j504719j365960j270175j248360j265287j250744j112938
$$ 604086220 602640331 601135612 599769652 598499477 597251117 595985830 594735086 593622148
3385.7E93622148r02593q18908r80795j151383j081764p99656o00994q01802j074254
$$ 593622148 592719555 591900647 590919852 589768469 588686705 587887049 587286055 586484253 585409999
3404E85409999r65953p37548o57439o45876o70373o93918o36279m63426j60695J39237
$$ 585409999 584444046 583706498 583049059 582403183 581732810 581038892 580402613 579939187 579778492 579917729
3424.4E79917729L02672L80099L45588M20391O74129O20425L08335L07857O10948P90537
$$ 579917729 580220401 580600500 580946088 581366479 582040608 582661033 582969368 583277225 583888173 584678710
3444.8E84678710R55641J295268J461864J409828J402259J441479J494587J488089
$$ 584678710 585634351 586929619 588391483 589801311 591203570 592645049 594139636 595627725
3461.1E95627725J547992J862109K123952J935840J455485J321495J681328K031565
$$ 595627725 597175717 599037826 601161778 603097618 604553103 605874598 607555926 609587491
3477.4F09587491J929104J700580J935422K271057K261757K180994K177060K162397
$$ 609587491 611516595 613217175 615152597 617423654 619685411 621866405 624043465 626205862
3493.8F26205862K237975K234876J941026J767397K083182K314389K142250K271891
$$ 626205862 628443837 630678713 632619739 634387136 636470318 638784707 640926957 643198848
3510.1F43198848K717495K658426K180577J917183J845002J852453J932264J979827
$$ 643198848 645916343 648574769 650755346 652672529 654517531 656369984 658302248 660282075
3526.4F60282075K313018K923072L015518K603829K403259K484441K405166J967013
$$ 660282075 662595093 665518165 668533683 671137512 673540771 676025212 678430378 680397391
3542.7F80397391J751840K323211K915740K801120K857089L226697L011525K535522
$$ 680397391 682149231 684472442 687388182 690189302 693046391 696273088 699284613 701820135
3559G01820135K167940J193464K33173K128244N660057N932748M056931L117382L185034
$$ 701820135 703988075 705181539 705414712 707542956 713203013 719135761 723192692 726310074 729495108
3577.4G29495108L393114L230810K083540P06553J909376M925668M865229L131032
$$ 729495108 732888222 736119032 738202572 738909125 740818501 745744169 750609398 753740430
3593.7G53740430L172397L911794L909766L864825L157735J384199Q81374K192080
$$ 753740430 756912827 760824621 764734387 768599212 771756947 773141146 774022520 776214600
3610G76214600L004074L209233K687752K192676M295826N747319L031790j213849j512229
$$ 776214600 779218674 782427907 785115659 787308335 791604161 797351480 800383270 799169421 797657192
3628.4G97657192M218101O644070M750550L362119K520800J803398P61151j881599
$$ 797657192 801875293 808519363 813269913 816632032 819152832 820956230 821717381 819835782
3644.7H19835782m837155k760411M789174P097900L822327K717256L872335L034949
$$ 819835782 814998627 812238216 817027390 824125290 827947617 830664873 834537208 837572157
3661H37572157J204014o35564l170312l946781j131296n39243o12497M159450O355226
$$ 837572157 838776171 838140607 834970295 831023514 829892218 829352975 828740478 832899928 839255154
3679.4H39255154M361689J692891j454889l671051j526832L563762N016446K998709
$$ 839255154 843616843 845309734 843854845 840183794 838656962 842220724 847237170 850235879
3695.7H50235879N69106j066208n98312J250804L88324k841234m007519j34646M305362
$$ 850235879 850804985 849738777 849140465 850391269 850779593 847938359 843930840 843796194 848101556
3714H48101556L547490M80056j311839j317918l46840Q39115P22587k004385m934132
$$ 848101556 851649046 852129102 850817263 849499345 849152505 849991620 850714207 848709822 843775690
3732.4H43775690l618181J825094M526019J199126l720223l699065J74344m33982m51803
$$ 843775690 840157509 841982603 846508622 847707748 843987525 840288460 840462804 840028822 839577019
3750.7H39577019M120112M896879J657724K82109J695216J590371l22223j067817k68996
$$ 839577019 843697131 848594010 850251734 850533843 852229059 853819430 853497207 852429390 852160394
3769.1H52160394J744151K628625P27594j489044j296281N57541Q95858N60344R81986
$$ 852160394 853904545 856533170 857260764 855771720 854475439 855032980 855928838 856489182 857471168
3787.5H57471168Q29816j59800j696289k844572k633452k584815j189530J694858J644313
$$ 857471168 858300984 858141184 856444895 853600323 850966871 848382056 847192526 848887384 850531697
3805.8H50531697J968324L014565O32584l011346l740191k191663j576543J365006
$$ 850531697 852500021 855514586 856147170 853135824 849395633 847203970 845627427 846992433
3822.1H46992433L978074K280593L34620r78410j914263k121687k452910j282155J679778
$$ 846992433 850970507 853251100 853585720 852607310 850693047 848571360 846118450 844836295 846516073
3840.5H46516073L291785L383697J972556j680732o265819o748438J772821O864309
$$ 846516073 849807858 853191555 855164111 853483379 847217560 840469122 842241943 849106252
3856.8H49106252L585160n52654k191782r24647k78413j246632j669K116502K406359
$$ 849106252 852691412 852138758 849946976 849022329 848743916 847497284 847495615 849612117 852018476
3875.2H52018476R69409j381218j257896K3603K89083J110017M48048k56598J278758
$$ 852018476 852987885 851606667 850348771 850372374 850661457 851771474 852219522 851962924 853241682
3893.5H53241682Q22544k239466l676891k058566R32754L691673M028618K114356K06649
$$ 853241682 854064226 851824760 848147869 846089303 847022057 850713730 854742348 856856704 857063353
3911.9H57063353j153469j878738r62973N10037N17189J7882L00228J47939n83708
$$ 857063353 855909884 854031146 853068173 853578210 854095399 854113281 854413509 854561448 853977740
3930.2H53977740q0764J184344J165688J02043p59482p13408N2094J63198j20759L39627
$$ 853977740 853896976 855081320 856247008 856349051 855589569 854876161 854928255 855091453 854970694 855310321
3950.6H55310321P34746M50492Q4996r7453j20819J47224L09407O6638j10805o7651
$$ 855310321 856045067 856495559 856580555 856483102 856362283 856509507 856818914 856885552 856774747 856707096
3971H56707096q523R8407J91271J03533J7763O9976N9962p0632j36196n1856L4690
$$ 856707096 856698573 856796980 856988251 857091784 857109547 857179523 857239485 857168853 857032657 856980801 857015491
3993.4H57015491O6697P7725
$$ 857015491 857082188 857159913
3997.5H57159913
$$ 857159913
##END=$$ End of the data block
