##TITLE=Methaldehyde cristals $$ Begin of the data block
##JCAMP-DX=5.00 $$ ACD/SpecManager v 10.08
##SPECTROMETER/DATA SYSTEM=Alpha
##DATE=28 Apr 2014 10:44:08
##DATA TYPE=INFRARED SPECTRUM
##DATA CLASS=XYDATA
##ORIGIN=
##OWNER=
##NPOINTS=1765
##FIRSTX=399.75695801
##LASTX=3997.56933594
##MAXX=3997.56933594
##MINX=399.75695801
##MAXY=0.85852695
##MINY=0.00065997
##XFACTOR=1.0000000000
##YFACTOR=1.000000000000000e-9
##FIRSTY=0.84456050
##DELTAX=2.03957629
##XUNITS=1/CM
##YUNITS=ARBITRARY UNITS
##XYDATA=(X++(Y..Y))
399.8H44560504M336059K332568l074944k607584K325654K090693l036559m435480
$$ 844560504 848896563 851229131 848154187 845546603 847872257 849962950 846926391 842490911
416.1H42490911l83675K117575j411140k631009R19282J110852l873467n163670r34422
$$ 842490911 842107236 844224811 842813671 840182662 841101944 842212796 838339329 833175659 832241237
434.4H32241237K63810l734827n283355j523316R15885j716912k711117J250743L734708
$$ 832241237 832505047 828770220 823486865 821963549 822879434 821162522 818451405 819702148 823436856
452.8H23436856R05991j254022K024293M310488P07269k887905j083135J799285K16365
$$ 823436856 824342847 823088825 825113118 829423606 830130875 827242970 826159835 827959120 828175485
471.1H28175485k170741k84553K229095M58776l186762k878249N48602Q06450k030968
$$ 828175485 826004744 825720191 827949286 828408062 825221300 822343051 822891653 823698103 821667135
489.5H21667135k035022J285017J995146j143098k859414q82864M06981j894832l582120
$$ 821667135 819632113 820917130 822912276 821769178 818909764 818026900 818433881 816539049 812956929
507.9H12956929j812517n64635l038764o079495n890131n066931q239508j3895571
$$ 812956929 811144412 810579777 807541013 801461518 795571387 790504456 782264948 768369377
524.2G68369377j8222988k2690952l2582700m8054993o6524983q8735997j08730972
$$ 768369377 750146389 727455437 694872737 646817744 580292761 491556764 382825792
538.4C82825792j06562168o1673045K1246165J02879107J37821883J20925397Q4608793
$$ 382825792 276263624 214590579 235836744 338715851 476537734 597463131 682071924
552.7F82071924N4862380L4074724J8700361J0322094P415056L319383l919363j0156035
$$ 682071924 736934304 771009028 789709389 800031483 807446539 810765922 806846559 796690524
569G96690524j6686499l1948925n6851565o9253624l8488805K3280740O3130498N9914648
$$ 796690524 780004025 748055100 691203535 621949911 583461106 606741846 669872344 729786992
585.4G29786992M0535152K5157094J3860762O405354M859268N441070K969086n89967
$$ 729786992 770322144 795479238 809340000 815745354 820604622 826045692 829014778 828424811
601.7H28424811n57482J264393m1842l627360m589558l130495m222453q238673j1003077
$$ 828424811 827867329 829131722 829089880 825462520 820872962 817742467 813520014 805281341 794278264
620G94278264j2929916j9734860l4507096n7455599r1318369j20552748q8581264K3191064
$$ 794278264 781348348 761613488 727106392 669650793 578332424 457779676 369198412 392389476
636.3C92389476J20560706J27154052Q2566977M4342041K4852335J6713381J1614263
$$ 392389476 512950182 640104234 722671211 767013252 791865587 808578968 820193231
650.6H20193231O101012K733708K628505K272665j63495j641929o18637N40257Q10980
$$ 820193231 826294243 829027951 831656456 833929121 833765626 832123697 831505060 832045317 832856297
669H32856297M73679Q33332K205372K420068J214266J647114L696919L703773J223862
$$ 832856297 833329976 834163308 836368680 838788748 840003014 841650128 845347047 849050820 850274682
687.3H50274682J14977J833737K792955P92026r58860M33863K162873P74682j422525
$$ 850274682 850389659 852223396 855016351 855808377 854849517 855283380 857446253 858220935 856798410
705.7H56798410o03497J499534Q32498j418054j099229J125157R73225j595438k136350
$$ 856798410 856194913 857694447 858526945 857108891 856009662 857134819 858108044 856512606 854376256
724H54376256K20061J059115j390934k765954p03633P66516j315772l414929k151847
$$ 854376256 854596317 855655432 854264498 851498544 850794911 851561427 850245655 846830726 844678879
742.4H44678879o57678k451897m015266n89610L974021L178835o02842j162350R97067
$$ 844678879 844021201 841569304 837554038 836964428 840938449 844117284 843514442 842352092 843349159
760.8H43349159J055538j324832j900017N7339L70562k171635l705561k382517j274944
$$ 843349159 844404697 843079865 841179848 841237187 841607749 839436114 835730553 833348036 832073092
779.1H32073092k360463l040909j282096L11434r04977k826333k620161j674712k657652
$$ 832073092 829712629 826671720 825389624 825701058 824796081 821969748 819349587 817674875 815017223
797.5H15017223m551470m595339l338576l679514n683660o794155o724476p677675
$$ 815017223 810465753 805870414 802531838 798852324 793168664 786374509 779650033 771972358
813.8G71972358j0208547j2192786j2919247j4491856j7843187k1262586k4466157
$$ 771972358 761763811 749571025 736651778 722159922 704316735 683054149 658587992
828.1F58587992l0862987m4500053o7376196r7395241j21467978j13194302n6535154
$$ 658587992 627725005 583224952 515848756 418453515 296985537 183791235 127256081
842.3A27256081K3740693O8559826M0369809j8361062k0021901N1819697J18358523
$$ 127256081 150996774 219556600 259926409 241565347 221543446 273363143 391721666
856.6C91721666J21778309Q5549116N1240981L1869233K2519767J6634166J2038827
$$ 391721666 513499975 599049091 650290072 682159305 704679072 721313238 733352065
870.9G33352065R341300Q204281P436097P058501P531345P780194O236374L577948
$$ 733352065 742693365 750897646 758333743 765392244 772923589 780703783 786940157 790518105
887.2G90518105K044857J907885J210212m49121j369774j200914j634002l485382n279243
$$ 790518105 792562962 794470847 795681059 795231938 793862164 792661250 791027248 787541866 782262623
905.6G82262623n774855n641401n313814l827870j295924J35422o93917k090991k413928
$$ 782262623 776487768 770846367 765532553 761704683 760408759 760544181 759850264 757759273 755345345
923.9G55345345k618373m005372n804539o709933p362247r055018j1224270j2612641
$$ 755345345 752726972 748721600 742917061 736207128 728844881 719789863 708565593 695952952
940.2F95952952j3712645j5790939j8570006k1010756k3255468k6400268l1140566
$$ 695952952 682240307 666449368 647879362 626868606 603613138 577212870 546072304
954.5E46072304l7667572m6599895n8866322p3786676q6994439q9996174p5189993
$$ 546072304 508404732 461804837 402938515 329151839 242157400 152161226 76971233
968.8G6971233m5818251j4140838J9090896O7280129J23903676J54991568J42811566
$$ 76971233 31152982 17012144 36103040 103383169 227286845 382278413 525089979
983.1E25089979J04816139O5684140L6441624J7375946N879640o17444m244447o253838
$$ 525089979 629906118 695590258 732031882 749407828 755287468 754670024 750425577 744171739
999.4G44171739p284165p962882q992613j0799169j3025463j4185011j3268292j1409700
$$ 744171739 736887574 728924692 719932079 709132910 696107447 681922436 668654144 657244444
1015.7F57244444j0082185r296060q907020r467661j1090518j3036608j4819205j6726553
$$ 657244444 647162259 637866199 628959179 619491518 608401000 595364392 580545187 563818634
1032E63818634j8880547k0938158k2737562k4376124k5845737k7060806k8010935k8785706
$$ 563818634 544938087 523999929 501262367 476886243 451040506 423979700 395968765 367183059
1048.3C67183059l0021339l2257974l4966082l7368372l9199218m0488124m0879823
$$ 367183059 337161720 304903746 269937664 232569292 193370074 152881950 112002127
1062.6A12002127l8325921l0777901k0906400j2351670m275034L720294Q474721O727639
$$ 112002127 73676206 42898305 21991905 9640235 5365201 9085495 17560216 24287855
1078.9B4287855n0978o003256p439651n550279l016023j242086l25615K95356J993043
$$ 24287855 24236877 18233621 10793970 5243691 2227668 985582 659967 955323 2948366
1097.3B948366Q510060K0600416K4813906P340997j7543237k4833989j5165603m908305
$$ 2948366 11458426 32058842 56872748 64213745 46670508 21836519 6670916 1762611
1113.6A762611n48111O88975J652927L873844Q597128J6568193K7148981L8302194
$$ 1762611 1214500 1903475 3556402 7430246 16027374 32595567 59744548 98046742
1129.9I8046742M7574692N3252712N5025995N3350716M8078299L7593692J9338459
$$ 98046742 145621434 198874146 253900141 307250857 355329156 392922848 412261307
1144.2D12261307q422166m3391257p6437951r3596711q5669324n8530472k9473555
$$ 412261307 403839141 360447884 284009933 190413222 104743898 46213426 16739871
1158.5A6739871j0922051k918594k69220Q06151K056529M454335Q398300J3161728
$$ 16739871 5817820 2899226 2630006 3436157 5492686 9947021 18345321 31507049
1174.8C1507049J7194975J9816331K1291897K0988368J7947904J2716204P208228L234089
$$ 31507049 48702024 68518355 89810252 110798620 128746524 141462728 148670956 151905045
1191.1A51905045J653016J555785k57954p560283j7889053j8269598P89247K8617807
$$ 151905045 153558061 155113846 154855892 147295609 129406556 111136958 111926205 140544012
1207.4A40544012M5810029M6590567L8770199L1382650K8292298K8380394K8726190
$$ 140544012 186354041 232944608 271714807 303097457 331389755 359770149 388496339
1221.7C88496339K7819604K5977373K3823917K1564007J9222468J7149866J5461087
$$ 388496339 416315943 442293316 466117233 487681240 506903708 524053574 539514661
1236E39514661J3833225J2102365J0704458R932041R380341Q627295P861078P369280
$$ 539514661 553347886 565450251 576154709 586086750 595467091 604094386 611955464 619324744
1252.3F19324744O912470O301164N785823N708814N629658N028368M129827L461182
$$ 619324744 626237214 632538378 638324201 644033015 649662673 654691041 658820868 662282050
1268.6F62282050L049850K639115K373993K539099L147304L970802N218565O973386
$$ 662282050 665331900 667971015 670345008 672884107 676031411 680002213 685220778 692194164
1284.9F92194164Q793711R857238R915709R395957Q532107P232666N629480M425407
$$ 692194164 700987875 710845113 720760822 730156779 738688886 745921552 751551032 755976439
1301.2G55976439L741860L026307J741409q643k214312m688442o647825p271290p084549
$$ 755976439 759718299 762744606 764486015 764477372 762263060 757574618 750926793 743655503 736570954
1319.6G36570954r033978j6469001l1475366n5995643r3247175j38395846j62367821
$$ 736570954 727536976 711067975 679592609 623596966 530349791 391953945 229586124
1333.9B29586124j31675034n5245322L0727331R6206568J23500541J16623014R3570233
$$ 229586124 97911090 42665768 73393099 169599667 293100208 409723222 503293455
1348.1E03293455P0464253N1948428L8093746K7355850J7311573M225373j4272749
$$ 503293455 573757708 625706136 663799882 691155732 708467305 712692678 698419929
1362.4F98419929l3273221o2892615j25945658j84178680j65578648o6116725M8155431
$$ 698419929 665146708 602254093 476308435 292129755 126551107 60434382 108589813
1376.7A08589813J12342775J19274542R2168390O2929303M4100404K9184460J4391363
$$ 108589813 220932588 340207130 432375520 495304823 539405227 568589687 582981050
1391E82981050J227558j4608562l8101077p3425085j06167346j14280105q9369863
$$ 582981050 584208608 569600046 531498969 458073884 351906538 237626433 148256570
1405.3A48256570l4702465J7867953N3419724O4551055N1965416L9871633L9180845
$$ 148256570 113554105 131422058 184841782 249392837 301358253 341229886 380410731
1419.5C80410731L2684028K5529087K5352835K4631262K0193160R380698p298410k8992683
$$ 380410731 413094759 438623846 463976681 488607943 508801103 518181801 510883391 481890708
1435.9D81890708m0791869k8523773j8213451k6079565m6814084m3811947J0434299
$$ 481890708 441098839 412575066 394361615 368282050 321467966 277656019 288090318
1450.1B88090318O2201143O6517651M7095984L4981340L3010990L1356096K7306437
$$ 288090318 350291461 416809112 463905096 498886436 531897426 563253522 590559959
1464.4E90559959J9414783J1128128P009029P041097P382750N592346L546477K157330
$$ 590559959 609974742 621102870 628111899 635152996 642535746 648128092 651674569 653831899
1480.7F53831899J444101N51701m8458K147197P229805R619415R401977R740472R041607
$$ 653831899 655276000 655827701 655779243 657926440 665156245 674775660 684177637 693918109 702959716
1499.1G02959716O569028L385365R07779J864672L915012K909243J468062Q22961J218260
$$ 702959716 709528744 712914109 713821888 715686560 719601572 722510815 723978877 724801838 726020098
1517.4G26020098J513481J651943J987516J289845L68714q98778k961338m294932m108846
$$ 726020098 727533579 729185522 731173038 732462883 732831597 731932819 728971481 724676549 720567703
1535.8G20567703n233824o301165j913368K404928L484070L335178L411293L648341
$$ 720567703 715333879 709032714 707119346 709524274 713008344 716343522 719754815 723403156
1552.1G23403156L302216K114475L173709Q490562P482887M198074K530098J663923
$$ 723403156 726705372 728819847 731993556 740484118 747967005 752165079 754695177 756359100
1568.4G56359100K010227J753568K81513N47290J842379J290739M06623J96636J02222
$$ 756359100 758369327 760122895 760404408 760951698 762794077 764084816 764491439 764688075 764790297
1586.8G64790297k26677n89549q62539j100838j489461k075314k701462l300190m135787
$$ 764790297 764563620 763974071 763111532 762010694 760521233 758445919 755744457 752444267 748308480
1605.1G48308480m846156m211902k261341j232267j842618j717031q26954j430810
$$ 748308480 743462324 739250422 736989081 735756814 733914196 732197165 731370211 729939401
1621.4G29939401j715243n37038M64023R98258N48780o05702J96576K770483K917230
$$ 729939401 728224158 727687120 728151143 729149401 729698181 729092479 729289055 732059538 734976768
1639.8G34976768J723886M92990J51575J578509J390458K1159K400935M215836K562702
$$ 734976768 736700654 737193644 737345219 738923728 740314186 740335345 742736280 746952116 749514818
1658.2G49514818J227319J030624J422763O53625l71814M61876J437903J634478K468527
$$ 749514818 750742137 751772761 753195524 753849149 753477335 753939211 755377114 757011592 759480119
1676.5G59480119K321541P21932o30737P23481K822399K378166J787067Q05199o05762
$$ 759480119 761801660 762523592 761892855 762616336 765438735 767816901 769603968 770409167 769803405
1694.9G69803405r86517n26845R69291J734674Q60154P37965O95467l59177j690269
$$ 769803405 768816888 768290043 769259334 770994008 771854162 772592127 773287594 772928417 771238148
1713.2G71238148k392173r59515J887977K325535J541435J336158J044035J18732j205861
$$ 771238148 768845975 767886460 769774437 772099972 773641407 774977565 776021600 776140332 774934471
1731.6G74934471j944065j230061k334118n595982q573831j1900603j7016292k2576272
$$ 774934471 772990406 771760345 769426227 763830245 755256414 743355811 726339519 703763247
1747.9G03763247k4679959j5640617L176689K1288991K9756785K5679350J8828332
$$ 703763247 679083288 663442671 666619360 687908351 717665136 743344486 762172818
1762.2G62172818J1965275O221175L188372J578331J423240K496421K725601K161861
$$ 762172818 774138093 780359268 783547640 785125971 786549211 789045632 791771233 793933094
1778.5G93933094J666307J427352J474321J507104O68764m80592O2704J259803P78616
$$ 793933094 795599401 797026753 798501074 800008178 800676942 800196350 800259054 801518857 802297473
1796.9H02297473k79725l32653J86980j74880j264871j928448j365721n9307R93609
$$ 802297473 802017748 801685095 801872075 801697195 800432324 798503876 797138155 797078848 798072457
1815.2G98072457J629234J601100K38478k117694l831088l732205k070427N22733J821280
$$ 798072457 799701691 801302791 801541269 799423575 795592487 791860282 789789855 790312588 792133868
1833.6G92133868J382649N54323o80566k588510m293144m232645k803862l79801L244102
$$ 792133868 793516517 794070840 793390274 790801764 786508620 782275975 779472113 779092312 782336414
1851.9G82336414O072998O539524N219101L616929K434612J422822L93987J05560P89642
$$ 782336414 788409412 794948936 800168037 803784966 806219578 807642400 808036387 808141947 808931589
1870.3H08931589Q80182M5538p07150r23872o85095k49446R3043J07944p6890j47521
$$ 808931589 809811771 809857309 809150159 808226287 807541192 807291746 807384789 807492733 807415843 807268322
1890.7H07268322o47426j786411k762318l049194k293051n40912J159489J957059K104700
$$ 807268322 806620896 804834485 802072167 799022973 796729922 796189010 797348499 799305558 801410258
1909H01410258J991451J518547P49290K30968Q8811l98099j102746j645505k638758
$$ 801410258 803401709 804920256 805669546 805900514 805989325 805591226 804488480 802842975 800204217
1927.4H00204217m230916n725503o480455o287575n361378l997624k421797j072287
$$ 800204217 795973301 790247798 783767343 777479768 772118390 768120766 765698969 764626682
1943.7G64626682r10580j935304l194868m323006n412042n956590n186975l347516
$$ 764626682 763716102 761780798 758585930 754262924 748850882 742894292 737707317 734359801
1960G34359801j572907n38886L22044J612187K760231L165722L112674K872705K188683
$$ 734359801 732786894 732248008 732570052 734182239 736942470 740108192 743220866 746093571 748282254
1978.4G48282254Q55326n70654j138151m84884J022279K868176M546583N065262M078030
$$ 748282254 749137580 748566926 747428775 746943891 747966170 750834346 755380929 760446191 764524221
1996.7G64524221K496243J351178R83655R74774J033009J333057J863301K293766K566576
$$ 764524221 767020464 768371642 769355297 770330071 771363080 772696137 774559438 776853204 779419780
2015.1G79419780K954483L379047L328085K616107J701892J140594Q13663K17676n70774
$$ 779419780 782374263 785753310 789081395 791697502 793399394 794539988 795353651 795571327 795000553
2033.4G95000553j006842j098990j571596k840697m443825n306065m077494k91824
$$ 795000553 793993711 792894721 791323125 788482428 784038603 778732538 774655044 774363220
2049.8G74363220M117131O317854N662799L586113J582921L02017l50774p20382r00924
$$ 774363220 778480351 784798205 790461004 794047117 795630038 795932055 795581281 794860899 793959975
2068.1G93959975o97136p6770O44087J315415K015054K524794K454102J859069J233816
$$ 793959975 793262839 793186069 793830156 795145571 797160625 799685419 802139521 803998590 805232406
2086.5H05232406Q98480P27534M61698J55985J4961n7280k72632n84900p12395m44472
$$ 805232406 806130886 806858420 807320118 807476103 807491064 807433784 807161152 806576252 805863857 805419385
2106.9H05419385Q8692N58615Q91209J255095J580894J567304J242876R56177Q17836
$$ 805419385 805508077 806066692 806957901 808212996 809793890 811361194 812604070 813560247 814378083
2125.2H14378083N55157K1458l99291l98636k92003m20154n47111l91721k28763l97563
$$ 814378083 814933240 814954698 814555407 814156771 813864768 813444614 812897503 812505782 812277019 811879456
2145.6H11879456o53446n86748k95281j68324k24173k8133N02169Q33273O80268M24623
$$ 811879456 811226010 810639262 810343981 810175657 809951484 809923351 810425520 811258793 811939061 812363684
2166H12363684L74079K06768l76761j060724j500428j920342k506852k663016j726091
$$ 812363684 812737763 812944531 812567770 811507046 810006618 808086276 805579424 802916408 801190317
2184.4H01190317k01404P87913R75490R08136P93577K92062n12957r17018p70092q41379
$$ 801190317 800988913 801776826 802752316 803660452 804454029 804746091 804233134 803316116 802546024 801704645
2204.8H01704645j560688k398491k831280l131926l589869l483772k060771r8288R49502
$$ 801704645 800143957 797745466 794914186 791782260 788192391 784708619 782647848 782549560 783499062
2223.1G83499062J052201J347840K126753K619982K588451K613067K834618K645314
$$ 783499062 784551263 785899103 788025856 790645838 793234289 795847356 798681974 801327288
2239.4H01327288J791418Q75771L82602J16527p0393R9182O53207J035095Q14140K28464
$$ 801327288 803118706 803994477 804377079 804493606 804423213 804522395 805175602 806210697 807024837 807253301
2259.8H07253301k51055n49495r25422j332700j343906r43422o61671p45177q56579
$$ 807253301 807002246 806452751 805527329 804194629 802850723 801907301 801245630 800500453 799643874
2278.2G99643874p10547n05447n40674q03173j130104j532793k082467k604067k761900
$$ 799643874 798933327 798427880 797887206 797084033 795953929 794421136 792338669 789734602 786972702
2296.5G86972702k430678j748860p86125M16100J557171K233624K387226K294123K190829
$$ 786972702 784542024 782793164 782007039 782423139 783980310 786213934 788601160 790895283 793086112
2314.9G93086112K075135J810551J382172R77635O45817J80959l45289n93305o19948
$$ 793086112 795161247 796971798 798353970 799331605 799977422 800158381 799813092 799219787 798599839
2333.3G98599839r11474j656353k192796j119256J899243M510820M167258K158702
$$ 798599839 797688365 796032012 793839216 792719960 794619203 799130023 803297281 805455983
2349.6H05455983O10888j27912m77552n26607j00732L90947N05805M83095O86169Q36074
$$ 805455983 806066871 805938959 805461407 804934800 804834068 805225015 805730820 806213915 806900084 807736158
2370H07736158N64874J98602K60115P08282J049101R97067Q07583O99639N33581K92242
$$ 807736158 808301032 808499634 808759749 809468031 810517132 811514199 812321782 813021421 813555002 813847244
2390.4H13847244K58982N01633O43432M64737K83241L51668L73244P3791l01361m33267
$$ 813847244 814106226 814607859 815251291 815716028 815999269 816350937 816724181 816797972 816496611 816063344
2410.8H16063344m30762n78702p78794o85155l48509j97708l16501l46899j79052o7533
$$ 816063344 815632582 815053880 814275086 813589931 813241422 813043714 812727213 812380314 812201262 812133729
2431.2H12133729q1718n7280l9875l85583j238405k263963l019274l147244k337933
$$ 812133729 812052011 811994731 811954856 811569273 810330868 808066905 805047631 801900387 799562454
2449.5G99562454o14345J331687K593875K729356K034664J235903O57916J63257k93195
$$ 799562454 798948109 800279796 802873671 805603027 807637691 808873594 809531510 809694767 809401572
2467.9H09401572o17564q29160j007974j119972j072466q80539o91176n84781n03123
$$ 809401572 808784008 807954848 806946874 805826902 804754436 803873897 803182721 802597940 802094817
2486.2H02094817m67002n62549o39498m27902L0935M03762N27203N22494M64559L60071
$$ 802094817 801627815 801065266 800425768 799997866 800028801 800432563 800959766 801482260 801946819 802306890
2506.6H02306890L05057L60847M80771N78045O05524N77748M61638K43127m6670l65973
$$ 802306890 802611947 802972794 803453565 804031610 804637134 805214882 805676520 805919647 805872977 805507004
2527H05507004o24597q07941r43064r66847q46684o60956m26173p3433L80396Q10504
$$ 805507004 804882407 804074466 803131402 802164555 801317871 800656915 800230742 800157309 800537705 801348209
2547.4H01348209J106024J211763J128196R35018P17402N26607L67343K03193O1690
$$ 801348209 802454233 803665996 804794192 805729210 806446612 806973219 807340562 807543755 807605445
2565.8H07605445Q524R656l4929j74641l88980n54204n62251m38630j89901J54317
$$ 807605445 807613969 807623625 807588696 807414055 807025075 806470871 805908620 805469990 805280089 805434406
2586.2H05434406M29809N55992N72503N07414M16040L27826K14279J07348M7981K8015
$$ 805434406 805864215 806420207 806992710 807500124 807916164 808243990 808458269 808565617 808613598 808641613
2606.6H08641613J0252l6955p9394j08659j56105j74462j19031m5478J6033J37151
$$ 808641613 808651865 808614910 808535516 808426857 808270752 808096290 807977259 807931781 807947814 808084965
2626.9H08084965L10540M37677M62413L57985Q2076l71933p83324p57337j89722M09603
$$ 808084965 808395505 808833182 809295595 809653580 809735656 809363723 808580399 807823062 807633340 808042943
2647.3H08042943M41075j29998r32395j324952o61015O51359J280487O71088n19454
$$ 808042943 808484018 808354020 807421625 806096673 805435658 806087017 807367504 808038592 807519138
2665.7H07519138j294196j034438k47896m2021k44260J93476J073420J403392J092613
$$ 807519138 806224942 805190504 804942608 804900587 804656327 804849803 805923223 807326615 808419228
2684.1H08419228O21259P4923o19412j405358k218604k472103j316249N98907J508236
$$ 808419228 809040487 809115410 808495998 807090640 804872036 802399933 801083684 801682591 803190827
2702.4H03190827R12130l83913j539231k045631j906097j498938r61124k92242k1398
$$ 803190827 804102957 803719044 802179813 800134182 798228085 796729147 795768023 795475781 795454383
2720.8G95454383n63562j325011j377225o13690j18315q25226j454175n12302L90292
$$ 795454383 794890821 793565810 792188585 791574895 791456580 790631354 789177179 788664877 789055169
2739.1G89055169l04163j098335o78837J90914N75065M45068Q0526l28243o37412p72834
$$ 789055169 788751006 787652671 786973834 787164748 787739813 788184881 788265407 787937164 787299752 786526918
2759.5G86526918q95500j576006l156543m663289m218518j471818J247049J787901
$$ 786526918 785631418 784055412 780898869 776235580 772017062 770545244 771792293 773580194
2775.8G73580194O82294n11646j140178j187443p52986k07186q9764l21269p5340J140296
$$ 773580194 774262488 773750842 772610664 771423221 770670235 770463049 770373285 770052016 769976676 771116972
2796.2G71116972K553105K822876J665712j38402j995445l731191n163252o154835
$$ 771116972 773670077 776492953 778158665 778020263 776024818 772293627 767130375 760975540
2812.5G60975540o620646o407142n551695m382134l249764k276361j294136r0123J328290
$$ 760975540 754354894 747947752 742396057 738013923 734764159 732487798 731193662 731103539 732431829
2830.9G32431829K585888L005683K231777O20365j204252k733052l600716l762663
$$ 732431829 735017717 738023400 740255177 740875542 739671290 736938238 733337522 729574859
2847.2G29574859l511429l204405l076136l172219l473461m000067m747331n651355
$$ 729574859 726063430 722859025 719782889 716610670 713137209 709137142 704389811 698738456
2863.5F98738456o516159p071972p077753o293237m548789j909256J192153L895998
$$ 698738456 692222297 685150325 678072572 671779335 667230546 665321290 666513443 670409441
2879.9F70409441N197942M674554K871871O87540j271367k741814l633618l936708
$$ 670409441 675607383 680281937 683153808 683841348 682569981 679828167 676194549 672257841
2896.2F72257841l996373m407525n597889p857442j1476517j6785919k4131358l3885598
$$ 672257841 668261468 663853943 658256054 650398612 638922095 622136176 598004818 564119220
2912.5E64119220m5859874n7899177o4502060n7861626l3716172J896739L4107715
$$ 564119220 518259346 460360169 395858109 337996483 304280311 306177050 340284765
2926.8C40284765M9883216M6424717K8979063L202856k6981026n3092689n7441294
$$ 340284765 390167981 436592698 465571761 468774617 441793591 388700902 331259608
2941C31259608k6360422K6501775O6421926P4264317O0502649M3443799L1182349K3383021
$$ 331259608 304899186 331400961 397822887 472087204 532589853 576033652 607216001 630599022
2957.4F30599022J8006027J3963580J0792136Q054197N357444K172589k415418r768367
$$ 630599022 648605049 662568629 673360765 681414962 686772406 688944995 686529577 676761210
2973.7F76761210k1741629l9573908o2789499r1787994j22431964j30986318r2801958
$$ 676761210 655019581 615445673 552656174 460868180 338436216 207449898 114647940
2987.9A14647940k1674842M2186752O9756240N3816020J3651520p929444J7015576
$$ 114647940 92973098 135159850 204916090 258732110 272383630 264454186 281469762
3002.2B81469762O4033330Q7156355P6751352N4428994L6034286K4039030J6745210
$$ 281469762 345503092 432659447 509410799 563839793 599874079 623913109 640658319
3016.5F40658319J2701750J0783076R795606Q823395P587910O320297N261720M351437
$$ 640658319 653360069 664143145 673938751 682762146 690350056 696670353 701932073 706283510
3032.8G06283510L487646K802611K563536K557337K342642K011001J849174J890659
$$ 706283510 709771156 712573767 715137303 717694640 720037282 722048283 723897457 725788116
3049.1G25788116J893521J738965J600027J476944J267254J024843Q45432P89583P18951
$$ 725788116 727681637 729420602 731020629 732497573 733764827 734789670 735635102 736424685 737143636
3067.5G37143636N27799L66866K86043K15054J37925R6798J56045K21014J64568J80066
$$ 737143636 737671435 738038301 738324344 738539398 738677323 738774121 738930166 739151180 739315748 739495814
3087.9G39495814L80158N27680O11067P73549R77755J159548J204849J128375J120925
$$ 739495814 739875972 740403652 741014719 741788268 742766023 743925571 745130420 746258795 747379720
3106.2G47379720J079798Q18074N80072N91457O18339M79817K39968K5034J0550J68205
$$ 747379720 748459518 749277592 749857664 750449121 751067460 751547277 751787245 751812279 751822829 751991034
3126.6G51991034K60233J43469K384O3598K04742J90735l1889k31742k15590j34707
$$ 751991034 752251267 752394736 752397120 752460718 752665460 752856195 752824306 752592564 752376974 752242267
3147G52242267j07527j12116k39551m16338m42863l78966k78533j96278k39313l39090
$$ 752242267 752134740 752022624 751783073 751366735 750923872 750544906 750266373 750070095 749830782 749491692
3167.4G49491692m08233m51862n52834p57098r29534j015842j143396j334846j496732
$$ 749491692 749083459 748631597 748078763 747321665 746392131 745376289 744232893 742898047 741401315
3185.8G41401315j616478j796961k108038k527773k931356l207445l342867l213942
$$ 741401315 739784837 737987876 735879838 733352065 730420709 727213264 723870397 720656455
3202.1G20656455k751768k155483j638412j181305p12037k93732L2843L17514N70118
$$ 720656455 717904687 715749204 714110792 712929487 712217450 711923718 711956561 712274075 712844193
3220.5G12844193O41644L98934l517k15292m4107K69055L33309L06368M94421O93738
$$ 712844193 713485837 713884771 713881254 713665962 713621855 713890910 714224219 714530587 715025008 715718746
3240.9G15718746Q20100J074255J285017J156389Q69155O82533N35965K88367o258
$$ 715718746 716538846 717613101 718898118 720054507 720923662 721606195 722142160 722430527 722424269
3259.2G22424269k01285l11256l91006m26650m98593p54237j036406j152277j229942
$$ 722424269 722222984 721911728 721520722 721094072 720595479 719841242 718804836 717652559 716422617
3277.6G16422617j292884j274407j189470r98974o88434l01659l4094j17421l89099
$$ 716422617 715129733 713855326 712665856 711666882 710978448 710676789 710642695 710525274 710136175
3295.9G10136175n52535n42879l87013k15590k83360n94020q54195r07421q05854p19130
$$ 710136175 709583640 709040761 708653748 708438158 708154798 707560778 706706583 705799162 704993308 704274178
3316.3G04274178p02739p30336p84457q33630j039386j338780j450717j431048j415909
$$ 704274178 703571439 702841103 702056646 701223016 700183630 698844850 697394133 695963085 694547176
3334.7F94547176j390218j495242j749218j871169j916945j948773j810909j832604
$$ 694547176 693156958 691661716 689912498 688041329 686124384 684175611 682364702 680532098
3351F80532098k172649k375543k314687k212107k225995k325237k280474k161324k302229
$$ 680532098 678359449 675983906 673669219 671457112 669231117 666905880 664625406 662464082 660161853
3369.3F60161853k630592k661943k312958j969576j776934j662910j578748j495600
$$ 660161853 657531261 654869318 652556360 650586784 648809850 647146940 645568192 644072592
3385.7F44072592j341045j106381j104236j374423j452208j193642r90451j207649
$$ 644072592 642731547 641625166 640520930 639146507 637694299 636500657 635510206 634302557
3402F34302557j476884j293004r90450r25303r51290j008272j100838j077175r87947
$$ 634302557 632825673 631532669 630542219 629616916 628665626 627657354 626556516 625479341 624491394
3420.3F24491394r59397q83698o88195m85957m67062m95970l67582k23458q7202K01524
$$ 624491394 623531997 622648299 621960104 621474147 621007085 620511115 620143533 619920075 619832873 620034397
3440.7F20034397M96208N76079N79357O16610O00756N33819M74691N04434O38247P44760
$$ 620034397 620530605 621106684 621686041 622302651 622903407 623437226 623911917 624416351 625054598 625799358
3461.1F25799358R36866J293659J494586J284242Q69513P68184R51529J042008R27568
$$ 625799358 626736224 628029883 629524469 630808711 631678224 632446408 633397937 634439945 635367513
3479.5F35367513P06792O45518P14064O50107N06997L58403J62542P2777J54436L81827
$$ 635367513 636074305 636719823 637433887 638083994 638590991 638949394 639111936 639184713 639339149 639720976
3499.9F39720976Q86381J572847J974702K008140K017498K035618J841009J514852
$$ 639720976 640607357 642180204 644154906 646163046 648180544 650216162 652057171 653572023
3516.2F53572023J287103J151263J152158J198351J122773J188100J439631J516878
$$ 653572023 654859126 656010389 657162547 658360898 659483671 660671771 662111402 663628280
3532.5F63628280J457572J434624J317263J130819J054347J178324J434207J574099
$$ 663628280 665085852 666520476 667837739 668968558 670022905 671201229 672635436 674209535
3548.8F74209535J562238J607418J599371J350284J058638Q41439M70579J67608P72238
$$ 674209535 675771773 677379191 678978562 680328846 681387484 682228923 682699502 682867110 683639348
3567.2F83639348J654982J443565R52661J166523J807093K398968K612114K217591
$$ 683639348 685294330 686737895 687690556 688857079 690664172 693063140 695675254 697892845
3583.5F97892845J761853K256215L133416K893686K277852K193450K294124K306401
$$ 697892845 699654698 701910913 705044329 707938015 710215867 712409317 714703441 717009842
3599.8G17009842K273858J890898J292348J315415J788199J867353J763165J486123
$$ 717009842 719283700 721174598 722466946 723782361 725570560 727437913 729201078 730687201
3616.1G30687201J391053K130032K347708J303076O1572K95341K144217K500713J807332
$$ 730687201 732078254 734208286 736555994 737859070 737920642 738215983 740360200 742860913 744668245
3634.5G44668245J409829J130402R41396N85556l31044j206756l13103K014518K278506
$$ 744668245 746078074 747208476 748149872 748735428 748404384 747197628 746884525 748899043 751177549
3652.8G51177549J175702J110196J468182R40799K30730l02672j035333j226783l33190
$$ 751177549 752353251 753463447 754931629 755872428 756103158 755800486 754765153 753538370 753205180
3671.2G53205180k40803j37329J382113J833021J233876N46038k75969p77126j23679
$$ 753205180 752964377 752827048 754209161 756042182 757276058 757822096 757546127 756769001 756645322
3689.6G56645322J225352J566768R08196J02997l77715j56999M03345J2875j029969
$$ 756645322 757870674 759437442 760345638 760448635 760070920 759913921 760317266 760330141 759300172
3707.9G59300172j233577J52707J337826P81357k39074o99878o02901k44677J50800
$$ 759300172 758066595 758219302 759557128 760338485 760099411 759399533 758796632 758551955 758702755
3726.3G58702755Q345j006663j877606j277924M31538J066327j37210j584053j257300
$$ 758702755 758711100 757704437 755826831 754548907 754980445 756046772 755909562 754325509 753068209
3744.6G53068209r5904n79834m94838R51469Q30829m13000q28803k56538j39058m64857
$$ 753068209 752972305 752392471 751897633 752849102 753679931 753266931 752438128 752181590 752042532 751577675
3765G51577675m18782r3758M65810O41287P8022m22060j03951N77033O98805P47323
$$ 751577675 751158893 751065135 751530945 752172232 752250254 751828194 751724243 752301276 753000081 753747404
3785.4G53747404R48846Q48949M54545k05100o73890o55889p31230k26796N82814M00723
$$ 753747404 754696250 755545199 755999744 755794644 755120754 754464865 753733635 753506839 754089653 754490376
3805.8G54490376N85198P90894j50204j309395j460909j031280r41455Q0824Q14259
$$ 754490376 755075574 755866468 755716264 754406869 752945960 751914680 750973225 751054049 751868308
3824.2G51868308K27868k17438m89413o23167n77330o60241l14117M08233O85989P46489
$$ 751868308 752096176 751878738 751389325 750766158 750188828 749528587 749214470 749622703 750308692 751055181
3844.6G51055181N38647l93569j723767j562535J388251K444566J082420j41501n50986
$$ 751055181 751593828 751200259 749476492 747913957 749302208 751746774 752829194 752687693 752136707
3862.9G52136707j39475r9539m64082J3649N64635N49734P5996n84305m00126l0696
$$ 752136707 751997232 751897693 751433611 751447260 752011895 752561629 752637625 752053320 751653194 751622498
3883.3G51622498L7789K10107j59204k84732K51234K2590p81655r66668m09842M16398
$$ 751622498 751660287 751870394 751711190 751426458 751677692 751700282 750918627 749951959 749542117 749958515
3903.7G49958515J065850R09150J72794m19140o96897o72102j60814M56333N77689
$$ 749958515 751024365 751933515 752106309 751687169 750990272 750318170 750157356 750613689 751191378
3922.1G51191378M55558M40478K33829m9829J43528M59134L21269j967k25722j78039
$$ 751191378 751646936 752087414 752321243 752271414 752414942 752874076 753195345 753193378 752967656 752789617
3942.5G52789617J6331j02102k81871j94788j64747l75748o45339q63731r84132r25184
$$ 752789617 752805948 752703846 752421975 752227187 752062440 751686692 751041353 750177622 749193490 748268306
3962.9G48268306q37207r44554j183808j368523j341104r78172n35369m16517o21677
$$ 748268306 747431099 746486545 745302737 743934214 742593110 741614938 741079569 740663052 740041375
3981.2G40041375r36091j165151j267732j384437j651168k045571k386809k457857
$$ 740041375 739105284 737940133 736672401 735287964 733636796 731591225 729204416 726746559
3997.5G26746559
$$ 726746559
##END=$$ End of the data block
