##TITLE=Methaldehyde $$ Begin of the data block
##JCAMP-DX=5.00 $$ ACD/SpecManager v 10.08
##SPECTROMETER/DATA SYSTEM=Alpha
##DATE=28 Apr 2014 10:44:08
##DATA TYPE=INFRARED SPECTRUM
##DATA CLASS=XYDATA
##ORIGIN=
##OWNER=
##NPOINTS=1667
##FIRSTX=599.63549805
##LASTX=3997.56909180
##MAXX=3997.56909180
##MINX=599.63549805
##MAXY=0.66369820
##MINY=0.44988474
##XFACTOR=1.0000000000
##YFACTOR=1.000000000000000e-9
##FIRSTY=0.66369820
##DELTAX=2.03957605
##XUNITS=1/CM
##YUNITS=ARBITRARY UNITS
##XYDATA=(X++(Y..Y))
599.6F63698196j665830j410723j434684j694917j709342j814485k223372k454579
616F49290264k588451k937854l516554m678250o730854r333194j1195004p708788O082416
634.3F06683731K1518350K2473156J1167944J554370j970411k684951k670884k364933
650.6F53706372k166331k095580j977265j845181j766920j632869j346827j363456
666.9F39511943j492858j146376j200795j293660r86814q26597r60648j101971j256585
685.3F29245639j459003j491606j365602j396954j595557j652777j357853r13620q37982
703.7F17174685j029134j092553j150787j398742j829267k215623k327621k113581
720F04017377j555145p42972k04980l12030p22766j117528j346648j455545j905203
$$ y = [663698196, 662032366, 660621643, 659186959, 657492042, 655782700, 653968215, 651744843, 649290264, 646701813, 643763959, 640247405, 635569155, 628838301, 619505107, 608310103, 600601315, 606683731, 628202081, 650675237, 661843181, 663397551, 661427140, 658742189, 656071305, 653706372, 651540041, 649444461, 647467196, 645622015, 643855095, 642222226, 640875399, 639511943, 638019085, 636872709, 635671914, 634378254, 633391440, 632564843, 631604195, 630502224, 629245639, 627786636, 626295030, 624929428, 623532474, 621936917, 620284140, 618926287, 618012667, 617174685, 616145551, 615052998, 613902211, 612503469, 610674202, 608458579, 606130958, 604017377, 602462232, 601719260, 601514280, 601202250, 600479484, 599361956, 598015308, 596559763, 594654560]
738.3E94654560k563834k592087j801073p99656r8527K50459K92361o1512p98464j710773
758.7E84771454k854883m232586n304038n736172n400897l820240j265228J301766
775E57459176M241049O753802O507874M411995K704024J549602O15060j03295p25746
793.4E83413541j261592j611948j838684j951694j950741j980782j989901j776218
809.7E69051981j324713q56281n53727m77969p36356j138628j592099k263248k969385
828.1E57139575l677070m693865o159306p965565q891999o034375J709342Q910835
844.4E30337572Q242846K010703R28521R148419J7217338J5394389P090390N55516
860.7E90925694j958788k335071k176822j824736j522184j461506j337170r79185o54996
$$ y = [594654560, 592090726, 589498639, 587697566, 586897910, 586799383, 587049842, 587342203, 587280691, 586482227, 584771454, 581916571, 577683985, 572379947, 566643775, 561242878, 557422638, 556157410, 557459176, 561700225, 568454027, 574961901, 579373896, 582077920, 583627522, 584242582, 584139287, 583413541, 582151949, 580540001, 578701317, 576749623, 574798882, 572818100, 570828199, 569051981, 567727268, 566870987, 566317260, 565839291, 565102935, 563964307, 562372208, 560108960, 557139575, 553462505, 548768640, 542609334, 534643769, 525751770, 519717395, 521426737, 530337572, 538580418, 540591121, 541519642, 550668061, 567885399, 583279788, 590370178, 590925694, 588966906, 586631835, 584455013, 582630277, 581108093, 579646587, 578309417, 577330232, 576675236]
879.1E76675236n92232p66158r68992j031816r29058q07226q42988q92103q52883q32975
899.4E68158805q88526r98974j087427j113057j141191j214325j214743j061082r34064
917.8E58505416r49800j001358j072705j142979j188755j239836j298964j340985j331508
936.2E47938526j391828j563788j714527j798928j821637j833618k012551k391875
952.5E33409774k779782l182232l748894m503965n442917o310881o302833m662842
968.8D96475428r28759O510407J7356812K3936093J9423843Q729875O40273k752841
985.1E69391131l608048l561496l260732k980411k744615k497673k249241k078593
1001.4E46410322j974582j842440j734018j709521j710415j675427j617133j634896
$$ y = [576675236, 576083004, 575316846, 574347854, 573316038, 572386980, 571579754, 570736766, 569844663, 568991780, 568158805, 567270279, 566271305, 565183878, 564070821, 562929630, 561715305, 560500562, 559439480, 558505416, 557555616, 556554258, 555481553, 554338574, 553149819, 551909983, 550611019, 549270034, 547938526, 546546698, 544982910, 543268383, 541469455, 539647818, 537814200, 535801649, 533409774, 530629992, 527447760, 523698866, 519194901, 513751984, 507441103, 501138270, 496475428, 495546669, 502057076, 519413888, 543349981, 562773824, 571503699, 572143972, 569391131, 565783083, 562221587, 558960855, 555980444, 553235829, 550738156, 548488915, 546410322, 544435740, 542593300, 540859282, 539149761, 537439346, 535763919, 534146786, 532511890]
1017.7E32511890j716673j712621j728952j881599k053797k254546k424598k390325
1034.1E16348779k278626k374053k582729k694785k882362l235340l514170l746927
1050.4D93039787m206360m798799n309850n799413o324291o529957n686790l659606
1066.7D50724721n36829M684657J0981828J4142394J2661397R105176N888283L609419
1083E11261046J957178L76105j627206l513754l471732L84033Q440315J6715885J6135990
1101.4E46657860L707171r977162j4847577j2291133p979155l776669J052260N930245
1117.7E08475840R952128J3074994J4832318J4507711J2210727Q679330M697919J028955
1134E87459922j827359l861606n358100o589771p898748r434461j0924638j1981904
$$ y = [532511890, 530795217, 529082596, 527353644, 525472045, 523418248, 521163702, 518739104, 516348779, 514070153, 511696100, 509113371, 506418586, 503536224, 500300884, 496786714, 493039787, 488833427, 484034628, 478724778, 472925365, 466601074, 460071117, 454384327, 450724721, 450187892, 454872549, 465854377, 479996771, 492658168, 501763344, 507651627, 511261046, 513218224, 513594329, 511967123, 508453369, 504981637, 505365670, 513805985, 530521870, 546657860, 550365031, 540387869, 525540292, 513249159, 505270004, 501493335, 502545595, 508475840, 518427968, 531502962, 546335280, 560842991, 573053718, 581733048, 586430967, 587459922, 585632563, 581770957, 576412857, 569823086, 561924338, 552489877, 541565239, 529583335]
1150.3E29583335j2004435j0426700p572711m646808k302944J64956L289908O527334
1166.6E02611935R417117J1665046J2431204J1144698Q522987N919218L860891K042890
1182.9E67615986L43084j017809j826226k126694k114296j990736k118766k193689
1199.3E54570854m89891M224181R635449J1398136Q537531M072249P32303q90613j130342
1217.6E90659857l92080O71745J163542Q37982K70486k11060n64993p03633p73191
1236E90958655r40621j069129j001477q37564p71821p94828p46786o37353n55336m86553
1256.4E83117187m92752o13749p16090q13007r43303j006663r73880q97825q43704
1274.7E75816214p95305p32839o63399n87225m72129l56734l16977l50535m84228o70672
$$ y = [529583335, 517578900, 507152200, 499579489, 494932681, 492629737, 492794693, 496084601, 502611935, 512029052, 523694098, 536125302, 547270000, 555792987, 561712205, 565573096, 567615986, 567959070, 566941261, 565115035, 562988341, 560874045, 558883309, 556764543, 554570854, 554080963, 558305144, 567940593, 579338729, 587876260, 591948509, 592680812, 591790199, 590659857, 590267777, 590939522, 592103064, 592941046, 593211532, 593000472, 592435479, 591731846, 590958655, 590018034, 588948905, 587947428, 587109864, 586338043, 585543215, 584796429, 584159076, 583603740, 583117187, 582624435, 582010686, 581294596, 580481589, 579538286, 578531623, 577557743, 576659918, 575816214, 575020909, 574288070, 573624671, 573037446, 572565317, 572208583, 571891606, 571541071, 571056843, 570386171]
1295.1E70386171q22127r39071r61065q27014p16269p67947q99732j031816j134932
1313.5E62286198j208484j338601j556099j876235k465069l469467n041897p222414
1329.8E38107932r776473j1163116p120132N982935K0745933K1939397J1712730L047705
1346.1E73476911o24597j778186k221823k565383l080667l916561n228460o698966
1362.4E47362268p105172p570028j0738432j3911248r067654P090866K0647586J8976152
1378.7E45684338J0377228M578948K726614K473772J657546m5002j860678l645241
1395.1E61947525n121351o825745q103072p269383l464937K517879O928384P701755
1411.4E48311055N235076K328097J214087J001180L30567l56376r24528j735985l146470
$$ y = [570386171, 569564044, 568624973, 567663908, 566836894, 566120625, 565352678, 564452946, 563421130, 562286198, 561077714, 559739113, 558183014, 556306779, 553841710, 550372243, 545330346, 538107932, 528331459, 517168343, 510048211, 516031146, 536777079, 558716476, 570429206, 573476911, 572852314, 571074128, 568852305, 566286922, 563206255, 559289694, 554061234, 547362268, 540257096, 532687068, 521948636, 508037388, 498969734, 506060600, 526708186, 545684338, 556061566, 560640514, 563367128, 565840900, 567498446, 567453444, 565592766, 561947525, 556826174, 550000429, 541897357, 534627974, 531163037, 533680916, 540609300, 548311055, 553546131, 555874228, 557088315, 558089495, 558420062, 558063686, 557139158, 555403173, 552256703]
1429.7E52256703m553675n300939o335259o459057m635394l924429m262388l421426
1446E13364136k43366L184796L448427J690328P30633J537860K377033K624452L359854
1464.4E32074153M927338O477356P615566P924378O040454L918409K962470K314210
1480.7E74254334J648009J018345N18501K67804L96013O24359O94096N67853J91808
1499.1E80181122n9486P4566K22325j37508k11715J62661K66909L13163M20094M09662
1519.5E81641793J43290j36018j36554j39415j32561j63973l52203l11017p6890j94371
1539.9E80142081m04716j19686P4148N067o2406l4929l9339O0141J53303j08182j22428
1562.3E79543054r2268j63138j97470l54230l08574j50680l59833m81725l71277l80338
$$ y = [552256703, 547703028, 542402089, 536066830, 529607773, 524972379, 521047950, 516785562, 513364136, 513120770, 516305566, 519753993, 521444321, 522174954, 523712814, 526089847, 528714299, 532074153, 537001491, 543478847, 551094413, 559018791, 565059245, 568977654, 571940124, 574254334, 575902343, 576920688, 577439189, 577706993, 578103006, 578727365, 579421461, 579989314, 580181122, 580121636, 580196202, 580418527, 580281019, 580069304, 580231965, 580498874, 580812037, 581232131, 581641793, 581785083, 581649065, 581512511, 581373096, 581240535, 581076562, 580724359, 580413342, 580336452, 580142081, 579737365, 579617679, 579691827, 579696894, 579634488, 579599559, 579560220, 579620361, 579773664, 579665482, 579543054, 579450786, 579287648, 579090178, 578735948, 578427374, 578276694, 577916861, 577435136, 577063859, 576683521]
1582.7E76683521l05950j93119k72155m61459n76914n61058m93467m65214m18306k25723
1603.1E72710156K7895K25008L67403M07755M40836M78924K92122J31905J96695J31667
1623.5E75410366n305J7345P9096J41859J53839J9193L517J10328L0339j06991k41101
1645.9E75612485k54213L8683M3631m25935k23577O4850n5075k10464k13265j34647
1666.3E74242473j67251k13623j02520j39713k32220j98364k24412l22878n67377o43611
1686.7E71430504n29408n76139o18755j017809j625836j991332k770960k804637k689898
1705.1E56805730k515614j156330M93049J825810K732456L197491K734303J732230
1721.4E65849125J036764M91976L5584l27229n73516j021683j329363j219332j584709
$$ y = [576683521, 576377571, 576184452, 575912297, 575450838, 574873924, 574312866, 573819399, 573354185, 572935879, 572710156, 572738051, 572963059, 573330462, 573738217, 574179053, 574657977, 574950099, 575082004, 575278699, 575410366, 575405061, 575422406, 575501502, 575643361, 575797200, 575816393, 575819910, 575930238, 575960577, 575853586, 575612485, 575358272, 575396955, 575440586, 575014651, 574791074, 574855924, 574800849, 574590385, 574377120, 574242473, 574075222, 573861599, 573759079, 573619366, 573387146, 573188782, 572964370, 572641492, 572074115, 571430504, 570901096, 570324957, 569706202, 568688393, 567062557, 565071225, 562300265, 559495628, 556805730, 554290116, 553133786, 553626835, 555452645, 558185101, 561382592, 564116895, 565849125, 566885889, 567377865, 567413449, 567086220, 566512704, 565491021, 564161658, 562942326, 561357617]
1739.7E61357617j821577j439452q07643O5624J208842K458990L217399L443778L082096
1758.1E70765674K233505J510740R81509O16849L88443L01838J74701L8386J13368
1776.5E77125013J44541Q5473J16945J20759O079r7513j20640k7835N7459L3736l5226
1798.9E77408791n0962L4690K8252p9751j07765q8394j0073J22428J44184Q1122j6273
1821.3E77466249j80184k61426j28031J7345P9751R1076N9485J5736m4882j18673k26498
1843.8E76769948j89781j6749R9718K07723K52843K21550J25527j192k4020J8119o2406
1866.2E77401280j63734l1173R3818K1517n6922r4474j34229j18375o3062l3498o6161
1888.6E76754987j01208q0526r3878r4473k9206J430k5809j0848L7492K2232K0862
$$ y = [561357617, 559536040, 558096588, 557288945, 557354569, 558563411, 561022401, 564239800, 567683578, 570765674, 572999179, 574509919, 575491428, 576108277, 576496720, 576798558, 576973259, 577011645, 577125013, 577269554, 577355027, 577471972, 577592731, 577598810, 577501297, 577380657, 577352822, 577410281, 577444017, 577408791, 577357829, 577392519, 577420771, 577341020, 577233255, 577144861, 577134788, 577257216, 577401400, 577482522, 577466249, 577286065, 577024639, 576896608, 576913953, 576993704, 577084780, 577144265, 577160001, 577115119, 576996446, 576769948, 576580167, 576563418, 576663136, 576870859, 577123702, 577345252, 577470779, 577469587, 577445567, 577463686, 577401280, 577237546, 577206373, 577300191, 577321708, 577264786, 577170312, 577036083, 576917708, 576854646, 576821148, 576754987, 576653779, 576573253, 576479375, 576384902, 576355696, 576357126, 576331317, 576320469, 576357961, 576380193, 576401055]
1911.1E76401055N0127O855o8784o9141j4484K3782K7776m0591j38521k10345k64823
1933.5E75702906k48671j68204j20104r4890j073J11818R2805n2393j88172k30133
1953.9E74803889j95682j24276l5405N2750J23918J47462J36435J24156J18554J51277
1974.3E75303078J58608Q0585j3292m4346J2398Q8811J22488J36137J65343J56999
1994.7E76166809Q5592J9371L100M3332N7936L3021M9114L0101n4419p868J38044J46926
2019.2E76711059Q2969N4181k265n9247l5465O0j5438n9247j01149r3937j06335j60634
2043.6E76214552j55568o7234P9274K18093K45512J67131J08064Q6545K0445n1618
2064E76865196n5074l2723j0372J669J2935N6445O3479L9041N5790Tj907k6286j0550
$$ y = [576401055, 576451182, 576458037, 576389253, 576320112, 576305628, 576329410, 576357186, 576316595, 576178074, 575967729, 575702906, 575454235, 575286031, 575165927, 575071037, 575069964, 575181782, 575274587, 575222194, 575034022, 574803889, 574608207, 574483931, 574448526, 574501276, 574625194, 574772656, 574909091, 575033247, 575151801, 575303078, 575461686, 575542271, 575528979, 575484633, 575497031, 575585842, 575708330, 575844467, 576009810, 576166809, 576252401, 576271772, 576274872, 576318204, 576376140, 576409161, 576458275, 576488376, 576433957, 576426089, 576564133, 576711059, 576794028, 576848209, 576845944, 576786697, 576751232, 576751292, 576735854, 576676607, 576575458, 576481521, 576375186, 576214552, 576058984, 575991750, 576071024, 576289117, 576534629, 576701760, 576809824, 576896369, 576916814, 576865196, 576810122, 576777399, 576767027, 576768696, 576781631, 576838076, 576901555, 576940596, 576996386, 577052176, 577050269, 577023983, 577013433]
2090.5E77013433m292K3902M5001K4260k7061l6895M2081M3094n3048k1816R2209J06156
2115E77247024K6941m6671l1352M590j6391k1935K8849N1617l7133j11938n8174N901
2139.5E77041328m530n0843q0347o3956l9160o4850q8691l4512K3842J6272n006M887
2164E76654434R001L755Q642j1742o5148j12891j22845j14143p0989p868J848J6153
2188.4E76188207M4226L5286P451l7432o0201m4047m6611o4254n7697m1485l5882n4062
2212.9E75833499q3804p3492j8776P3076J45495J37329J25169J11819O6817N2213O6996
2235.4E76436341N6028L4034L1889r000l9995j5259n4061j10030o8665j848p808n2989
2259.8E76198637l9994r358m8816q7321p7307p1645n8174K742L6597k921j1682j4663
$$ y = [577013433, 577009141, 577033043, 577078044, 577102304, 577075243, 577038348, 577080429, 577123523, 577070475, 577048659, 577140868, 577247024, 577273965, 577227294, 577195942, 577200532, 577184141, 577162206, 577191055, 577242672, 577205539, 577093601, 577035427, 577041328, 577036798, 576985955, 576905608, 576841652, 576802492, 576737642, 576648951, 576614439, 576638281, 576654553, 576649547, 576654434, 576663435, 576667190, 576675832, 576664090, 576598942, 576486051, 576363206, 576249063, 576178074, 576170206, 576172054, 576188207, 576232433, 576267719, 576275170, 576237738, 576177537, 576133490, 576086879, 576022625, 575964928, 575923443, 575887561, 575833499, 575749695, 575676203, 575657427, 575730503, 575875998, 576013327, 576138496, 576250315, 576317132, 576369345, 576436341, 576492369, 576526403, 576558292, 576549292, 576509297, 576494038, 576439977, 576329947, 576261282, 576259434, 576251626, 576198637, 576158643, 576149285, 576100469, 576013148, 575935841, 575864196, 575806022, 575808764, 575845361, 575842440, 575830758, 575816095]
2284.3E75816095o9201r3758o5983n1021j12355j73211j33574p9811p9274p5519o2704
2306.7E74819684q1360p4148J3172L3260q1182j73450k08914j53601m1842n3525k2889
2329.2E73975205M6134q0943j12831O020k4855n3883J5199P2599J11639L4988j44362
2351.6E73844910l58522m40359k04444r358q3506K1577L38673L79682J62601R5010
2372E73746264K76148M68195M80115M30107M08411L29793K18630J55806R8348J7643
2392.4E76629460j0789n185j9610O258N4479L3617m0114o8247j3709j3292j15037j41502
2416.9E76296329n5253M947J4544K9266K6822n424l9876l9637j0788p511n602N126
2441.3E76212943l1472r1672p9810k0743P689K2948J8478N4299J31667R3520O795o974
$$ y = [575816095, 575746894, 575653136, 575587153, 575536132, 575423777, 575250566, 575116992, 575037181, 574957907, 574882388, 574819684, 574738324, 574664176, 574677348, 574710608, 574629426, 574455976, 574247062, 574093461, 574051619, 573998094, 573975205, 574021339, 573940396, 573827565, 573833585, 573808730, 573754847, 573770046, 573842645, 573954284, 573989272, 573844910, 573486388, 573046029, 572841585, 572832227, 572748721, 572770298, 573108971, 573488653, 573651254, 573746264, 574022412, 574490607, 574970722, 575400829, 575809240, 576139033, 576357663, 576513469, 576611817, 576629460, 576618671, 576613486, 576593876, 576600134, 576654613, 576688230, 576648116, 576579869, 576566160, 576552868, 576437831, 576296329, 576241076, 576246023, 576260567, 576289833, 576316655, 576311231, 576271355, 576231718, 576220930, 576213419, 576207817, 576212943, 576181471, 576089799, 576009989, 575989246, 575996935, 576019883, 576038361, 576092660, 576224327, 576317847, 576324642, 576317668]
2465.8E76317668l2306r7215j35183r9182j0729J0669m9829n4598J9550P2718M6730
2488.3E75988293p3910j56581m5121Q2254Q1957M8220k8610q7083k9921K6583M471
2510.7E75810552n3347j03175r7633n2273r358K1279L5405L7074l8802j40250j17719
2533.1E75291753p7784o9618m5777j02699j44362m4882R3639J03354N245k7776m9710
2555.6E74931383q0228J0252Q4520n722j19806j07586k623L4154n9605j27673j03235
2578E74453831p5341r3698r8705j9610Q344n5790p0095p0572r9182o3181j3768o5208
2602.5E73737025p8082Q345j0550r2149p8142n9783o1929m0293m0174l3855q35k6643
2626.9E73222935p4804k2590J0967o6041r0361r954L0577l5167n3942J6272k1636j65880
$$ y = [576317668, 576285362, 576188147, 576052964, 575953782, 575943053, 575953722, 575903893, 575849295, 575868845, 575941563, 575988293, 575914383, 575757802, 575712681, 575794935, 575876892, 575925112, 575896502, 575809419, 575779498, 575806081, 575810552, 575757205, 575654030, 575556397, 575504124, 575494766, 575516045, 575551450, 575588524, 575549722, 575409472, 575291753, 575213969, 575144351, 575098574, 574995875, 574851513, 574806631, 574900270, 575003624, 575008869, 574981093, 574931383, 574851155, 574861407, 574945927, 574940205, 574820399, 574712813, 574710190, 574744344, 574684739, 574557066, 574453831, 574378490, 574284792, 574186087, 574166477, 574174821, 574119031, 574048936, 573978364, 573879182, 573816001, 573802233, 573737025, 573658943, 573667288, 573656738, 573564589, 573486447, 573426664, 573364735, 573324442, 573284268, 573250413, 573249578, 573222935, 573148131, 573125541, 573136508, 573070467, 572980106, 572970152, 573000729, 572965562, 572911620, 572927892, 572906256, 572740376]
2651.4E72740376k04742j29819r9540j33276j31845o5565l4809p7546j5795J58965
2671.8E72006404J80185N1201l6836o9618o7055l4273p391J1980o973q1003n7757N1737
2696.3E71940601N4657O438p16o1035j85787k40982k35021k67744k91825k32756j74999
2718.7E70310831k35915l20971k80559r6441J06097J70946J72019K12848K30551K34067
2739.1E70503473K24293J14917m4107q3923n9009j65165k99036k74658j53065j03950
2759.5E69659770j84358k80618l75808n25474n50687l54350j76430j34051k16365m13060
2779.9E66448569n06997m53293m74453n94616o36280n53071m91977m84526m33087m25578
2800.3E61394691n92708q25465j035571j206279j268625j335859j491189j687646j912177
$$ y = [572740376, 572535634, 572405815, 572306275, 572172999, 572041154, 571975589, 571940780, 571863234, 571847439, 572006404, 572186589, 572237790, 572200954, 572131336, 572064281, 572030008, 572022617, 572034597, 572027624, 571946621, 571888864, 571940601, 571995258, 572001696, 572000980, 571939945, 571754158, 571513176, 571278155, 571010411, 570718586, 570485830, 570310831, 570074916, 569753945, 569473386, 569376945, 569483042, 569653988, 569826007, 570038855, 570269406, 570503473, 570727766, 570842683, 570798576, 570714653, 570655644, 570490479, 570191443, 569916785, 569763720, 569659770, 569475412, 569194794, 568818986, 568293512, 567742825, 567388475, 567212045, 567077994, 566861629, 566448569, 565941572, 565488279, 565013826, 564419210, 563782930, 563229859, 562737882, 562253356, 561820269, 561394691, 560801983, 559976518, 558940947, 557734668, 556466043, 555130184, 553638995, 551951349, 550039172]
2818.7E50039172k118170k356708k703786l142297l616631m167259m890382n690337
2835E21353602o345033o590963o372928n925685n456359m929930m125803k926261j483649
2853.3D77196991j40577Q24779J282692J236260R06169O18011O24150J059920J844972
2871.7D85453367K621234K894729K375335J247346p987j034498j763344k275437k620995
2890.1D86889750k745807k688945k532661k350181k314657k365977k364277k414197
2906.4D67113048k577663k719700k800614k849370k747983k272993j259983Q7947J437634
2924.7D51410323K494425L042787L162414K992243K637654K109051J411229R29296
2941D70189422J050473J360088J142740N71013L94195Q71629J752287K676040L408641
$$ y = [550039172, 547921002, 545564294, 542860508, 539718211, 536101580, 531934321, 527043939, 521353602, 515008569, 508417606, 502044678, 496118993, 490662634, 485732704, 481606901, 478680640, 477196991, 477056414, 477881193, 479163885, 480400145, 481306314, 481924325, 482548475, 483608395, 485453367, 488074601, 490969330, 493344665, 494592011, 494584024, 493549526, 491786182, 489510745, 486889750, 484143943, 481454998, 478922337, 476572156, 474257499, 471891522, 469527245, 467113048, 464535385, 461815685, 459015071, 456165701, 453417718, 451144725, 449884742, 449972689, 451410323, 453904748, 456947535, 460109949, 463102192, 465739846, 467848897, 469260126, 470189422, 471239895, 472599983, 473742723, 474313736, 474707931, 475579560, 477331847, 480007887, 483416528]
2959.4D83416528M039794M674792N289078N771637N911469N699754N219042M305780
2975.7E24327874K837777J034499r73881k937436l332734k70665N414784R853840R879649
2994.1E45833707N944967J589954N68867L216922N663216M994214K725124J046419
3010.4E71583390L97504M80115P69794R76086J163006J192331R57906O48856L55780
3028.7E78524768J71721R6262J20878J60217m5478j48118P7844K06053J51933P8082
3049.1E79394162J14321K23101K36630L10838L83556K38359O2704k026R9420L37362
3069.5E81398427M71056L68595J44601L7074J72436L84152M45187M28856L82244K66910
3089.9E84499538K47717K58684J44482N7697Q9049J69218J30772m7266m4644J63078
$$ y = [483416528, 487456322, 492131114, 497420192, 503191829, 509103298, 514803052, 520022094, 524327874, 527165651, 528200150, 527226269, 524288833, 520956099, 520685434, 526100218, 535954058, 545833707, 551778674, 553368628, 553937495, 557154417, 562817633, 567811847, 570536971, 571583390, 571980894, 572461009, 573230803, 574206889, 575369895, 576562226, 577520132, 578168988, 578524768, 578696489, 578792751, 578913629, 579073846, 579028368, 578880250, 578958094, 579164147, 579316080, 579394162, 579508483, 579731584, 579968214, 580279052, 580662608, 580900967, 580963671, 580961645, 581061065, 581398427, 581869483, 582238078, 582382679, 582419753, 582592189, 582976341, 583421528, 583850384, 584232628, 584499538, 584747255, 585005939, 585150421, 585208118, 585297167, 585466385, 585597157, 585549891, 585505247, 585668325]
3110.3E85668325J61767n7756q6844K0444P6771K17855L03387J29760q9586j28389
3130.7E86215734o6459l3021o9618r3043O2526K37286J62243n4180j94788k20299q2731
3153.2E85863650J52886K15947P4447k4319K0623N1200m053j5258L9994L4154m7505
3175.6E86361766q4877m3631k5451k3127n602m8399n2095J0371J8835k2530m5180j1683
3200.1E86028397k3961q0526q3685k7179J06394J91629M9770r7156J9431K00153J87873
3222.5E86471140P7665O6996J13308J5199j24812N4479L07322K38597J33932J68740
3242.9E87522566J11997K0028J39534K03073k4915j51157M5478K09809J37150M4048
3263.3E88257611L3498j00375m01556l38972Q8930K19644J14142Q4281P3612K8908
$$ y = [585668325, 585830092, 585772336, 585685492, 585705936, 585782707, 586000562, 586303949, 586433709, 586344123, 586215734, 586149275, 586116254, 586046636, 585953593, 586016119, 586253405, 586415648, 586361468, 586166680, 585946381, 585863650, 586016536, 586232483, 586306930, 586282611, 586303234, 586354434, 586350381, 586335123, 586375117, 586409271, 586361766, 586276889, 586233258, 586207807, 586184680, 586179078, 586130679, 586078584, 586088955, 586107790, 586085260, 586040080, 586028397, 586004436, 585923910, 585840225, 585813046, 585919440, 586111069, 586160839, 586063683, 586083114, 586283267, 586471140, 586548805, 586615801, 586729109, 586744308, 586619496, 586673975, 586981297, 587219894, 587353826, 587522566, 587634563, 587654591, 587794125, 587997198, 587972283, 587821126, 587866604, 588076413, 588213563, 588257611, 588291109, 588190734, 587789178, 587450206, 587539136, 587758780, 587872922, 587957203, 588030815, 588059723]
3283.7E88059723k9027n8651p5519n7995j1087l4094L5405K06650M4226k81155j77622
3306.1E87620854K20299M48883L66866J48297M4226M1783M4763m9829j67072N245K27928
3328.6E88952243J44780L874n8710j71423j55092J7584Q8870J44184J36375p3373l9339
3351E88989973K57194J87516r8407j52886j07765q8155j30177j31905O8486K64168
3371.4E89058042K21014N0664l2545Q405J17898K23815J34289j50382k82765j17778
3391.8E89230657J12056J27554j51992l25977P9631N66245M09126K0623n7280J0967
3412.2E90021610P0811J23977O8426q0108q3924M7028j6212j86920j57058j26779j82570
3434.6E89498281m1663K15113K84016J92642R0123L0517O8247R2864M1545R239K4736
$$ y = [588059723, 588030696, 587972045, 587896526, 587838531, 587827444, 587793350, 587828755, 588035405, 588079631, 587798476, 587620854, 587841153, 588290036, 588656902, 588805199, 588849425, 588891208, 588935971, 588886142, 588719070, 588724315, 588952243, 589097023, 589100897, 589042187, 588870764, 588715672, 588733256, 588822126, 588966310, 589102685, 589029312, 588989973, 589247167, 589434683, 589336276, 589183390, 589075625, 588987470, 588857293, 588725388, 588793874, 589058042, 589279056, 589329720, 589297175, 589305580, 589423478, 589647293, 589781582, 589631200, 589348435, 589230657, 589342713, 589470267, 589318275, 588992298, 589071929, 589638174, 590047300, 590067923, 590010643, 590021610, 590092421, 590216398, 590284824, 590204716, 590120792, 590167820, 590151608, 589964688, 589807630, 589680851, 589498281, 589456618, 589671731, 589955747, 590148389, 590238512, 590269029, 590337276, 590430140, 590471685, 590480924, 590505660]
3457E90505660J8477n7816j32621j96338j76787O5863L22640L19183R6977j58906j60098
3479.5E90446234O6697J44303R4712L5405n0843o9022l8385p8082j79529k02418o8605
3501.9E90100467K49684M78387K78473o2823j07944R8824J49846m9829k12610k28942
3522.3E90693533O259L08752L08633J42753n3108k10702j49191J0312m8161k46644
3542.7E90762436j92046K26200N22971L02672o1154j80602r8705l7015r3996P5400
3563.1E91226161L57508J36495k09212o6996J35243J04546r298j19388k34187k14874
3583.5E91105998J17063M04537K01225j19L2961J6213l6240m4823l9875k563J07229
3605.9E91861606J81675Q2254k8670r2327J2278J82629m6969k98738q2970M71473O68168
$$ y = [590505660, 590524137, 590466321, 590333700, 590137362, 589960575, 590026438, 590349078, 590668261, 590765238, 590606332, 590446234, 590512931, 590657234, 590751946, 590787351, 590736508, 590667486, 590629101, 590551019, 590371490, 590169072, 590100467, 590350151, 590828538, 591107011, 591044188, 590936244, 591035068, 591184914, 591135085, 590922475, 590693533, 590699792, 591008544, 591317177, 591459930, 591406822, 591196120, 591046929, 591057241, 591009080, 590762436, 590570390, 590796590, 591319561, 591622233, 591561079, 591380477, 591281772, 591244757, 591150761, 591226161, 591583669, 591720164, 591510952, 591443956, 591579199, 591683745, 591674447, 591555059, 591320872, 591105998, 591223061, 591627598, 591828823, 591828704, 591861665, 591877878, 591841638, 591796815, 591756940, 591754377, 591861606, 592043281, 592125535, 592096865, 592004538, 592016816, 592199445, 592152476, 591853738, 591770768, 592242241, 592910409]
3628.4E92910409K3425k15948l9756p0870j04368k742p033j18494M4942J50859j43766
3650.8E92426658M6372L51071P332k66135o616P4744p6115J21772K78414m0233J50084
3673.2E93067348L56436n9962j99497k31982k54809J1384L44575L21269L0040j09672
3693.6E93275130j28210k7358J31786M7564j59025j64986J5319M02689K67565l47138
3714E93313336l55661r9897j4663l1829N1976N9068L0160J96636K59101J11461k62678
3736.5E93257010n70357q8632O55293K85924k43723M11272L62575n25534n25713j06514
3756.9E92911601q7261k46525j05023Q4877J95265J34885j73032k10703K5272J66715
3777.3E92696071Q1181j03533q8573J6988m7922j78814m4346K04921R4592R8586N28634
$$ y = [592910409, 592933834, 592717886, 592678130, 592607260, 592502892, 592500150, 592493117, 592374623, 592419565, 592570424, 592426658, 592473030, 592824101, 592831433, 592565298, 592558682, 592633426, 592557311, 592679083, 592957497, 592917264, 593067348, 593423784, 593363822, 593164325, 592932343, 592677534, 592688918, 593033493, 593354762, 593384802, 593275130, 593146920, 593119562, 593251348, 593298912, 593139887, 592974901, 592990220, 593392909, 593660474, 593313336, 592957675, 592857778, 592843115, 592811286, 592863262, 592922330, 592952490, 593149126, 593408227, 593519688, 593257010, 592686653, 592598021, 593253314, 593539238, 593295515, 593706787, 594069362, 593543828, 593018115, 592911601, 592824340, 592577815, 592472792, 592557669, 592752934, 592887819, 592714787, 592504084, 592529356, 592696071, 592777252, 592673719, 592585146, 592602134, 592554212, 592375398, 592331052, 592535973, 592630565, 592729151, 593257785]
3799.7E93257785K34544j97828Q4341j53065m73738j15513K86638O6579j32680J78277
3820.1E93035340l2603k08199o0499r3401n5432j11937j25587K33590L05772p212j17004
3842.5E92762828k11775k41042O2764P38025R00864m37021q28266j24872K56896K57373
3862.9E93135774l2484l3021K21431O9916j62542k32637j00851l8326k41220l6299
3883.3E92549741R3699J79L10063K07961k93792k13325L5048J15156L02553K04921
3903.7E93312204j46985j24932j01149j89602K2650K11835J1563j42217K7955J12772
3924.1E92994094j3411j3173N9486L3974L6836R596m1842Q3327J85967N9425j23083
3946.5E93271196k55644j98782M9234P8976j25170o4850J62602J39951P570r9838k14338
$$ y = [593257785, 593492329, 593294501, 593378842, 593225777, 592752039, 592636526, 592923164, 592989743, 592857063, 593035340, 593002737, 592794538, 592734039, 592640638, 592585206, 592473269, 592347682, 592581272, 592887044, 592879832, 592762828, 592551053, 592310011, 592372775, 593110800, 594011664, 593574643, 592746377, 592621505, 592878401, 593135774, 593103290, 593070269, 593291700, 593361616, 593199074, 592966437, 592865586, 592827260, 592586040, 592549741, 592643440, 592643619, 592953682, 593161643, 592867851, 592654526, 592689574, 592804730, 593107283, 593312204, 593165219, 593040287, 592939138, 592749536, 592772186, 592984021, 592995584, 592853367, 592881322, 592994094, 592980683, 592967510, 593026996, 593060970, 593097806, 593107402, 593065560, 593148887, 593334854, 593394279, 593271196, 593015552, 592816770, 592866004, 592944980, 592819810, 592754960, 592917562, 593057513, 593065083, 592965245, 592750907]
3969E92750907k12610j18255q35N4479k6405j32501j93835j31487l0041k5630p3373
3991.4E91860414j22250q7261p8618
3997.5E91572285
$$ y = [592750907, 592538297, 592420042, 592419207, 592473686, 592447281, 592314780, 592120945, 591989458, 591959417, 591933787, 591860414, 591738164, 591650903, 591572285]
##END=$$ End of the data block
