##TITLE=Membrana Ext Pokan $$ Begin of the data block
##JCAMP-DX=5.00 $$ ACD/SpecManager v 10.08
##SPECTROMETER/DATA SYSTEM=Alpha
##DATE=14 Dec 2016 09:24:42
##DATA TYPE=INFRARED SPECTRUM
##DATA CLASS=XYDATA
##ORIGIN=
##OWNER=
##NPOINTS=1765
##FIRSTX=399.77209473
##LASTX=3997.72216797
##MAXX=3997.72216797
##MINX=399.77209473
##MAXY=0.82052279
##MINY=0.36474833
##XFACTOR=1.0000000000
##YFACTOR=1.000000000000000e-9
##FIRSTY=0.75600207
##DELTAX=2.03965425
##XUNITS=1/CM
##YUNITS=ARBITRARY UNITS
##XYDATA=(X++(Y..Y))
399.8G56002069J169383J301765R80556M28439J08897n0246j75953m86017j157403
418.1G58121490r65118K92420N36740j17242p65085q19326m49002k93433j87755k06411
438.5G55147278o43015p73489l29495k05695j78278j58012r7453J81496J02341m9114
458.9G52996564J65939L52860J77443k6763q1420k60055m38094j68025J61588J66237
479.3G53046274J68801L11255L93331J84178R3937J99795J20938M9949L13878L91781
499.7G55274117J55747N7697l4868k7240k3007j74940l39448k92719j3709J76192J07765
522.2G54865587o2466j32203q1956O973l3319q8632j26183j84297k96772l60429m29809
544.6G53076494o10113p08044p82907q23617q23915o26087k47836J18136L65615N40018
$$ y = [756002069, 757171452, 758473217, 759453773, 759882212, 759991109, 759940863, 759764910, 759278893, 758121490, 757156372, 757448792, 757985532, 757868290, 757103205, 756283879, 755834877, 755541444, 755353689, 755147278, 754504263, 753730774, 753401279, 753195584, 753017306, 752859294, 752761841, 752943337, 753045678, 752996564, 753162503, 753515363, 753692806, 753666043, 753584623, 753324568, 752886474, 752718449, 752880037, 753046274, 753215075, 753526330, 753919661, 754103839, 754197776, 754397571, 754518509, 754568458, 754882336, 755274117, 755429864, 755487561, 755452693, 755425453, 755402446, 755227506, 754888058, 754595339, 754581630, 754757822, 754865587, 754803121, 754670918, 754588962, 754595935, 754562616, 754473984, 754347801, 754163504, 753866732, 753506303, 753076494, 752466381, 751758337, 750975430, 750151813, 749327898, 748701811, 748453975, 748572111, 748937726, 749477744]
565G49477744N90325N26189M59850K44618K1219j65880l56674o12497q16763j016736
585.4G48351395j224577j312137j227796j050651j081526j171828j153826p47502n8949
603.7G39322603O12914J194597J671612J807213J428425R58323Q88110J234591J421988
622.1G50540376J451134J409889J301348J182318J053333R52959Q37088P03871M87208
640.5G59919524L70801N10096Q85248J107872J100659R44019P32004O79195P81894
658.8G67031312R74596J102387J167536P48158K76744O30498P61628O72460O29246
677.2G73994565N72860N02587N05507M54366M23074M88460O84976P79093P17580P56681
697.6G79879749Q18610P80046P03514P82311Q35180Q26418P75397P16686O15836N58972
$$ y = [749477744, 750068069, 750594258, 751054108, 751298726, 751319945, 751154065, 750797391, 750184894, 749368131, 748351395, 747126818, 745814681, 744586885, 743536234, 742454708, 741282880, 740129054, 739381552, 739322603, 739935517, 741130114, 742801726, 744608939, 746037364, 746995687, 747883797, 749118388, 750540376, 751991510, 753401399, 754702747, 755885065, 756938398, 757891357, 758728445, 759432316, 759919524, 760290325, 760800421, 761685669, 762793541, 763894200, 764838219, 765570223, 766249418, 767031312, 768005908, 769108295, 770275831, 771023989, 771300733, 771931231, 772692859, 773365319, 773994565, 774567425, 775070012, 775575519, 776029885, 776452959, 776941419, 777626395, 778405488, 779123068, 779879749, 780698359, 781478405, 782181919, 782964230, 783799410, 784625828, 785401225, 786117911, 786733747, 787292719]
718G87292719P63953J063704J322150J452148J533449J563609J600682J496017J248837
736.3G99337268J037240Q35717P41124P39217P82251P43687P15613O65129O29127O01649
756.7H06828022N43416N00083M20749L95417L84390M47631M81248M89175M63605M75586
777.1H11429322N68509O59525P59125P25448O19412M58419L89636L45587K57612K08795
797.5H16421390K53319K90156K46405K41042J64210J63973K23398K28703J59562K00986
817.9H18593144K52307J23799o8426k60294l89218n84126p21216p42912n07891n0724
838.3H15644443M18484P53522Q97765R35555P99298N82636L44514J46568j31428l81947
858.7H20009410n91278q05735r77755j243532j516640j724839j718879j508414j088381
$$ y = [787292719, 788056672, 789120376, 790442526, 791894674, 793428123, 794991732, 796592414, 798088431, 799337268, 800374508, 801210225, 801951349, 802690566, 803472817, 804216504, 804932117, 805597246, 806226373, 806828022, 807371438, 807871521, 808292270, 808687687, 809072077, 809519708, 810000956, 810490131, 810953736, 811429322, 811997831, 812657356, 813416481, 814141929, 814761341, 815219760, 815609396, 815954983, 816212595, 816421390, 816674709, 816964865, 817211270, 817452312, 817616522, 817780495, 818003893, 818232596, 818392158, 818593144, 818845451, 818969250, 818900824, 818640530, 818251312, 817667186, 816945970, 816203058, 815695167, 815644443, 816062927, 816816449, 817714214, 818649769, 819449067, 820031703, 820376217, 820522785, 820391357, 820009410, 819418132, 818612397, 817634642, 816391110, 814874470, 813149631, 811430752, 809922338, 808833957]
877.1H08833957o25968k92123j94609l51965o79136j125395j507699j769364j712740
895.4H00574958j394152q70645k81632K26319O27219R01818J080454J063526R42826
913.8H02870691P63595O61433N90264N42641N11408M70996M26173L17693J96576j4961
934.2H07336509k03907m02987o07312q22544j000345j125455j252472j292169j234353
952.5G99394965j045108r04262q68439r90272j203775j492381j820505k078056k251149
970.9G86741018k265453k245188k205789k234340k249240k171457j944185j616895
987.2G69808471j372576j227438j206756j246631j448989j748681k053499k261996
1003.5G57241905k448917k688765k892435l088295l233552l440202l642559l803372
$$ y = [808833957, 808207989, 807915866, 807721257, 807369292, 806690156, 805564761, 804057062, 802287698, 800574958, 799180806, 798310161, 798028529, 798254848, 798882067, 799783885, 800864339, 801927865, 802870691, 803634286, 804295719, 804885983, 805428624, 805940032, 806411028, 806837201, 807154894, 807351470, 807336509, 807132602, 806729615, 806122303, 805299759, 804299414, 803173959, 801921487, 800629318, 799394965, 798349857, 797445595, 796577156, 795586884, 794383109, 792890728, 791070223, 788992167, 786741018, 784475565, 782230377, 780024588, 777790248, 775541008, 773369551, 771425366, 769808471, 768435895, 767208457, 766001701, 764755070, 763306081, 761557400, 759503901, 757241905, 754792988, 752104223, 749211788, 746123493, 742889941, 739449739, 735807180, 732003808]
1019.8G32003808l917396m055083m160285m153848m028618l608823k938926k168178
1036.1G02972651j593829j319945j335084j424670j363695j054227n09083J32501Q54075
1054.5F95358694J407206J690507J732349J656830J477599J272798J178622J172364
1070.8G06946969J253605J345932J480401J616001J810193J960635K021551K052486
1087.1G20487773K108396K269983K407729K448082K334655K142131J823604J436234
1103.5G37458587J068294P55787N67257N06997N65171O23405O93143O93857O58751
1121.8G43591249O69301P91728J149833J781881K338946K475977K433121K259195J888454
1140.2G59379685J295507N90920n4478n64158r36628j223981j328051j237273r48370
$$ y = [732003808, 728086412, 724031329, 719871044, 715717196, 711688578, 708079755, 705140829, 702972651, 701378822, 700058877, 698723793, 697299123, 695935428, 694881201, 694372118, 694504619, 695358694, 696765900, 698456407, 700188756, 701845586, 703323185, 704595983, 705774605, 706946969, 708200574, 709546506, 711026907, 712642908, 714453101, 716413736, 718435287, 720487773, 722596169, 724866152, 727273881, 729721963, 732056618, 734198749, 736022353, 737458587, 738526881, 739282668, 739849925, 740356922, 740922093, 741545498, 742238641, 742932498, 743591249, 744260550, 745052278, 746202111, 747983992, 750322938, 752798915, 755232036, 757491231, 759379685, 760675192, 761266112, 761211634, 760647476, 759710848, 758486867, 757158816, 755921543, 754973173]
1158.5G54973173n66661j01507M39823R53138J377761J729071K044439K232731K343416
1176.9G65425384K385736K348959K135277J683116J001537J39653p51435j651049k517223
1195.2G70199955l308297l967404m508793m879594n020082m948974m712343m401446
1211.6G34453022m012763l594339l170431k792954k478540k306461k301455k304673
1227.9G11491406k247632k106070j816571j358032q58069l70442O8485M65751Q51274
1246.2G04120100J204252J501977J729608J926601K066672K192854K342701K479792
1262.6G19564557K553821K565324K551198K587974K729833K848089K900362K907157
1278.9G41208315K869546K792299K645552K427638K190590J979947J790166J608371
$$ y = [754973173, 754406512, 754305005, 754744828, 755697966, 757075727, 758804798, 760849237, 763081968, 765425384, 767811120, 770160079, 772295356, 773978472, 774980009, 775119662, 774368227, 772717178, 770199955, 766891658, 762924254, 758415461, 753535867, 748515785, 743566811, 738854468, 734453022, 730440259, 726845920, 723675489, 720882535, 718403995, 716097534, 713796079, 711491406, 709243774, 707137704, 705321133, 703963101, 703105032, 702734590, 702803075, 703268826, 704120100, 705324352, 706826329, 708555937, 710482538, 712549210, 714742064, 717084765, 719564557, 722118378, 724683702, 727234900, 729822874, 732552707, 735400796, 738301158, 741208315, 744077861, 746870160, 749515712, 751943350, 754133940, 756113887, 757904053, 759512424]
1295.2G59512424J415611J246273J091063R07064O78479M32075K39074Q0824k1279
1313.5G65581608k0504N7041K35498M70162O00934O24657O22272O20604O33478O43730
1333.9G70069480O01530N63741P75754J068294R95934O42777K32756k78235j058995
1352.3G73613036k127827l307342m464090n585730o198227n412162m056453l099382
1368.6G39361823k134860j352668p08461o1333R4354k30014J9133J777172M104316
1387G40869462M887403L901660K833247K330244K057731J766682J498758R48728M19795
1405.3G61513710L17335K92838K34723J86384p8500o99997r24468m92096n28276p23481
1425.7G59098172p73608p46489k54691K6763j69873L09467Q98421P56740M84824K30134
$$ y = [759512424, 760928035, 762174308, 763265371, 764172435, 764850914, 765282989, 765522063, 765602887, 765581608, 765561104, 765618145, 765853643, 766323805, 766924739, 767549396, 768171668, 768792272, 769425750, 770069480, 770671010, 771234751, 772010505, 773078799, 774074733, 774717510, 774950266, 774672031, 773613036, 771485209, 768177867, 763713777, 758128047, 751929820, 746517658, 742461205, 739361823, 737226963, 735874295, 735165834, 735104501, 735198855, 734968841, 734987974, 736765146, 740869462, 745756865, 749658525, 752491772, 754822016, 756879747, 758646429, 760145187, 761093915, 761513710, 761831045, 762123883, 762358606, 762544990, 762466490, 761766493, 760842025, 760349929, 759821653, 759098172, 758324564, 757578075, 757323384, 757350147, 757180274, 757489741, 758388162, 759144902, 759629726, 759859860]
1446.1G59859860J47104L48866L55840j28150q56876j26780J251460J083195P29739
1464.5G62664258J319528J858592J641810J616955K076506K096296J680374J256943
1480.8G76211262J151502J103997P96199O27994J060069J202941M80056q6546K71082
1499.2G82818556O44505K23040j218736j957178l01897J62363l48151n60761j07288
1517.5G79354453M82619Q74519J369655J274586R96053Q01325J46508j30772L20434
1535.9G85489380k54094j352251n09441N61953N93483K20955k14994l44873m31120
1554.2G83758998r00924k057195j126528N86510P2956o15597j085818j011669m88401
1572.6G77132332j096248j818002j069963q82804j525342j952053k195060k382576
$$ y = [759859860, 760006964, 760355830, 760711670, 760583520, 759726644, 759599864, 760851324, 761934519, 762664258, 763983786, 765842378, 767484188, 769101143, 771177649, 773273945, 774954319, 776211262, 777362764, 778466761, 779262960, 779890954, 780951023, 782153964, 782634020, 782547474, 782818556, 783463061, 783686101, 782467365, 780510187, 780208290, 780370653, 780022502, 779461741, 779354453, 779837072, 780711591, 782081246, 783355832, 784351885, 785153210, 785299718, 785168946, 785489380, 785235286, 783883035, 783373594, 783935547, 784529030, 784749985, 784534991, 784190118, 783758998, 782858074, 780800879, 779674351, 780260861, 780333817, 779718220, 778632402, 777620733, 777132332, 776036084, 774218082, 773148119, 772265315, 770739973, 768787920, 766592860, 764210284]
1588.9G64210284k520979k644181k821684k976179l171503l442467l549695l476143
1605.2G39607453l480494l615796l581167l622293m563034n072653l497898l113926
1621.5G09060192l809988l403426k870202k325415j346588r10104l51488J270830K090574
1639.9F97404385K158582K053916K305687L429830L350854K797961M295826M800558
1656.2G22597599L889084L382742L408373L683448L227472K636909K885580K908171
1672.5G48619378K504706K525747K361655J699507Q40009R41932J744389J385570Q60989
1690.9G63483882L28362o52611j073599j197636j261592q00967j436890k131044k238095
1709.2G53019810k724111l536225m652619n631328m692018l567457l914773m129112
$$ y = [764210284, 761689305, 759045124, 756223440, 753247261, 750075758, 746633291, 743083596, 739607453, 736126959, 732511163, 728929996, 725307703, 720744669, 715672016, 712174118, 709060192, 705250204, 701846778, 698976576, 696651161, 695304573, 694394469, 694042981, 695313811, 697404385, 699562967, 701616883, 703922570, 707352400, 710703254, 713501215, 717797041, 722597599, 726486683, 729869425, 733277798, 736961246, 740188718, 742825627, 745711207, 748619378, 751124084, 753649831, 756011486, 757710993, 758551002, 759492934, 761237323, 762622893, 763483882, 763812244, 763159633, 762086034, 760888398, 759626806, 758825839, 757388949, 755257905, 753019810, 750295699, 746759474, 742106855, 736475527, 731783509, 728216052, 724301279, 720172167]
1725.6G20172167l856719l617108l532469l883242k642632j303017j444757j239300
1741.9F98652923o96599n69880o63400n92053J10567P69972J168251K063930L153146
1760.2G03396857M474163N205691M925131M521430L935754L706873L680587L102958
1776.5G36949444K485454K198577K004027J809299J706541J393616R25958J061022
1792.9G50533938J431048J245976R16183Q77023J069366J067937Q80718P09593P23899
1811.2G59455681Q30829P86185O98149P18236O48141M32790M60207N24342M54545O63042
1831.6G65672147P43509N14686M42505M35650J37448p2002L21328N80848M29928K96176
1852G69502223K19941J66595J27911J33813J60157Q8573j76430k57969J77443M34041
$$ y = [720172167, 716315448, 712698340, 709165871, 705282629, 702639997, 701336980, 699892223, 698652923, 697956324, 697386444, 696723044, 696130991, 696241558, 697011530, 698179781, 700243711, 703396857, 707871020, 713076711, 718001842, 722523272, 726459026, 730165899, 733846486, 736949444, 739434898, 741633475, 743637502, 745446801, 747153342, 748546958, 749472916, 750533938, 751964986, 753210962, 754127145, 755004168, 756073534, 757141471, 758022189, 758731782, 759455681, 760286510, 761072695, 761770844, 762489080, 763137221, 763570011, 764030218, 764554560, 765009105, 765672147, 766415656, 766930342, 767372847, 767808497, 767945945, 767873943, 768195271, 768776119, 769206047, 769502223, 769722164, 769888759, 770016670, 770150483, 770310640, 770399213, 770222783, 769964814, 770142257, 770576298]
1872.4G70576298K46048O8426L6002K9325N782k6942j08540j80185m3213L6061r1612
1894.9G70547450j24515r5963j22786j73509k24292k82109k79903k02537j63197k76029
1915.2G68602610l86060k45332j67430j92106r1910p2539j56045k16424k40445k00451
1935.6G66633868j76668k96712m00007k49803p4446r4771j42038j55926j67012j67132
1956G64709353j54852j27018r7513j23143j91391j27137j0132k1637r7036j53482j63794
1978.5G63442218j36316j02937j25050j89245k50101k72691j96636j11997j54436k08497
1998.9G61694312k14636k54095k73108k66671k74241k95163l08215l24786l57747m29273
2019.3G58696377o54936j165747j175344O3240R22680M76003m113r4771j30296j84238
$$ y = [770576298, 770822346, 770890772, 770926774, 770956099, 770961881, 770934939, 770826399, 770646214, 770603001, 770639062, 770547450, 770422935, 770326972, 770204186, 770030677, 769806385, 769524276, 769244373, 769041836, 768878639, 768602610, 768216550, 767971218, 767803788, 767611682, 767519772, 767447233, 767291188, 767074764, 766834319, 766633868, 766457200, 766160488, 765760481, 765510678, 765436232, 765341461, 765199423, 765043497, 764876485, 764709353, 764554501, 764427483, 764329970, 764206827, 764015436, 763888299, 763878167, 763856530, 763759494, 763606012, 763442218, 763305902, 763202965, 763077915, 762888670, 762638569, 762365878, 762169242, 762057245, 761902809, 761694312, 761479676, 761225581, 760952473, 760685802, 760411561, 760116398, 759808183, 759483397, 759125650, 758696377, 758041441, 756875694, 755700350, 755763590, 756686270, 757162273, 757158160, 757063389, 756933093, 756748855]
2039.7G56748855j93179j86085j87814j76251j71543j75356j65642j55568j93179k05338
2060.1G54938900j86383j66953j55628j64210j74940j81854k23517k64168k37286k18034
2080.5G52965927k20895k44796k79069k88784k66970k60353k88486l03328l09646l08752
2100.9G50194848l15369l07142k76089k44796k40803k56002k51055k25603j81258j48893
2121.3G47747838j25110j11997r6023p0572p7069r7334o8307k9683m8935o0141l2485
2143.7G46930182O258J1802j2636j6570n901j7047k8968K504K0325n603p7665j28031
2168.2G46678650k0325J23501R9778Q047j0669j789n126l7372o0260m7147m3631o0558
2192.6G46623099p4387q1062r8407j07408j10209j12891j09077j12176j29938j44243
$$ y = [756748855, 756555676, 756369591, 756181777, 756005526, 755833983, 755658627, 755492985, 755337417, 755144238, 754938900, 754752517, 754585564, 754429936, 754265726, 754090786, 753908932, 753685415, 753421247, 753183961, 752965927, 752745032, 752500236, 752221167, 751932383, 751665413, 751405060, 751116574, 750813246, 750503600, 750194848, 749879479, 749572337, 749296248, 749051452, 748810649, 748554647, 748303592, 748077989, 747896731, 747747838, 747622728, 747510731, 747414708, 747344136, 747267067, 747169733, 747101426, 747071743, 747022808, 746962667, 746930182, 746936440, 746948242, 746935606, 746919036, 746913135, 746896088, 746867120, 746869624, 746889949, 746884346, 746806681, 746678650, 746658325, 746781826, 746881604, 746889651, 746878982, 746877193, 746872067, 746834695, 746774435, 746727288, 746683657, 746623099, 746548712, 746467650, 746369243, 746261835, 746151626, 746038735, 745929658, 745817482, 745687544, 745543301]
2213G45543301j45852j48356j43648j52766j40012j24931j66416k02119j91272j58489
2233.4G43969440j51157j69814j95741k02894j90676j80840j73986j82927k00331j99795
2253.8G42121279j85787k02001k18272k03132j89543j85132j89364j89781j71483j57714
2274.2G40229070j74522j65045j26541j20521j37925j56283j56164j48297j52468j58132
2294.6G38733172j62959j67846j62840j64628j97888k40981k70486k78056k69413k72393
2315G36545682l08275l60310m01736l92973l35872l36230l86775m12941m62472n54919
2335.4G32593179n84722m56273k60711q5771J84774K81632o2525m71711o02007n60165
2355.8G29975700n17785l92497j88708m649Q2254O5029M8995Q1777J18196J08183O3479
$$ y = [745543301, 745397449, 745249093, 745105445, 744952679, 744812667, 744687736, 744521320, 744319201, 744127929, 743969440, 743818283, 743648469, 743452728, 743249834, 743059158, 742878318, 742704332, 742521405, 742321074, 742121279, 741935492, 741733491, 741515219, 741312087, 741122544, 740937412, 740748048, 740558267, 740386784, 740229070, 740054548, 739889503, 739762962, 739642441, 739504516, 739348233, 739192069, 739043772, 738891304, 738733172, 738570213, 738402367, 738239527, 738074899, 737877011, 737636030, 737365544, 737087488, 736818075, 736545682, 736237407, 735877097, 735475361, 735082388, 734746516, 734410286, 734023511, 733610570, 733148098, 732593179, 732008457, 731552184, 731291473, 731205702, 731390476, 731672108, 731609583, 731137872, 730535865, 729975700, 729457915, 729065418, 728876710, 728872061, 728954315, 729019344, 729068339, 729150116, 729268312, 729376495, 729439974]
2378.2G29439974J3947l8027q9944j68085k43723k87891k99334k81096k85029l20137
2398.6G27440655l41415l26753l12507l16203l22282l09586k83421k76923k76506k53558
2419G24421501k40385k64228k66731k29418k00808k05159k21789k47419k66850k47955
2439.4G22030759k33233k50340k69472k66731k53677k41876k48671k79903k94805k87294
2459.8G19404757k67923k45809k47181k69651k77281k57909k40088k40743k40564k23220
2480.2G16894388k18093k26259k28584k26379k15113k07841k18690k32756k17020j96576
2500.6G14707077k17021k43425k32935k11120k18928k31325k15590k10524k30730k31385
2521G12464094k38716k57254k60055k73883k82109k61009k41876k56478k74301k58982
$$ y = [729439974, 729453921, 729415894, 729325950, 729157865, 728914142, 728626251, 728326917, 728045821, 727760792, 727440655, 727099240, 726772487, 726459980, 726143777, 725821495, 725511909, 725228488, 724951565, 724675059, 724421501, 724181116, 723916888, 723650157, 723420739, 723219931, 723014772, 722792983, 722545564, 722278714, 722030759, 721797526, 721547186, 721277714, 721010983, 720757306, 720515430, 720266759, 719986856, 719692051, 719404757, 719136834, 718891025, 718643844, 718374193, 718096912, 717839003, 717598915, 717358172, 717117608, 716894388, 716676295, 716450036, 716221452, 715995073, 715779960, 715572119, 715353429, 715120673, 714903653, 714707077, 714490056, 714246631, 714013696, 713802576, 713583648, 713352323, 713136733, 712926209, 712695479, 712464094, 712225378, 711968124, 711708069, 711434186, 711152077, 710891068, 710649192, 710392714, 710118413, 709859431]
2541.4G09859431k42353k54094k56360k41518k55406k86102l13580l07441k89917k99990
2561.8G07112670l25620l56972l65854l55065l37779l21686l26515l46064l35336l12865
2582.2G03728914l22878l39270l38733l30329l26276l26097l27825k95699k84374l30448
2602.6G00506985l50058l44098l40580l31998l12269l08394l39032l79264l81470l48925
2623F97070897l48330l72350l58641l25144l36766l60131l63410l62634l61562l53575
2643.4F93528354l26514k95580k99990l14653k88844k76208k91347k99156k94924k77340
2663.8F90563798k65360k85804l02851k79963k74420k85387l04401l51310l97563l99589
2684.2F87417150l52085l23176l41654l64125l66569l63290l49700l70264m25458m42744
$$ y = [709859431, 709617078, 709362984, 709106624, 708865106, 708609700, 708323598, 708010018, 707702577, 707412660, 707112670, 706787050, 706430078, 706064224, 705709159, 705371380, 705049694, 704723179, 704377115, 704041779, 703728914, 703406036, 703066766, 702728033, 702397704, 702071428, 701745331, 701417506, 701121807, 700837433, 700506985, 700156927, 699812829, 699472249, 699140251, 698827982, 698519588, 698180556, 697801292, 697419822, 697070897, 696722567, 696350217, 695991576, 695666432, 695329666, 694969535, 694606125, 694243491, 693881929, 693528354, 693201840, 692906260, 692606270, 692291617, 692002773, 691726565, 691435218, 691136062, 690841138, 690563798, 690298438, 690012634, 689709783, 689429820, 689155400, 688870013, 688565612, 688214302, 687816739, 687417150, 687065065, 686741889, 686400235, 686036110, 685669541, 685306251, 684956551, 684586287, 684160829, 683718085]
2704.6F83718085m35531m27425m23848m29571m41194m41074m07398l55661l29554l28004
2725F79698825l47376l72648l53515l19600k82586k50399k62737k86520k71082k33114
2745.4F76719248k19822k47180l03626l42727l36408l15071l14176l24487l37720l67761
2765.7F73610270l85702l70443l30090l19123m07398n08070m96507m25040l86954l72708
2786.1F69608235l68952m30346n08845m98712m55737m96328n96344o13511n52237n06699
2806.5F64580524m94838n58495o39320o29723n70237n46039n87284o47962o78659o89268
2826.9F58538699p05778p25925p75814q48771q98242j080632j442253j709700j833558
2845.3F48518026j952112j955926j675368j201033p48992m19915k85029m00484n79119
$$ y = [683718085, 683282554, 682855129, 682431281, 682001710, 681560516, 681119442, 680712044, 680356383, 680026829, 679698825, 679351449, 678978801, 678625286, 678305686, 678023100, 677772701, 677509964, 677223444, 676952362, 676719248, 676499426, 676252246, 675948620, 675605893, 675269485, 674954414, 674640238, 674315751, 673978031, 673610270, 673224568, 672854125, 672524035, 672204912, 671797514, 671289444, 670792937, 670367897, 669980943, 669608235, 669239283, 668808937, 668300092, 667801380, 667345643, 666849315, 666252971, 665639460, 665087223, 664580524, 664085686, 663527191, 662887871, 662258148, 661687911, 661141872, 660554588, 659906626, 659227967, 658538699, 657832921, 657106996, 656331182, 655482411, 654584169, 653503537, 652061284, 650351584, 648518026, 646565914, 644609988, 642934620, 641733587, 640984595, 640564680, 640279651, 639879167, 639300048]
2863.6F39300048o36816o68347o62744n61773o03438p90894q05735o87898o36279o35207
2884F32610917o59108p02858p01487o32703n73874o18100o99639o61135n70595n83589
2904.4F26207829o80328p36713p48515q91090j215637j487493j493096j282216r81927
2922.8F16690814o75022l27230k2947j2398j38879j13487R060J30891K86758L97683
2943.2F16225243L08275P0274p4625o8009j67549l54051l78907k83003j91093j20878
2963.6F14965677j3292J66536L33369M47273M93288M57823M85480N47945M45962K94865
2984F18624926K67684L03745L79026L54648J27315J1921j9848j59204j99020j68025
3004.4F19523168j54615l7610P6532j7285k60592m40419m51386l89635l15666k59161
$$ y = [639300048, 638663232, 637994885, 637332141, 636770368, 636166930, 635376036, 634570301, 633882403, 633246124, 632610917, 631951809, 631248951, 630547464, 629914761, 629340887, 628722787, 628023148, 627362013, 626791418, 626207829, 625527501, 624790788, 624042273, 623151183, 621935546, 620448053, 618954957, 617672741, 616690814, 616015792, 615688562, 615665615, 615653217, 615514338, 615400851, 615409911, 615540802, 615827560, 616225243, 616533518, 616603792, 616529167, 616461158, 616293609, 615939558, 615560651, 615277648, 615086555, 614965677, 614952385, 615118921, 615452290, 615899563, 616392851, 616850674, 617336154, 617884099, 618330061, 618624926, 618892610, 619196355, 619575381, 619930029, 620057344, 620069265, 620049417, 619890213, 619691193, 619523168, 619368553, 619330943, 619407475, 619390190, 619129598, 618689179, 618237793, 617848158, 617532492, 617273331]
3024.8F17273331k73705k19166q0049m3273k05457l66271k39253o1750j79530m49240
3045.2F15155637n47290m25994l71397m87267n49973n81145o43134n91814m59850l73304
3065.6F10124469m67479p10190p88688o12557l70741k85507m71234o69181p28011q21829
3086F04199052q33154p38561p86841q63910p60495o11842o41584q05498q31782o75738
3106.4E96649647o47247q20756p94172n24640m93884p44761j018881j201153j172125
3124.7E89232028r79007q33452q72492r73821r28581p73489p92980j056314j205146
3143.1E80816746j128614j031161r09209q15272j017869j328885j357615j236558j182079
3161.4E70809484j188875j213073j230598j244903j261591j283765j299620j303852
$$ y = [617273331, 616999626, 616780460, 616700411, 616657138, 616451681, 616085410, 615846157, 615784407, 615604877, 615155637, 614608347, 614182353, 613810956, 613323689, 612773716, 612192571, 611549437, 610957623, 610497773, 610124469, 609656990, 608946800, 608158112, 607545555, 607174814, 606889307, 606418073, 605748892, 605020881, 604199052, 603365898, 602627337, 601840496, 600976586, 600216091, 599604249, 598962665, 598157167, 597325385, 596649647, 596002400, 595181644, 594387472, 593862832, 593368948, 592624187, 591605306, 590404153, 589232028, 588253021, 587419569, 586547077, 585573256, 584644675, 583871186, 583078206, 582021892, 580816746, 579688132, 578656971, 577747762, 576932490, 575914621, 574585736, 573228121, 571991563, 570809484, 569620609, 568407536, 567176938, 565932035, 564670444, 563386679, 562087059, 560783207]
3177.7E60783207j332104j380682j386702j348793j327455j357675j413763j463055
3194.1E49772978j493693j509010j499713j443863j411199j462877j527250j505256
3210.4E37920117j428246j405120j444638j485467j504063j509130j505554j473606
3226.7E26164293j378953j210869j163601j422227j627147j520276j379311j297772
3243E15164137j202464j232922j402557j417637j234651j139879j211941j259089j215875
3261.4E03847122j188636j167118j049102r21309j051455j306504j382470j354605
3277.7D94425923j304716j261145j259953j264483j228809j136452j143604j328379
3294D84498382j508117j600623j583427j395733j194208j299710j705408k015918k029747
$$ y = [560783207, 559451103, 558070421, 556683719, 555334926, 554007471, 552649796, 551236033, 549772978, 548279285, 546770275, 545270562, 543826699, 542415500, 540952623, 539425373, 537920117, 536491871, 535086751, 533642113, 532156646, 530652583, 529143453, 527637899, 526164293, 524785340, 523574471, 522410870, 520988643, 519361496, 517841220, 516461909, 515164137, 513961673, 512728751, 511326194, 509908557, 508673906, 507534027, 506322086, 505062997, 503847122, 502658486, 501491368, 500442266, 499520957, 498469502, 497162998, 495780528, 494425923, 493121207, 491860062, 490600109, 489335626, 488106817, 486970365, 485826761, 484498382, 482990265, 481389642, 479806215, 478410482, 477216274, 475916564, 474211156, 472195238, 470165491]
3312.3D70165491j908213j849741j840859j829207j812965j812637j979082k194614
3328.7D54938173k200454k102554j995087j873403j952559k182722k286882k334326
3345D38010186k264887k035618k128720k510786k557874k285212k113968k163470k185524
3363.3D17764127j958042j788378k027988k424687k447129k126604j920313j904249
3379.7D01166737j933932j900047j748592j499623j259029j350194j713902j732230
3396C88029188j286298j082331j503676j860023j618296j276493j199543j196265j246840
3414.3C75759423j312107j181990r91791r38267q88020p15762n43147n31734n01155
3432.7C68155450l72082m82023p56294p39127m72754k48045j16676r1493j02848k5779
$$ y = [470165491, 468257278, 466407537, 464566678, 462737471, 460924506, 459111869, 457132787, 454938173, 452737719, 450635165, 448640078, 446766675, 444814116, 442631394, 440344512, 438010186, 435745299, 433709681, 431580961, 429070175, 426512301, 424227089, 422113121, 419949651, 417764127, 415806085, 414017707, 411989719, 409565032, 407117903, 404991299, 403070986, 401166737, 399232805, 397332758, 395584166, 394084543, 392825514, 391475320, 389761418, 388029188, 386742890, 385660559, 384156883, 382296860, 380678564, 379402071, 378202528, 377006263, 375759423, 374447316, 373265326, 372273535, 371335268, 370447248, 369731486, 369188339, 368656605, 368155450, 367783368, 367301345, 366545051, 365805924, 365333170, 365085125, 364968449, 364876956, 364774108, 364748329]
3453.1C64748329J04636K29031K99960K43336K60085N04494O39647M07994J33156K07574
3473.5C67778242M85509O83517O73562N19901N27174P15732P93696P73370Q08120Q74161
3493.9C74632984R45509R15170Q39561R22650R50724Q02934Q31604J081258J255274
3512.2C83177668J162439R72689R51767J082688J256228J225710J049548J109660J288801
3530.6C93277198J334727J379520J379042J250148J283944J447469J491189J386166
3546.9D04229403J258522J309573J477600J518517J494557J563013J555770J276404
3563.2D15683359J256555J977325K335816J861990J603663J756727J893491J994133
3579.5D30363059K038568J818598J679897K047628K228022J884341J878113K195894
$$ y = [364748329, 364852965, 365081996, 365381956, 365625292, 365885377, 366389871, 367029518, 367437512, 367570668, 367778242, 368263751, 368947268, 369620830, 370140731, 370667905, 371383637, 372177333, 372950703, 373758823, 374632984, 375578493, 376493663, 377333224, 378255874, 379206598, 380009532, 380841136, 381922394, 383177668, 384340107, 385312796, 386264563, 387347251, 388603479, 389829189, 390878737, 391988397, 393277198, 394611925, 395991445, 397370487, 398620635, 399904579, 401352048, 402843237, 404229403, 405487925, 406797498, 408275098, 409793615, 411288172, 412851185, 414406955, 415683359, 416939914, 418917239, 421253055, 423115045, 424718708, 426475435, 428368926, 430363059, 432401627, 434220225, 435900122, 437947750, 440175772, 442060113, 443938226, 446134120]
3595.8D46134120K270282K205908K153635J885295J638084J909256K245397K275854
3612.2D62717831K175957J842111K075404K773434K378196J347899R68874K151370
3628.5D78431076L163278K349108J919836J936943J828670J801938J587242J036584
3644.8D94054675R85056K323747L114432J817822J232803K021551K092183J459956
3661.1E09102225J142741Q06987N09918J114845J477063O87360J253248K001106J197756
3679.5E19293249P07030M26173J23322N94676J390099J120329N51105L56078J80900
3697.8E24742961J71602N95271O00756q5414m84288o7055P95186O05344k29895n19633
3718.2E26124835l93212k51293j81139j24931m75347r27210o84976K15709R39846L92496
$$ y = [446134120, 448404402, 450610310, 452763945, 454649240, 456287324, 458196580, 460441977, 462717831, 464893788, 466735899, 468811303, 471584737, 473962933, 475310832, 476279706, 478431076, 481594354, 483943462, 485863298, 487800241, 489628911, 491430849, 493018091, 494054675, 495039731, 497363478, 500477910, 502295732, 503528535, 505550086, 507642269, 509102225, 510244966, 511051953, 511561871, 512676716, 514153779, 514841139, 516094387, 518095493, 519293249, 520000279, 520426452, 520549774, 521144450, 522534549, 523654878, 524205983, 524562061, 524742961, 524914563, 525509834, 526110590, 526025176, 525540888, 525473833, 526269019, 526874363, 526644468, 526124835, 525731623, 525480330, 525299191, 525174260, 524698913, 523771703, 523086727, 523302436, 524242282, 524634778]
3738.6E24634778q72611q90315N67317L85940m91083N30601J149177J70231l60369
3757E24823666M6312K23995k48552l81171k24829M4346K79605n4538m44353l46422
3777.4E23718059L1233m1127l29137k07722j09554j87218l56614n74172m85063n53727
3797.8E20904958n62966K01047O4075k81274K77578n4299r07004q88348k01702k99633
3818.2E18252432k36392N37277P3552m33624m15742m95852m54008n00262l82304Q7142
3838.6E16032219J20342j8239l3975m91977j318514j653194m2856J712680L46839q48591
3858.9E13804734q72970m36365j46330m75049l29196K20060Q1837k08556o15955n78880
3879.3E10443330j63078k31147O854j31607o35087j67907J9789o79552r17256n40614
$$ y = [524634778, 523762167, 522871852, 523439169, 523825109, 523334026, 523864627, 525013804, 525184035, 524823666, 524869978, 525093973, 524845421, 524464250, 524239421, 524283767, 524563372, 524508834, 524064481, 523718059, 523749292, 523708165, 523379028, 523171306, 523061752, 522874534, 522517920, 521943748, 521458685, 520904958, 520341992, 520543039, 520607114, 520325840, 520603418, 520549119, 519642115, 518753767, 518552065, 518252432, 518016040, 518553317, 518626869, 518193245, 517777503, 517281651, 516827643, 516327381, 515945077, 516032219, 516152561, 516134322, 516100347, 515608370, 514289856, 512636662, 512593806, 514306486, 514653325, 513804734, 512931764, 512495399, 512349069, 511874020, 511544824, 511764884, 511846721, 511638165, 511022210, 510443330, 510280252, 510049105, 510055959, 509924352, 509289265, 509121358, 509141147, 508461595, 507544339, 507003725]
3899.7E07003725j26541K95699L41475j71662m81725n10454n89192m35948q8453j33336
3920.1E05103588l80456l06785k15471m29571m27544j01209n3405l15071n00857m59731
3940.5E01913488k37048k12610l85522l06487j57834k23100l40104l81946l72857l26365
3960.9D98969615k90454l44038l87043l52263l21031l06457k42204j94281k46286k60860
3981.3D96024698k08229k71499l70324l24308k35051k04325k02656k43902
3997.6D93964404
$$ y = [507003725, 506877184, 507172883, 507514358, 507342696, 506860971, 506350517, 505761325, 505325377, 505236924, 505103588, 504723132, 504416347, 504200876, 503771305, 503343761, 503242552, 503189147, 502874076, 502373219, 501913488, 501676440, 501463830, 501078308, 500771821, 500613987, 500390887, 500050783, 499668837, 499295980, 498969615, 498679161, 498335123, 497948080, 497595817, 497274786, 496968329, 496726125, 496531844, 496285558, 496024698, 495816469, 495544970, 495174646, 494850338, 494615287, 494410962, 494208306, 493964404]
##END=$$ End of the data block
