##TITLE=Melamina $$ Begin of the data block
##JCAMP-DX=5.00 $$ ACD/SpecManager v 10.08
##SPECTROMETER/DATA SYSTEM=Alpha
##DATE=07 Oct 2014 15:31:26
##DATA TYPE=INFRARED SPECTRUM
##DATA CLASS=XYDATA
##ORIGIN=
##OWNER=
##NPOINTS=1765
##FIRSTX=399.76428223
##LASTX=3997.64306641
##MAXX=3997.64306641
##MINX=399.76428223
##MAXY=0.78586578
##MINY=0.43360567
##XFACTOR=1.0000000000
##YFACTOR=1.000000000000000e-9
##FIRSTY=0.67000824
##DELTAX=2.03961372
##XUNITS=1/CM
##YUNITS=ARBITRARY UNITS
##XYDATA=(X++(Y..Y))
399.8F70008242J284003j052916l069222k754390m42147J247048L04044j813770k967536
418.1F60743356j963616M06146O91831j596808l450096k432704M77493J843572r2626
436.5F54626548k830863l169119r82642J411795J170874j369059l061891j891911J052022
454.8F44955754K557457M18186k973437l661812j086533K051831K284586m76718l073514
473.2F40995800k254962Q99076K437472N68808k606035l367066p99418J878083J517177
491.5F39268935j460076l517747k360999N96046K038122L18884k470195l155053j043140
509.9F28214777J359999J240551j333833l537654k666772L02136J845419K70010k495170
528.3F23199463l213704j246035J182497J414001o60241k651036k376258k53201J175106
$$ y = [670008242, 671292245, 670239329, 667170107, 664415717, 663973570, 665220618, 665524662, 663710892, 660743356, 658779740, 659185886, 659877717, 658280909, 654830813, 652398109, 652875602, 654719174, 654626548, 651795685, 648626566, 647643924, 649055719, 650226593, 648857534, 645795643, 643903732, 644955754, 647513211, 647931397, 644957960, 641296148, 640209615, 642261446, 644546032, 644069314, 640995800, 638740838, 639639914, 642077386, 642646194, 640040159, 636673093, 635873675, 637751758, 639268935, 637808859, 634291112, 631930113, 632526159, 634564281, 634883165, 632412970, 629257917, 628214777, 629574776, 630815327, 629481494, 625943840, 623277068, 623579204, 625424623, 625694633, 623199463, 619985759, 618739724, 619922221, 621336222, 620675981, 618024945, 615648687, 615395486, 616570592]
546.6F16570592K25902k065003l167034j926422K12074J033902p1407j547217j467764
565F07797623K59876J779616J295507o33836j894355j150012P92802J636266M19438
583.3F10302925j449227j995623p52867P18773N55396j226068k997577l340363k380073
601.7E97435296j663566k139509k911746k257824L48389L549874N097568M057467J920521
620F03436470P79748J104236J648187R69231r25302k401531j900136L80933K615094
638.4F05706930L073633J920879R71734J493991K832174L219843J786053j50382o47247
656.8F20207608N25832J853108J839817K82466j688301p53641K865314L988862L200293
675.1F32321358J495003N75364J425207L052830L508330K103984K57611m5836J482845
$$ y = [616570592, 616796494, 614731491, 611564457, 609638035, 609850109, 610884011, 610812604, 609265387, 607797623, 608057499, 609837115, 611132622, 610498786, 608604431, 607454419, 608247221, 609883487, 610302925, 608853698, 606858075, 606105208, 606823981, 607379377, 606153309, 603155732, 599815369, 597435296, 595771730, 593632221, 590720475, 588462651, 588811040, 592360914, 597458482, 601515949, 603436470, 604216218, 605320454, 606968641, 607937872, 607012570, 604611039, 602710903, 603091836, 605706930, 608780563, 610701442, 611673176, 613167167, 615999341, 619219184, 621005237, 620854855, 620207608, 620733440, 622586548, 624426365, 624708831, 623020530, 622266889, 625132203, 629121065, 632321358, 633816361, 634391725, 635816932, 638869762, 642378092, 644482076, 644739687, 644693851, 646176696]
693.5F46176696L087401K958596J267612p5340M83095K303481L319502K452851P30872
711.8F62704766R3281J286745L042340L516138K301157P44164O38604K260685L851771
730.2F80439651L571868J704276L29792Q16763K390503K931536J333832j070082j994788
748.5F90453351q11518R20952J248002k9862j274824j002491N05209J431227M15802
766.9F91855848j724541k655030j142859J713574L761828L947198L286839L570199
783.2G02613056N264103O928086O809235M749060K527713J868248K404631K318561
799.5G35482693N09858k009034k891779r84133K279163M356265M288912L529966L877461
817.9G48439372N479395O654143N660713K839327M15504J48415J447201K210558J220464
$$ y = [646176696, 649264097, 652222693, 653490305, 653414965, 653898060, 656201541, 659521043, 661973894, 662704766, 662798047, 664084792, 667127132, 670643270, 672944427, 673688591, 674327195, 676587880, 680439651, 684011519, 685715795, 686045587, 686862350, 689252853, 692184389, 693518221, 692448139, 690453351, 689641833, 690562785, 691810787, 691780925, 690506101, 689503610, 690008819, 691440046, 691855848, 690131307, 687476277, 686333418, 688046992, 691808820, 695756018, 699042857, 702613056, 707877159, 714805245, 721614480, 726363540, 728891253, 730759501, 733164132, 735482693, 735992551, 733983517, 731091738, 730107605, 732386768, 736743033, 741031945, 744561911, 748439372, 753918767, 760572910, 766233623, 769072950, 769488454, 769636869, 771084070, 773294628, 774515092]
836.2G74515092n09739r50276N93662K601683L004134J509785k23219m60267P56025
854.6G80836880J660705P11977j525044k959192k379119p86960k54632j512646l154636
873G70637333l369033j992464o49750r14634k498507l684640l307521j887918r76443
891.3G51356423j445770k511740k627194j265645N02467J142621K75672q86321r94027
909.7G43546486j23024M18365l59714k041578l273607l213823k436518k212167l074706
928G27229714m259049m549861l664732k573789k369999l136874l925621l764332k765119
946.4F96220338j998067k252817l181040l789186l519476k791822k513647l052175
962.7F73122108l860414m122794l728509l426015l976941n358756o840288p704318
$$ y = [774515092, 774005353, 773055077, 773648739, 776250422, 779254556, 780764341, 780541122, 780080855, 780836880, 782497585, 783209562, 781684518, 778725326, 776346207, 775559247, 775304615, 773791969, 770637333, 767268300, 765275836, 764626086, 763711452, 761212945, 757528305, 754220784, 752332866, 751356423, 749910653, 747398913, 744771719, 743506074, 744008541, 745151162, 745426834, 744540513, 743546486, 743423462, 743841827, 743482113, 741440535, 738166928, 734953105, 732516587, 730304420, 727229714, 722970665, 718420804, 714756072, 712182283, 709812284, 706675410, 702749789, 698985457, 696220338, 694222271, 691969454, 688788414, 684999228, 681479752, 678687930, 676174283, 673122108, 669261694, 665138900, 661410391, 657984376, 654007435, 648648679, 641808391, 634104073]
979F34104073p544160o087541m419029m419148n414009n411148m456580l748119l754377
997.4E88849962m022360l957152l545404l282547l570378m249632m660845m309356
1013.7E57252288l384054k443909j876295j594842j220703n49495J62840N21004N25117
1032E47391951N40733R42469J631081K012432J679897R26674L68893K71618M72188
1050.4E56237936O73831O11841L08216K68876Q29578J512766J571059R61721L23474
1068.8E63299298K02060N96523J175762J696586K026558K167463K273739K462148K691925
1087.1E78592062K773464K576530K170920J607716Q44181j18435j161873j957893k283514
1105.5E83043158k360046k446532k430856k083004j477957r25958n58018k30909K54929
$$ y = [634104073, 626559913, 620472372, 616053343, 611634195, 606220186, 600809038, 596352458, 592604339, 588849962, 584827602, 580870450, 577325046, 574042499, 570472121, 566222489, 561561644, 557252288, 553868234, 551424325, 549548030, 547953188, 546732485, 546182990, 546345830, 546866834, 547391951, 547932684, 548875153, 550506234, 552518666, 554198563, 555125237, 555494130, 555765748, 556237936, 556911767, 557523608, 557831824, 558100700, 558930278, 560443044, 562014103, 562975824, 563299298, 563501358, 564097881, 565273643, 566970229, 568996787, 571164250, 573437989, 575900137, 578592062, 581365526, 583942056, 586112976, 587720692, 588564873, 588446438, 587284565, 585326672, 583043158, 580683112, 578236580, 575805724, 573722720, 572244763, 571318805, 570760787, 570529878, 570784807]
1123.8E70784807J023591K058744L156543L974855M392505M591286M623771M340648
1140.1E98946750L652513K643883J554668O60479O4791l42131o69777q93236r31859
1158.5F04686081o85811j17778N51700R87768J096785J006782Q27015N44310J39176
1176.9F09036028k18570l15726j27673K45452O30736Q57294J003683J280129J694321
1195.2F14085674K079785K340973K538263K757728K988339L016889K506137J283169
1211.5F33596957m39883k208828l700793m867375n765379o316781o341755n841732
1227.9E98114431n109787m416406l805399l173590k435148j636505r15110m11093j23084
1246.2E76088309J45316N64158J067400J410783J454413J383423J499653J850069K208948
$$ y = [570784807, 571808398, 573867142, 577023685, 580998540, 585391045, 589982331, 594606102, 598946750, 602599263, 605243146, 606797814, 607458293, 607523084, 607180953, 606511176, 605617940, 604686081, 604000270, 603882492, 604434192, 605421960, 606518745, 607525527, 608352542, 608896852, 609036028, 608817458, 608501732, 608374059, 608619511, 609250247, 610107541, 611111224, 612391353, 614085674, 616165459, 618506432, 621044695, 623802423, 626790762, 629807651, 632313788, 633596957, 633157074, 630948246, 627247453, 622380078, 616614699, 610297918, 603956163, 598114431, 593004644, 588588238, 584782839, 581609249, 579174101, 577537596, 576622486, 576211393, 576088309, 576233625, 576797783, 577865183, 579275966, 580730379, 582113802, 583613455, 585463524, 587672472]
1264.6E87672472K348661K211273J980424J919448K045095K095938J815915J310706
1280.9F03399932R49324Q69095Q74936P42853M64082K81632M61817J023054J753330
1299.2F10820055K357244K709687K940834L211319L446698L412486L034114K521456
1315.6F34453893K279460K401829K534091K336800J713217Q79407K66075Q3446J56761
1333.9F47104979K22921J81258K00092M51208Q16047R44793N82933q9943o09815p18951
1354.3F49085522o91831r31085j567065k414465k960503l115893l386497l656328l838956
1372.7F26522899l898919l241777k134323j191259m12524N59986J845002K981901L779710
1391F24810696M918694O115377O414950O607413O539643N787373M537463K396047M30524
$$ y = [587672472, 590021133, 592232406, 594212830, 596132278, 598177373, 600273311, 602089226, 603399932, 604349256, 605218351, 606093287, 606836140, 607300222, 607581854, 608043671, 609066725, 610820055, 613177299, 615886986, 618827820, 622039139, 625485837, 628898323, 631932437, 634453893, 636733353, 639135182, 641669273, 644006073, 645719290, 646598697, 646864772, 646948218, 647104979, 647327900, 647509158, 647709250, 648160458, 648976505, 649921298, 650504231, 650414288, 649804473, 649085522, 648393691, 647462606, 645895541, 643481076, 640520573, 637404680, 634018183, 630361855, 626522899, 622623980, 619382203, 617247880, 616056621, 615644097, 616204083, 618049085, 621030986, 624810696, 629729390, 635844767, 642259717, 648867130, 655406773, 661194146, 665731609, 668127656, 668558180]
1409.4F68558180o66320j112521j248300j563012k298415k467692k177834k163589
1425.7F54860497k389253k872049k996147k337635j622796j229763r77158r04620r15289
1444.1F38615787r30011j111746j544178j979172k169609k514958k847851k205193
1460.4F23313069j756191k121568k484381k033651j572430j993358k940595l527284
1476.7F04883611l699541l643155l547907l502548l961801m981518n477607m528284
1493E71541250l902674m400670m536629l706515k515853j775503j953005j897812j466453
1511.4E45386136j164556q08179o53267r95040j982570k716422k732694k753675k430916
1529.7E29148817k362788k886891k540529j546740j228035j212537r91523p66099l46839
$$ y = [668558180, 667891860, 666779339, 665531039, 663968027, 661669612, 659201920, 657024086, 654860497, 652471244, 649599195, 646603048, 644265413, 642642617, 641412854, 640435696, 639531076, 638615787, 637685776, 636574030, 635029852, 633050680, 630881071, 628366113, 625518262, 623313069, 621556878, 619435310, 616950929, 614917278, 613344848, 611351490, 608410895, 604883611, 601184070, 597540915, 593993008, 590490460, 586528659, 581547141, 576069534, 571541250, 567638576, 563237906, 558701277, 554994762, 552478909, 550703406, 548750401, 546852589, 545386136, 544221580, 543413401, 542760134, 541765094, 539782524, 537066102, 534333408, 531579733, 529148817, 526786029, 523899138, 521358609, 519811869, 518583834, 517371297, 516379774, 515613675, 515266836]
1548.1E15266836K15113P18415R71675J035332J149893J109481J011193J361012J603544
1566.4E24442494J652360J763821J807510K378226L199041K757191K285540K668679
1582.8E42954862L201544L439665L182113K454341J657069J034081M45962l79324j498163
1601.1E56492150k628863l347874l653466l945470m271865m438222n075693n997181
1617.4E23133516m933774l929913m315675m400610m006327l423422k355725j668334
1633.7D94099736j939297k000451j374721p29025k03460j7554j99198j41233K33560
1652.1D87728357N62102N02437M78268N64814O82622R48697J234144J578569J639545
1670.5D95919555J315475J466215J907438K058982K101124K283573K652407K589345
$$ y = [515266836, 515481949, 516200364, 517172039, 518207371, 519357264, 520466745, 521477938, 522838950, 524442494, 526094854, 527858675, 529666185, 532044411, 535243452, 538000643, 540286183, 542954862, 546156406, 549596071, 552778184, 555232525, 556889594, 557923675, 558369637, 557990313, 556492150, 553863287, 550515413, 546861947, 542916477, 538644612, 534206390, 529130697, 523133516, 518199742, 514269829, 509954154, 505553544, 501547217, 498123795, 495768070, 494099736, 492160439, 490159988, 488785267, 488056242, 487852782, 487835228, 487636030, 487494797, 487728357, 488290459, 488792896, 489271164, 489835978, 490518600, 491467297, 492701441, 494280010, 495919555, 497235030, 498701245, 500608683, 502667665, 504768789, 507052362, 509704769, 512294114]
1686.8E12294114K706349L185153L180861L552258M003882M395307N510568M937053
1703.1E43765545M538953M915476M731417M711747M885971N077720N323708M682720
1719.4E82633257L901660M123628M398585M167914L902555L781140M512965M652858
1735.7F16074562L683686L671170L728985L485561L570795L741026L815234L446280
1752F45217299K865434K905727L131628L039181K964973K551198K263606K467871K702117
1770.4F70109034K873480K471507J910030J938463K222120K309084K230048K022923
1786.7F88086689J764416J901329K254307K070248J767874J720309J699984J664877
1803G02930033J708746J789034J739978J541734J345515J401365J617730J654684J458824
$$ y = [512294114, 515000463, 518185616, 521366477, 524918735, 528922617, 533317924, 538828492, 543765545, 548304498, 553219974, 557951391, 562663138, 567549109, 572626829, 577950537, 582633257, 586534917, 590658545, 595057130, 599225044, 603127599, 606908739, 611421704, 616074562, 619758248, 623429418, 627158403, 630643964, 634214759, 637955785, 641771019, 645217299, 648082733, 650988460, 654120088, 657159269, 660124242, 662675440, 664939046, 667406917, 670109034, 672982514, 675454021, 677364051, 679302514, 681524634, 683833718, 686063766, 688086689, 689851105, 691752434, 694006741, 696076989, 697844863, 699565172, 701265156, 702930033, 704638779, 706427813, 708167791, 709709525, 711055040, 712456405, 714074135, 715728819, 717187643]
1821.4G17187643J321137J364946J462460J663148J552165J123547R93193J132369
1837.7G27800608J270234J375139J495242J245976Q81910R67383J214028J275539J119793
1856.1G38645852R02772Q39412R75489J145900J188993J067281P89106O62207Q81851
1874.4G47098863J071572R52602O92785N86450P19249R21369J043915Q77560N59687
1892.8G54524052N31316P46787Q95798Q41975O10769M31120N12779P57754Q56519O42776
1913.2G61351645L99590M46200O23166P07984P20084N21064K79307K89381N00440O71328
1933.6G66510189O04033L83973K35617L73304N96345N76675L86536K02715J84536L36647
1954G70390570M82917M71711L23475J62124J66953L45051M75168L99232K20895J29521
$$ y = [717187643, 718508780, 719873726, 721336186, 722999334, 724551499, 725675046, 726668239, 727800608, 729070842, 730445981, 731941223, 733187199, 734069109, 735036492, 736250520, 737526059, 738645852, 739548624, 740388036, 741363525, 742509425, 743698418, 744765699, 745554805, 746217012, 747098863, 748170435, 749123037, 749815822, 750402272, 751121521, 752042890, 753086805, 753964365, 754524052, 755055368, 755802155, 756697953, 757539928, 758150697, 758581817, 759094596, 759852350, 760708869, 761351645, 761751235, 762197435, 762820601, 763528585, 764248669, 764769733, 765049040, 765338421, 765838861, 766510189, 767114222, 767498195, 767733812, 768107116, 768703461, 769280136, 769666672, 769869387, 770053923, 770390570, 770873487, 771345198, 771668673, 771830797, 771997750, 772342801, 772817969, 773217201, 773438096, 773567617]
1974.4G73567617K09391L73125M14312K86281J13964Q1718K09689L64900L56615J46508
1994.8G76124120J3411P3969K01285K79307K47539J24216N0962R0181J75357K36273
2015.2G77616620K00152N6088l2186M0710J32680J47223P9513j4067k4617N5850J17064
2037.6G78375030Q7142j9849j19328j00673J3233J19805J33276R1314N2631L5167M8101
2060G78715849O7413Q3864O5684L6061M8458J07885J61230J57178J04844L4094k7358
2082.5G79555202k8372L7551O2823j3351j04011r4533N544R7632R1076j0312r3579
2104.9G79505670p3492J6748N8651p271j27018j87158j05203M2975P5817n0365j84894
2127.3G78964460j78456m5121P3969N6029j00851k23101j41084P7367J97291R6381
$$ y = [773567617, 773777008, 774150133, 774564445, 774850726, 774964690, 775046408, 775256097, 775620997, 775977612, 776124120, 776137531, 776211500, 776412785, 776692092, 776939631, 777063847, 777114809, 777204990, 777380347, 777616620, 777816772, 777872860, 777840674, 777881384, 778014064, 778161287, 778240800, 778226733, 778202116, 778257966, 778375030, 778462172, 778442323, 778322995, 778222322, 778235555, 778355360, 778488636, 778579950, 778632581, 778667748, 778715849, 778783262, 778867126, 778932810, 778968871, 779017329, 779125214, 779286444, 779443622, 779548466, 779582560, 779555202, 779526830, 779564381, 779627204, 779613853, 779509842, 779415309, 779420853, 779518485, 779609561, 779599249, 779505670, 779432178, 779448926, 779507577, 779500306, 779373288, 779186130, 779080927, 779123902, 779199719, 779149354, 778964460, 778786004, 778740883, 778814852, 778870881, 778770030, 778546929, 778405845, 778483212, 778680503, 778776884]
2147.7G78776884r6023j60635k2113J62125J85311J1205j80661j60158O9559K46644
2168.1G78832138J93119q941j40607m1187J94251K99156J45316r5904j58488K4139
2188.5G79242992K76566L10779Q9347j09375m9471K16484L98159L01897N6386p3969
2208.9G80659795N4538L37243M45068K25723n6267p5698J69814M18246M03761J14739
2229.3G82696962j32143n1081K57432M19200K45571m4287j21414P6771L28898L63529
2249.7G84039438J30355j28388j42515J09434L59416L26216M0114j87099r9122K23756
2270.1G84671605M22656K72930k0921j13547P3790K94507K64764j5438k76089k72154
2290.5G85302103m1068J31249L4452k60651m79043m22239k48313k14160l79860o05643
$$ y = [778776884, 778680861, 778520226, 778498113, 778660238, 778845549, 778856754, 778676093, 778515935, 778585494, 778832138, 779025257, 779016316, 778875709, 778834522, 779028773, 779327929, 779473245, 779377341, 779218853, 779242992, 779519558, 779830337, 779919684, 779810309, 779760838, 779977322, 780375481, 780677378, 780733764, 780659795, 780714333, 781051576, 781496644, 781722367, 781666100, 781590402, 781760216, 782178462, 782582223, 782696962, 782564819, 782513738, 782771170, 783190370, 783435941, 783391654, 783270240, 783347011, 783675909, 784039438, 784169793, 784041405, 783898890, 784008324, 784367740, 784693956, 784734070, 784546971, 784447849, 784671605, 785094261, 785367191, 785346270, 785232723, 785306513, 785601020, 785865784, 785850346, 785574257, 785302103, 785261035, 785392284, 785426736, 785166085, 784687042, 784264803, 784016490, 783802330, 783422470, 782816827]
2310.9G82816827o49750n07832m49001n75662p19905p30574o56724o05404o27637r63092
2331.3G76331246j639307j764774o79731P52985J423776J533568J543164P64430n99265
2349.7G77666092j447439j503349j231491r26972m68671J76668P85113J124739J141370
2368G75316060J037597J071394J215398J269579J108706P93934M94599L31879K67804
2386.4G82906950J73389m6074k98440l65377k06292l2544m6730k29120l75807l14951
2406.8G81165004j19448n007q2671k68400l82543l19957j41979n2094j71304l54111
2427.2G79267490l87073k47717q7261o7353k16961l74019l25501j26660k5988j07526
2447.6G77301431k67506l52979k65002p0512Q464j31667l20852l54588k04861l2246
$$ y = [782816827, 782167077, 781659245, 781210244, 780634582, 779914677, 779184103, 778527379, 777921975, 777294338, 776331246, 774691939, 772927165, 772247434, 773000419, 774424195, 775957763, 777500927, 778265357, 777666092, 776218653, 774715304, 773483813, 772556841, 772088170, 772264838, 773049951, 774174690, 775316060, 776353657, 777425051, 778640449, 779910028, 781018734, 781812668, 782307267, 782639146, 782906950, 783080339, 783034265, 782735825, 782370448, 782164156, 782131612, 782084882, 781855762, 781479955, 781165004, 781045556, 781040549, 780957878, 780689478, 780306935, 779986978, 779844999, 779792905, 779621601, 779267490, 778880417, 778632700, 778545439, 778478086, 778261125, 777887106, 777561605, 777434945, 777408957, 777301431, 777033925, 776680946, 776415944, 776345432, 776353896, 776222229, 775901377, 775546789, 775341928, 775309682]
2467.9G75309682k4259j91689l50237l21924j30415J9729l8445k33591l40759k50876
2488.3G73447216q6189l8981j59860l19242l47734j93059k1696n0784k32398l50416
2508.7G71646857k97248j49489o6638j29282k75254l53635k77161j31607q0943j80781
2529.1G69704819l20554l33965j99377q1003j16646k56300l57449l15547j48416k9743
2549.5G67545819p8559k15172k90275k22147o9558Q583p1466k21849k54511j28687
2569.9G66002178p093j1325j26421k49863k67327j62601p2718j30772k98620l97265
2590.3G64278173l11076j46508q1301j81317l56496m47273l69728k22563j97828l24786
2610.7G61639297m53234m55796l36826k07603k11537l64721m91023m41194l05175k60413
$$ y = [775309682, 775285423, 775093734, 774743497, 774421573, 774291158, 774310887, 774272442, 774038851, 773698092, 773447216, 773361027, 773322046, 773162186, 772842944, 772495210, 772302151, 772280455, 772229671, 771997273, 771646857, 771349609, 771200120, 771133482, 771004200, 770728946, 770375311, 770098150, 769966543, 769885600, 769704819, 769384265, 769050300, 768850923, 768769920, 768653274, 768396974, 768039525, 767723978, 767575562, 767545819, 767467260, 767252088, 766961813, 766739666, 766670108, 766678691, 766607225, 766385376, 766130865, 766002178, 765995085, 765983760, 765857339, 765607476, 765340149, 765177548, 765104830, 764974058, 764675438, 764278173, 763967097, 763820589, 763739288, 763557971, 763201475, 762754202, 762384474, 762161911, 761964083, 761639297, 761186063, 760730267, 760393441, 760185838, 759974301, 759609580, 759118557, 758677363, 758372188, 758111775]
2631.1G58111775l42190m61519m89414l81470k69830k95996m28021n26727n08666m09722
2651.5G53998220l42131l95357n29886n83469m74632l16620k89083m20332n47766n47171
2671.9G49551773m57466l59833l61502m94838n94377n39303m12345l55482m12405n32210
2692.3G45032012n96046n09143l71337l68476n01215o03140n83112m78625m00961m46498
2712.7G40173459n65112o02781n24223m30167m20570n41032p08282p44164n95092m65095
2733.1G34576941n23866o55889p19905o89149n99563n67973o66857p98046q01385o69539
2753.5G27884769n78999o32405p41601q06868p92742p09593o39737o88255q08954q37505
2773.9G20648110p54893o75201o80149p69257q46506q31902p81119q01801q99673r80615
$$ y = [758111775, 757769585, 757308066, 756818652, 756437182, 756167352, 755871356, 755443335, 754916608, 754407942, 753998220, 753656089, 753260732, 752730846, 752147377, 751672745, 751356125, 751067042, 750646710, 750098944, 749551773, 749094307, 748734474, 748372972, 747878134, 747283757, 746744454, 746332109, 745976627, 745564222, 745032012, 744435966, 743926823, 743555486, 743187010, 742685795, 742082655, 741499543, 741020918, 740619957, 740173459, 739608347, 739005566, 738481343, 738051176, 737630606, 737089574, 736381292, 735637128, 735042036, 734576941, 734053075, 733397186, 732677281, 731988132, 731388569, 730820596, 730153739, 729355693, 728554308, 727884769, 727305770, 726673365, 725931764, 725124896, 724332154, 723622561, 722982824, 722294569, 721485615, 720648110, 719893217, 719218016, 718537867, 717768610, 716922104, 716090202, 715309083, 714507282, 713607609, 712626994]
2794.3G12626994r65894r24229r47595r73105r84133j032829j071632j063525j061619
2812.6G03602433j111090j142740j108527j077593j071155j067877j077294j112223
2828.9F94833934j189530j291155j374424j478255j730263k121806k514541k812863
2845.3F80321097k818107k383948j783311j391768j288116j357496j483262j584887
2861.6F66230202j631022j667917j715481j680612j559318j494050j494288j462519
2877.9F53524995j393736j315951j255393j210511j135528j011371q49426o83546n80967
2896.3F44088566n62846n28217m39763m04596m63665n77747p83563j128674j409113
2914.6F37790382j260102p39872l19302j77443j42813r1851p0929j43767k25484k57135
$$ y = [712626994, 711661100, 710736871, 709789276, 708816171, 707832038, 706799209, 705727577, 704664052, 703602433, 702491343, 701348603, 700240076, 699162483, 698091328, 697023451, 695946157, 694833934, 693644404, 692353249, 690978825, 689500570, 687770307, 685648501, 683133960, 680321097, 677502990, 675119042, 673335731, 671943963, 670655847, 669298351, 667815089, 666230202, 664599180, 662931263, 661215782, 659535170, 657975852, 656481802, 654987514, 653524995, 652131259, 650815308, 649559915, 648349404, 647213876, 646202505, 645353079, 644669533, 644088566, 643525720, 642997503, 642557740, 642153144, 641689479, 641111732, 640328169, 639199495, 637790382, 636530280, 635790408, 635471106, 635293663, 635150850, 635058999, 634988070, 634844303, 634618819, 634361684]
2935F34361684l06785l66449l60370l56078m71830o60479p91610q56459r37879r96351
2955.4F28257394r26316p23004m59194j72437J69158N41568Q76546J152694J345456
2973.8F30061865J415074J392603J339078J234233J089513R67145Q57055P24554N22674
2992.1F39603794K78532P5042j24275l06189m03941m87089n88894o73413p76172r07123
3012.5F35690272j010716j076460j136899j191914j227975j254201j250148j195490
3028.8F26346469j146555j165509j215160j196206j089155j015604j059890j136839
3045.1F17321551j118004j007438r46820r81212j042425j096607j087248j027345j003266
3063.5F08011186j006544j039505j091361j073718j003921r49025r18031r35435r53972
$$ y = [634361684, 634054899, 633688450, 633328080, 632972002, 632500172, 631839693, 631048083, 630191624, 629253745, 628257394, 627331078, 626608074, 626148880, 625976443, 626145601, 626687169, 627563715, 628716409, 630061865, 631476939, 632869542, 634208620, 635442853, 636532366, 637499511, 638356566, 639081120, 639603794, 639882326, 639957368, 639833093, 639526904, 639122963, 638635874, 638046980, 637373567, 636597395, 635690272, 634679556, 633603096, 632466197, 631274283, 630046308, 628792107, 627541959, 626346469, 625199914, 624034405, 622819245, 621623039, 620533884, 619518280, 618458390, 617321551, 616203547, 615196109, 614249289, 613268077, 612225652, 611129045, 610041797, 609014452, 608011186, 607004642, 605965137, 604873776, 603800058, 602796137, 601847112, 600929081, 599993646, 599039674]
3081.9E99039674r00984q51989q72016q83877q34763p55072p06434p03812p09891p26879
3102.2E91093957p25686o63459o35922p11918p98106q23498q14498q23438q94487j012027
3122.6E83190918j091003j100898j098991j107394j156032j259864j316905j322985
3139E73736846j369833j422704j446903j478970j494348j488208j524449j611173j706839
3157.3E60193419j757264j727223j701951j752436j813889j842618j838863j800537
3173.6E45958638j759112j788914j876414j919329j884460j812041j765907j756430
3189.9E31396031j765012j772464j748204j704931j661718j634598j647591j659930
3206.3E17801583j606047j522005j482606j500845j533329j527787j473963j434028
$$ y = [599039674, 598138690, 597286701, 596414685, 595530808, 594696045, 593940973, 593234539, 592530727, 591820836, 591093957, 590368271, 589704812, 589068890, 588356972, 587558866, 586735368, 585920870, 585097432, 584202945, 583190918, 582099915, 580999017, 579900026, 578792632, 577636600, 576376736, 575059831, 573736846, 572367013, 570944309, 569497406, 568018436, 566524088, 565035880, 563511431, 561900258, 560193419, 558436155, 556708932, 555006981, 553254545, 551440656, 549598038, 547759175, 545958638, 544199526, 542410612, 540534198, 538614869, 536730409, 534918368, 533152461, 531396031, 529631019, 527858555, 526110351, 524405420, 522743702, 521109104, 519461513, 517801583, 516195536, 514673531, 513190925, 511690080, 510156751, 508628964, 507155001, 505720973]
3222.6E05720973j475811j529515j511216j441568j404762j489312j582354j556218
3238.9D93730217j501053j465321j423478j433432j496971j510650j442462j365334
3255.2D82091516j366317j408130j389116j328468j272202j170486j071960j099467
3271.5D71985370j152903j123249j077503j011849r40531r46403r50217q74400p73430
3289.9D63134885p17640p63953q48770q62807p98643o99460o42628p02381q21054q78423
3310.3D55399126q51304p90715p66188p99566q31992q12262p80284p94947q15243q13782
3330.7D47342843q15362p63804o63310o52194p36028p84993p60555o65546n55187n67228
3351.1D40378636o65843o85484n91963m73619m13358l91096l46452l22073l79473m52191
$$ y = [505720973, 504245162, 502715647, 501204431, 499762863, 498358101, 496868789, 495286435, 493730217, 492229164, 490763843, 489340365, 487906933, 486409962, 484899312, 483456850, 482091516, 480725199, 479317069, 477927953, 476599485, 475327283, 474156797, 473084837, 471985370, 470832467, 469709218, 468631715, 467619866, 466679335, 465732932, 464782715, 463908315, 463134885, 462417245, 461653292, 460804522, 459941715, 459143072, 458443612, 457800984, 457098603, 456277549, 455399126, 454547822, 453757107, 452990919, 452191353, 451359361, 450547099, 449766815, 448971868, 448156625, 447342843, 446527481, 445763677, 445100367, 444448173, 443712145, 442927152, 442166597, 441501051, 440945864, 440378636, 439712793, 439027309, 438435346, 437961727, 437548369, 437157273, 436810821, 436488748, 436109275, 435657084]
3371.5D35657084m28945l43531k84612k50996k26229j71691q0645j1742Q195l1382
3391.9D33835506j14142j15693J3053J06514L0458q3417j2308J33365J49310Q0704
3412.3D34023350M6999J02192K26229L19302L01451K91556M02510N36412N72056N86957
3432.7D37409014O00874N02497L93212M29719N49734O47962O73205O03974N82546O50942
3453.1D43043679O88523P00116P07120O85066P05004Q05646Q47816O91116N12839N84721
3473.4D49971646P58678Q42869Q65579Q15481P74562Q85934R92685R33975Q74013R79096
3493.8D58694518J138568J118749J077145J186103J105696Q67128R63360J239509J303434
3512.2D68694210J191258J083524J097828J233250J415729J405120J245767J246333
$$ y = [435657084, 435228139, 434884608, 434599996, 434349000, 434122771, 433951080, 433870435, 433858693, 433866888, 433835506, 433721364, 433605671, 433618724, 433725238, 433755696, 433672279, 433659971, 433793336, 433942646, 434023350, 434070349, 434172541, 434398770, 434718072, 435019523, 435311079, 435713589, 436250001, 436822057, 437409014, 438009888, 438512385, 438905597, 439335316, 439885050, 440533012, 441206217, 441810191, 442392737, 443043679, 443732202, 444432318, 445139438, 445824504, 446529508, 447335154, 448182970, 448874086, 449386925, 449971646, 450730324, 451573193, 452438772, 453254253, 454028815, 454914749, 455907434, 456841409, 457715422, 458694518, 459833086, 460951835, 462028980, 463215083, 464320779, 465187907, 466151267, 467390776, 468694210, 469885468, 470968992, 472066820, 473300070, 474715799, 476120919, 477366686, 478613019]
3528.5D78613019J296461J301229J427590J498223J352578J325339J554340J800627
3544.8D90169406J694679J362860J402796J643538J610667J551568J675040J647234
3561.1E02757788J442373J810967K619267K370655J621068J599669J868785K004385
3577.5E18094957K081394J962543J761257K125561K745152K313972J677453J981914
3593.8E34744203K352476K322018K349794K239406J868487J954436K582312K719581
3610.1E53132713K469063K264976K034128K616405L000915J904905J031518J683116
3626.4E70137739L799141L895819J991808J829684K201080K234638K241194J853347
3642.7E90184450J449168K346933M411101L907263J315475J326144K686023K317012
$$ y = [478613019, 479909480, 481210709, 482638299, 484136522, 485489100, 486814439, 488368779, 490169406, 491864085, 493226945, 494629741, 496273279, 497883946, 499435514, 501110554, 502757788, 504200161, 506011128, 508630395, 511001050, 512622118, 514221787, 516090572, 518094957, 520176351, 522138894, 523900151, 526025712, 528770864, 531084836, 532762289, 534744203, 537096679, 539418697, 541768491, 544007897, 545876384, 547830820, 550413132, 553132713, 555601776, 557866752, 559900880, 562517285, 565518200, 567423105, 568454623, 570137739, 573936880, 577832699, 579824507, 581654191, 583855271, 586089909, 588331103, 590184450, 591633618, 593980551, 598391652, 602298915, 603614390, 604940534, 607626557, 609943569]
3659F09943569J568675J433789J131475J277924K462864K164066R76443K217472K386272
3677.4F25562549R14514N82576L65674M20451J725257K667546J272380J6868p629K37822
3697.8F33758008P46847J335144P55429j92881M8817J366853K086938N99086o39915
3716.2F39864326l98577J68801L75151L90530K37346m26114n31137N54204J773655
3734.5F42008185J639665k43009j601755j87695K048850O17504j44839J822650J254141
3752.9F47213697p50660n92947M98592L24071l37780m3869L07262O24359N41687l22700
3773.3F47461712n86450J34826P97868L07083j94788K3007N8234q0466k86699l20136
3793.7F47314191L4392j24634K55883J245916J72198j67310M89413o20305j400352
$$ y = [609943569, 611512244, 612946033, 614077508, 615355432, 617818296, 619982362, 620958805, 623176277, 625562549, 626477063, 627059639, 627425313, 627845764, 629571021, 632238567, 633510947, 633527815, 633520186, 633758008, 634504855, 635839999, 636595428, 636402547, 636451364, 637818217, 639905155, 640504241, 639864326, 639465749, 639634550, 640009701, 640400231, 640637577, 640211463, 639680326, 640234530, 642008185, 643647850, 643404841, 641803086, 641615391, 643664241, 644281745, 644136906, 645959556, 647213697, 646463037, 645870090, 646368682, 646692753, 646354973, 646311104, 646618366, 647242725, 647784412, 647461712, 646875262, 647010088, 647807956, 648115039, 647920251, 647943258, 648001492, 647921026, 647634327, 647314191, 647348583, 647223949, 647479832, 648725748, 648897946, 648730636, 649220049, 648599744, 647199392]
3812F47199392l67105Q32856K46882M84705J007081m19379q07941m60803l26157j32322
3832.4F47257209j28210M72605J067043L24607k44856m20988j141011j793981r46820
3850.8F44445598K314747K943277p51913j860916r10640J61409J64032m87864K19167
3869.1F46236897Q23557J18434n18143r47356k71976K84612j5378L62218j90258o39976
3889.5F45242631L16501K0504j047552p25448K36690P02739P57575J37389p11382p72535
3909.9F44157112n52357m13358J08361M57585J8418l09408j14202j85967m32074p0393
3930.3F42663717L43085M768m40955m47273j42813J35064j09613l16977k8670O1392
3950.7F41721725j32322k16126k18630j55866k1279l1173j74642k04563j43707j09732
$$ y = [647199392, 646832287, 647665143, 647912025, 648396730, 649403811, 648984432, 648176491, 647715688, 647389531, 647257209, 647128999, 647601604, 648668647, 648993254, 648748398, 648327410, 647186399, 645392418, 644445598, 646760345, 649703622, 648951709, 647090793, 646180153, 646341562, 646505594, 646017730, 646236897, 647060454, 647178888, 646660745, 645713389, 645441413, 645726025, 645710647, 646072865, 645882607, 645242631, 645559132, 645579636, 644532084, 643806636, 644043326, 644746065, 645503640, 645641029, 644929647, 644157112, 643604755, 643191397, 643299758, 643757343, 643775761, 643466353, 643352151, 643166184, 642734110, 642663717, 643006802, 643011570, 642570615, 642123342, 641980529, 642115593, 642005980, 641689003, 641660333, 641721725, 641589403, 641373277, 641154647, 640998781, 640977502, 640946329, 640771687, 640567124, 640423417, 640313685]
3971.1F40313685o8307m3094j41561k09451q4758J6272q9168k03848j93417j42694
3991.5F39153659p5698m6968r1910
3997.6F38939083
$$ y = [640313685, 640245378, 640202284, 640060723, 639851272, 639766514, 639782786, 639693618, 639489770, 639296353, 639153659, 639077961, 639030993, 638939083]
##END=$$ End of the data block
