##TITLE=Mariane - Epoxido $$ Begin of the data block
##JCAMP-DX=5.00 $$ ACD/SpecManager v 10.08
##SPECTROMETER/DATA SYSTEM=Alpha
##DATE=28 Apr 2015 09:23:26
##DATA TYPE=INFRARED SPECTRUM
##DATA CLASS=XYDATA
##ORIGIN=
##OWNER=
##NPOINTS=1765
##FIRSTX=399.76428223
##LASTX=3997.64306641
##MAXX=3997.64306641
##MINX=399.76428223
##MAXY=1.00124598
##MINY=0.52594727
##XFACTOR=1.0000000000
##YFACTOR=0.000000010000000
##FIRSTY=1.00000000
##DELTAX=2.03961372
##XUNITS=1/CM
##YUNITS=ARBITRARY UNITS
##XYDATA=(X++(Y..Y))
399.8A00000000N4157m9627k60454j66172K48861K97833j24598k74473j15878R5177
420.2I9704826j58697l22694j57839j38796n45001p85410k68871M77458N49095K36744
440.6I8590815K04957J70117j63173l16173j21677j33735o00404j234942j520998r02813
461I3971974L21144J289224J373106P99752J10238j95539m7749k5576l20995n03445
481.3I6772134m72116p10827j405335k152246k575904k046055n972K468991L476179
499.7I3348849K719939J294958L90446K32381J39600k15334m36818l59994m45122j002383
520.1I5666522j731944k765727m599399m943651m79680N680072P054174L999794J333171
538.5I9213332M86457K93809k6756k28477l1799J29551p9334k60716r2167Q5753o1941
$$ y = [100000000, 100054157, 100004530, 99744076, 99577904, 99826765, 100124598, 100000000, 99725527, 99609649, 99704826, 99546129, 99223435, 99065596, 98926800, 98381799, 97596389, 97327518, 97804976, 98354071, 98590815, 98795772, 98965889, 98802716, 98486543, 98364866, 98231131, 97630727, 96395785, 94874787, 93971974, 94293118, 95582342, 96955448, 97755200, 97865438, 97669899, 97622150, 97596574, 97275579, 96772134, 96300018, 95589191, 94183856, 92031610, 89455706, 87409651, 87403679, 89872670, 93348849, 96068788, 97363746, 97754192, 97986573, 98126173, 97910839, 97474021, 97114027, 96668905, 95666522, 93934578, 91168851, 86569452, 81625801, 81146121, 86826193, 93880367, 97880161, 99213332, 99699789, 99993598, 99966842, 99738365, 99706566, 99836117, 99756783, 99496067, 99403900, 99489653, 99427712]
560.9I9427712k22862n9891J21129l2330k04968m2933J34581l4499k36964p5978J25336
583.3I8898333k2041k21032q4079J01930l8028k23368q3321J18369k2454k54547j58548
605.8I8011214L3748j39815n16623n38391J6802M20970J19031j79607k38955k94209
626.2I6694165m6265L43216L35902l6413m16720m58794l55196o53881j362235k189940
646.6I1853839k800351j803863J205408L186566K260381Q8102j833308l478742m152882
664.9H4525150j731360M375547M634857J550568J0448q79943j864815l770989o080687
683.3H0768776n060673J430851P248897O281888J874280j056051k626294m766917p530934
701.6G6563823p229066m68069P065624O190127j029152l560715K077025P080078O254202
$$ y = [99427712, 99204850, 99144959, 99266088, 99233758, 99028790, 98985857, 99120438, 99085939, 98848975, 98772997, 98898333, 98876292, 98655260, 98571181, 98673111, 98635083, 98411715, 98328394, 98446763, 98424309, 98169762, 98011214, 98044962, 97905147, 97388524, 96850133, 96866935, 97287905, 97406936, 97227329, 96988374, 96694165, 96647900, 96991116, 97327018, 97290605, 96873885, 96415091, 96059895, 95406014, 94043779, 91853839, 89053488, 87249625, 88455033, 91641599, 93901980, 93990082, 92156774, 88678032, 84525150, 82793790, 87169337, 91804194, 93354762, 93365210, 92485267, 90620452, 86849463, 80768776, 75708103, 77138954, 84387851, 90669739, 92544019, 91487968, 88861674, 84094757, 76563823, 69334757, 68866688, 75932312, 82122439, 81093287, 77532572, 79609597, 86689675, 92943877]
720I2943877L552538J891875Q65901K62046K07674K61963J4126k20144j08194M3732
740.4I9715394j29044l08341j45555O0666r4420l36539k73884j37532l26710o46055
760.8I7377980o77228n72038p65073j210231j596510k265752l749203m318273p04944
779.1H1518728M659187N420822K112007n33014j628471k547639l521300l550761k071780
797.5G9857779o3360J360094K303571K780950K232534R06866k35837q96246j865720
815.8H6380631l608650m254401q03095M697585N796582J889812j133537j142734j774806
834.2H6047387l564525l004497j7291K893525M640675M907811L799885K179742R74923
852.6I8857635M90916L14367l642l54320m96572n53304p55668r94247j091224r89359
$$ y = [92943877, 96496415, 98388290, 99254191, 99516237, 99723911, 99985874, 100000000, 99779856, 99671662, 99715394, 99586350, 99278009, 99132454, 99193120, 99098700, 98762161, 98488277, 98350745, 98024035, 97377980, 96700752, 96128714, 95363641, 94153410, 92556900, 90291148, 86541945, 82223672, 81518728, 86177915, 91598737, 93710744, 93177730, 91549259, 89001620, 85480320, 81929559, 79857779, 79794419, 81154513, 83458084, 86239034, 88471568, 89378434, 89142597, 88246351, 86380631, 82771981, 78517580, 77714485, 82412070, 88208652, 90098464, 88964927, 87822193, 86047387, 82482862, 79478365, 79461074, 82354599, 86995274, 91903085, 95702970, 97882712, 98857635, 99348551, 99662918, 99659276, 99304956, 98808384, 98255080, 97499412, 96505165, 95413941, 94424582]
873I4424582m72200L43990O08462p6783j172536k185750k959073l321046k723687p13194
893.4H1752765J925630L583645L657765K841425J997923J466281J073688O54697L45475
911.7I9299294K63399K18051P5114k8336L582j4347k46799o18320j232875k392488
932.1I5326275k695787k25634K582819K572512J062590q6808o73097l75683N28682
950.5I8015869Q17209M21250J03855j06644k84410k25210k5475j6868j44399j65194
970.9I8389983j18500j81395l75586o02323o06722k09534Q5080r4098l51227n31268
991.3I5404410p99930j135969j541150j831120j557213j102871j454025k363944k417582
1009.6H1200606j252419r53460m56416M106664Q150864N969620J533740p56538p63058
$$ y = [94424582, 93952382, 94296372, 94904834, 94828051, 93655515, 91469765, 88510692, 85189646, 82465959, 81752765, 83678395, 87262040, 90919805, 93761230, 95759153, 97225434, 98299122, 98953819, 99299294, 99562693, 99780744, 99855858, 99827522, 99831104, 99816757, 99569958, 98951638, 97718763, 95326275, 92630488, 92404854, 94987673, 97560185, 98622775, 98535967, 97862870, 97487187, 98015869, 98833078, 99254328, 99358183, 99251539, 98967129, 98741919, 98716444, 98699576, 98555177, 98389983, 98271483, 98090088, 97714502, 97112179, 96505457, 96295923, 96381003, 96286905, 95935678, 95404410, 94604480, 93468511, 91927361, 90096241, 88539028, 87436157, 85982132, 83618188, 81200606, 79948187, 78994727, 78538311, 82644975, 90795839, 96765459, 98299199, 97542661, 96779603]
1028I6779603L37112R25612O05434J52976k7126n3889j31142k81471l65347l86679
1048.4I7555083m90981p40779j083845j568162k143753j854914K25347K369636K266545
1066.7I4534177Q29565j07628m58491o68907q40288j179195j997322l535860n597634
1085.1H0978417o265407k962786L247082P408219O564177L221058J170206P79200Q67230
1103.4I5007396R67306O73908m4883q02165j452690k036029j928670j46269K221119
1121.8I2459023K879637J892508Q28093L26210J98966J28854Q523o9600o5434q6141
1142.2I8500639j71667k13099j50495r1190j43194k68578m51333n84715k64114L21799
1162.6I6484053L77017m3034m84109r80193j477807j339740m54295K89071Q82536J373124
$$ y = [96779603, 97116715, 98042327, 98647761, 98800737, 98773611, 98719722, 98588580, 98307109, 97941762, 97555083, 97064102, 96323323, 95239478, 93671316, 91527563, 89672649, 89897996, 92267632, 94534177, 95363742, 95256114, 94797623, 94128716, 93288428, 92109233, 90111911, 86576051, 80978417, 74713010, 71750224, 74997306, 82405525, 88969702, 92190760, 93360966, 94140166, 95007396, 95974702, 96648610, 96603727, 95801562, 94348872, 92312843, 90384173, 90237904, 92459023, 95338660, 97231168, 98059261, 98385471, 98584437, 98713291, 98721814, 98652214, 98586780, 98500639, 98328972, 98115873, 97965378, 97874188, 97730994, 97462416, 97011083, 96426368, 96162254, 96484053, 96861070, 96818036, 96333927, 95353734, 93875927, 92536187, 92081892, 92370963, 93253499, 94626623]
1183I4626623R23497k49517j303101j724887r40942O35123J495504J173979M56518
1201.3I5092797q3399l53205m71604o08682p89613r02289r41729j063699j353467j735699
1221.7H6789411k126038k494073k791524k964121l037435k959549k124667J23596K970618
1240.1G1386218M501128M090804K934432K310449K421087K563721K102643J331306
1256.4I3641788R51719R91100R33147O07162K26403j12504m01211n70852o01416m86738
1276.8I5178598j37806L59100O82181O67459M49187K49058J28436m7565m37879j047284
1297.2I6043485j360577q82095k67977j0669M03094P99412P41214N37902M25106L34620
1317.6I6763515K24203Q8501n7852j98018l52514n15503o76829q80581j149839j238668
$$ y = [94626623, 95550120, 95300603, 93997502, 92272615, 91331673, 91966796, 93462300, 94636279, 95092797, 95009398, 94656193, 94184589, 93575907, 92786294, 91884005, 90942276, 89878577, 88525110, 86789411, 84663373, 82169300, 79377776, 76413655, 73376220, 70416671, 68292004, 68415600, 71386218, 75887346, 79978150, 82912582, 85223031, 87644118, 90207839, 92310482, 93641788, 94593507, 95584607, 96517754, 97124916, 97351319, 97238815, 96837604, 96266752, 95665336, 95178598, 95040792, 95399892, 96082073, 96749532, 97198719, 97447777, 97576213, 97528648, 97090769, 96043485, 94682908, 93800813, 93532836, 93522167, 93925261, 94724673, 95465887, 96003789, 96428895, 96763515, 96987718, 97076219, 97018367, 96820349, 96467835, 95952332, 95275503, 94394922, 93245083, 92006415]
1338I2006415q53521m16523k04760L40283R75854P73364k5320l95346K0254O38729
1358.4I2859429Q83544P74687M53365J13404q3727j54632k37256m03816o15716q81654
1378.8I2707628j192522j411855j654697k322131l174120l537113l082537n04172L804230
1397.1G9632711O342274N377496L053343J538420N88119k3610m09811o66845q43525
1415.5I4588572j186007j772422k051824k465934l074843l169459k419346o1971K753949
1433.9H1140715M704869M289442J670045k89637j768387m115885o507301l350068L663564
1452.2G9437357O798434N829794L358036J145357L51900M8935j26284j86968l60990
1470.6I6295571o78175n22066K5273J32149k85774r64546j650805k547270m019695
$$ y = [92006415, 91152894, 90736371, 90531611, 90871894, 91847748, 92621112, 92595792, 92200446, 92220700, 92859429, 93742973, 94517660, 94971025, 95084429, 95000702, 94846070, 94608814, 94204998, 93589282, 92707628, 91515106, 90103251, 88448554, 86126423, 82952303, 79415190, 76332653, 75828481, 79632711, 85974985, 91352481, 94405824, 95944244, 96532363, 96508753, 96098942, 95432097, 94588572, 93402565, 91630143, 89578319, 87112385, 84037542, 80868083, 78448737, 78386766, 81140715, 85845584, 90135026, 91805071, 91515434, 89747047, 85631162, 79123861, 75773793, 79437357, 86235791, 92065585, 95423621, 96568978, 96920878, 96969813, 96843529, 96656561, 96295571, 95617396, 95095330, 95120603, 95252752, 94966978, 94002432, 92351627, 89804357, 85784662]
1488.9H5784662n347342m890179j906669N009365R798133O867898K877444J030671
1505.2I9223983L50005J01220J18411J27679P0012Q690j4621p2056j34891j39088j14441
1527.7I9524903r4968j62494k63941k03228j44303k69300k86126j05900n4442j13196
1548.1I7827005k04527k24435j84578j25980j44542k09772j52606k08730l49867n83452
1568.5I5438516q28606r25350j896161l835994k132535K011442L396643J376617q88712
1586.8I1715860k171355l407687m006243k207124J230651L053862L192419L186738
1603.2I0587121K545876J236075K32082k13110l79270n49514o37906l20429q0430j01275
1623.5I2319220j81919k20645k20179j66166j53661k94685m05610m30923m83376n26405
$$ y = [85784662, 80437320, 75547141, 73640472, 78649837, 88447970, 95315868, 98193312, 99223983, 99573988, 99675208, 99793619, 99921298, 99991310, 100000000, 99985379, 99913323, 99778432, 99639344, 99524903, 99429935, 99267441, 99003500, 98800272, 98655969, 98386669, 98100543, 97994643, 97940201, 97827005, 97622478, 97398043, 97213465, 97087485, 96942943, 96733171, 96580565, 96371835, 96021968, 95438516, 94609910, 93684560, 91788399, 87952405, 85819870, 87831312, 91227955, 92604572, 91715860, 89544505, 86136818, 82130575, 79923451, 81154102, 84207964, 87400383, 90587121, 93132997, 94369072, 94601154, 94388044, 94008774, 93459260, 92821354, 92500925, 92420495, 92319220, 92137301, 91916656, 91696477, 91530311, 91376650, 91081965, 90676355, 90245432, 89762056, 89235651]
1643.9H9235651n43326k63524J16057J50614r9068k36959l42405o12580j128346j505280
1664.3H4770834j543062k007086k716410k518278k237916k133173k335727l382868
1680.7F5896314n190962o152898j957727K431405M641545M834234M766924M975301
1697G4244136N033713N445528L742355K446932K039224J321339Q81857P96604Q68821
1715.3I6820509R18276O96164M12708K73169J90675J38134J45101J30260O8987K8234
1735.7I9822217M0460K8843Q565J6981M1473M1461r513m1747l0911m4864q4895r9522
1760.2I9688548r8014p8046p2879o7234m5240q8739j57678j82319j89573j96159j69801
1782.6I8342866q9836P4535K77043M17804M27586L01200J78939O9863k1905l5470J5312
$$ y = [89235651, 88692325, 88428801, 88544858, 88695472, 88596404, 88359445, 88017040, 87404460, 86276114, 84770834, 83227772, 81220686, 78504276, 75985998, 73748082, 71614909, 69279182, 65896314, 60705352, 54552454, 52594727, 55026132, 59667677, 64501911, 69268835, 74244136, 79277849, 84723377, 88465732, 90912664, 92951888, 94273227, 95155084, 95951688, 96820509, 97738785, 98434949, 98847657, 99120826, 99311501, 99449635, 99594736, 99724996, 99793983, 99822217, 99862677, 99891520, 99900085, 99917066, 99958539, 100000000, 99990487, 99948740, 99917829, 99872965, 99788070, 99688548, 99590534, 99512488, 99439609, 99372375, 99327135, 99238396, 99080718, 98898399, 98708826, 98512667, 98342866, 98253030, 98327565, 98604608, 99022412, 99449998, 99751198, 99930137, 100000000, 99978095, 99942625, 99957937]
1805.1I9957937L7599J1700j4377p444j5182p0333j17999j25623j32889j38950o3944
1827.5I9320495O3861J23411O0177j3566k206M9288L6054k7489j7768M1061L8636N966
1852I9677920J4598M7934M7087R942j7357j4805j0544j9694j5783J383j0813m8017
1876.5I9661851o7639n8371o2090r3687j14518j14108j21897j67412k40969l12686
1896.9I8308474m32456o80506r64266q85922j15406P95877R37628N71365M64761N44047
1917.3I8543596M28021J87832L0029p2306j48070j12814N7894J94395J82199J12415
1937.7I9403191P5388M7266P635o967Q952Q506l2872o8683o7246p8171j10561p6091
1962.1I9110347K6530N6279m5127j82027l02535m20958m06879q6051L49534N14346
$$ y = [99957937, 99995536, 100007236, 99992859, 99985415, 99970233, 99899900, 99781901, 99656278, 99523389, 99384439, 99320495, 99384356, 99507767, 99567944, 99554378, 99552172, 99601460, 99637514, 99610025, 99592257, 99633318, 99671954, 99677920, 99692518, 99740452, 99787539, 99797481, 99780124, 99765319, 99754775, 99735081, 99719298, 99720681, 99709868, 99661851, 99594212, 99535841, 99473751, 99380064, 99265546, 99151438, 99029541, 98862129, 98621160, 98308474, 97876018, 97195512, 96231246, 95345324, 95229918, 96025795, 96963423, 97534788, 97999549, 98543596, 98971617, 99159449, 99189478, 99117172, 98969102, 98856288, 98914182, 99108577, 99290776, 99403191, 99478579, 99525845, 99533480, 99526513, 99535465, 99543971, 99511099, 99442416, 99375170, 99296999, 99186438, 99110347, 99136877, 99193156, 99148029, 98966002, 98663467, 98242509, 97835630, 97749579, 98099113, 98613459]
1982.5I8613459L61293J19061n2947j54168j86300q2212J04463K26533K08223J01834
2002.9I9259239K6626J8942J9264j007o598J0019K653l8123n4914l6842j6325J4716
2027.4I9197650M3565M9973L2073j3191l7640q100J8704k319k6226j1611P987n776
2051.9I9245089k1696M459L9351K5534r936p444J5741O122k1726j3328J4699Q159j8805
2078.4I9266219j3268J6010J7506p230j0050J4419J7285j1366k1446K62M929k0849
2102.9I9252421l2139j0109k56l1740n6881l3676M262J4543J6552L7259M9746K3389
2127.3I9233371k944J5729L8183J6183j2893k68K3746J1892j3459n710K1600J7447
2151.8I9342877j6612k4712K879J3381o580j2029L612O0j7971j2684R960J0592j3614
$$ y = [98613459, 98974752, 99093813, 99040866, 98886698, 98700398, 98618186, 98722649, 98949182, 99157405, 99259239, 99285865, 99304807, 99324071, 99323064, 99316466, 99326485, 99329138, 99291015, 99236101, 99199259, 99182934, 99197650, 99241215, 99291188, 99323261, 99310070, 99272430, 99264330, 99283034, 99280715, 99254489, 99242878, 99250865, 99245089, 99223393, 99227852, 99267203, 99292737, 99282801, 99275357, 99291098, 99297220, 99275494, 99262166, 99276865, 99285024, 99266219, 99252951, 99268961, 99286467, 99279237, 99269187, 99283606, 99300891, 99289525, 99268079, 99268341, 99273270, 99252421, 99220282, 99210173, 99209917, 99178177, 99121296, 99087620, 99091882, 99106425, 99122977, 99160236, 99209982, 99233371, 99230427, 99246156, 99284339, 99300522, 99287629, 99287361, 99311107, 99322999, 99309540, 99303830, 99325430, 99342877, 99326265, 99301553, 99304432, 99317813, 99311233, 99299204, 99302816, 99302876, 99284905, 99272221, 99282181, 99292773, 99279159]
2178.3I9279159k2244o139p207l9136n0157j1236K8366K6530J1188J6969J9396j3662
2202.8I9231827m5669l3527j1480k3717m2063k4700m83j6540m4489k9224J3202L3271
2227.3I9006408L2646M1288M8769K6041o485n055J6499P999k5851l4928j3012j228
2251.8I9093091j0716j1480P850J9991J0300M387J3780K337m4126p6973o4939m5848
2276.2I8897654m7380k7496L4190P3760M6224K068J496K3490K3127J2082K3764M0400
2300.7I9103379K3020j2655k2888j4823l1352o7670o4826k1755j8990n9116l2717N8436
2325.2I8838043P6938P105m9323o5035r3388j17553n3012Q1015J53845J27673Q9324
2347.6I8995632O4295K3020l3027o2955m2635p665m762j2887M101J8358J4508K2948
$$ y = [99279159, 99256915, 99250776, 99243569, 99204433, 99154276, 99143040, 99171406, 99197936, 99209124, 99226093, 99245489, 99231827, 99186158, 99152631, 99141151, 99117434, 99075371, 99050671, 99050188, 99033648, 98989159, 98959935, 98973137, 99006408, 99039054, 99080342, 99129111, 99155152, 99148667, 99143612, 99160111, 99168110, 99142259, 99107331, 99094319, 99093091, 99082375, 99070895, 99078745, 99098736, 99109036, 99113423, 99127203, 99129540, 99085414, 99008441, 98943502, 98897654, 98850274, 98822778, 98856968, 98930728, 98976952, 98979020, 98980516, 99004006, 99027133, 99039215, 99062979, 99103379, 99126399, 99113744, 99090856, 99076033, 99044681, 98977011, 98912185, 98890430, 98871440, 98812324, 98779607, 98838043, 98914981, 98922086, 98872763, 98807728, 98714340, 98596787, 98543775, 98624790, 98778635, 98906308, 98995632, 99059927, 99082947, 99049920, 98986965, 98944330, 98936665, 98931903, 98919016, 98923117, 98941475, 98955983, 98978931]
2372.1I8978931M6879N2768K5600k831p063j4031m1271m8053q213L0928J7643k5576
2396.6I9005711m5073l5119j9526j801K4933M8381M4966K1815J4007K4629J9652m685
2421I9097890j0282J0103J8048j85j2022l403m304k3436k3020Q917L0607J8263k26
2447.6I9106950q35n466l2395m8607k4176J2898K5660K3759L2174M0710K5743Q77l964
2474.1I9153328O622N049r436j2636m089p307k3544k4611j121K0045K4081K5564K6298
2500.6I9178243J0740j2987j5974J460J1086N424J628O133K56j9091k3228n829Q368
2527.1I9146229P480O98J472M417m876j5944j3077o474j1670j5026k438P236l344k1964
2555.6I9072719k7776k2960k5356l4362l7294l3057k7150j6266P766L3045L5471K1565
$$ y = [98978931, 99025810, 99078578, 99104178, 99101347, 99094284, 99080253, 99038982, 98990929, 98982716, 99013644, 99031287, 99005711, 98960638, 98925519, 98905993, 98904192, 98929125, 98977506, 99022472, 99044287, 99058294, 99082923, 99102575, 99097890, 99087608, 99097711, 99115759, 99115574, 99103552, 99100149, 99095845, 99072409, 99049389, 99058306, 99088913, 99107176, 99106950, 99106115, 99100649, 99068254, 99019647, 98995471, 99008369, 99034029, 99057788, 99089962, 99130672, 99156415, 99157292, 99153328, 99159950, 99164999, 99155563, 99142927, 99138838, 99131531, 99107987, 99083376, 99082255, 99102300, 99126381, 99151945, 99178243, 99188983, 99175996, 99160022, 99161482, 99172568, 99177992, 99179620, 99185753, 99186009, 99166918, 99143690, 99137861, 99146229, 99153709, 99154407, 99155879, 99160296, 99155420, 99139476, 99126399, 99119925, 99108255, 99093229, 99090791, 99098027, 99094683, 99072719, 99044943, 99021983, 98996627, 98962265, 98924971, 98891914, 98864764, 98848498, 98856264, 98889309, 98924780, 98946345]
2580.1I8946345J5938J3358O79j3483j1330Q589J8286N830o932j4007k8909m7129m1723
2606.6I8845512m536L0285M2897N1153N7387M5568J5474j0092j0806N502J9896K8038
2631.1I9116278K8950J7923p10j6796k1899j8287k0068k5535j5640O288J5849P564
2655.6I9073917n359j8430l6382m7195l1692J472K9981M4680M6080L9465K5642M106
2680.1I9126285j2272j4651j1122o479L343Q357m381j6791j0138J853M137j91k569
2706.6I9065381k503q613j8698j7673j0460j3095j9438j5908n239m363j3715j7089
2731.1I8918587j3143l177J4180K7245K7883K2883J5169M244n114r155q244l797j734
2757.6I8985827p814j8740k7013k8681k3962j5413k712J0353J2958Q452J693j0294
$$ y = [98946345, 98962283, 98975641, 98976320, 98962837, 98951507, 98960096, 98978382, 98984212, 98977280, 98963273, 98934364, 98887235, 98845512, 98840976, 98871261, 98914158, 98965311, 99022698, 99068266, 99083740, 99073648, 99062842, 99068344, 99088240, 99116278, 99145228, 99163151, 99162441, 99145645, 99123746, 99105459, 99085391, 99059856, 99044216, 99050504, 99066353, 99073917, 99068558, 99050128, 99013746, 98966551, 98934859, 98936331, 98966312, 99010992, 99057072, 99096537, 99122179, 99126285, 99114013, 99099362, 99088240, 99081761, 99085104, 99093461, 99089080, 99072289, 99062151, 99064004, 99068141, 99067950, 99065381, 99062878, 99054265, 99035567, 99017894, 99007434, 98994339, 98974901, 98958993, 98953754, 98949391, 98935676, 98918587, 98905444, 98902267, 98916447, 98943692, 98971575, 98994458, 99009627, 99013871, 99008757, 98999602, 98991358, 98987561, 98985827, 98978013, 98959273, 98932260, 98903579, 98879617, 98864204, 98861492, 98871845, 98884803, 98893255, 98894948, 98884654]
2782I8884654k4629m2539o6978q4388n7221K4486R2506Q0204J9360j5736j3375m602
2806.5I8791742j228q195k4831l1603k5672k6309l5369l1418o473K2542L9107L8725
2831I8701018K9188K2054J3370j6308n3025o3890o2889o5195n4991k6483R251L6913
2855.5I8469013N2047M9513K8199O122p648j6743j7130j0419k2948n1885n6041m1389
2879.9I8380691l0881j3674L225j490j2481n550Q274J4370J7143J3339m160k7430m1610
2906.5I8299766l6681j8948j6660m3982o9386p4154p2801o2514l9857q798J2821J007
2930.9I7869813q720J5599M0299M5460M8292M7576K5666j0741l1131k6882l1930n2107
2955.4I7931194n2672l5310k5785l1537l9285l4046j9670n376Q738K5892L1781L433
$$ y = [98884654, 98860025, 98817486, 98750508, 98666120, 98608899, 98633385, 98725891, 98806095, 98825455, 98809719, 98796344, 98791742, 98790514, 98782319, 98757488, 98725885, 98700213, 98673904, 98638535, 98607117, 98600644, 98623186, 98662293, 98701018, 98730206, 98752260, 98765630, 98749322, 98696297, 98632407, 98569518, 98504323, 98449332, 98422849, 98432100, 98469013, 98521060, 98570573, 98598772, 98604894, 98597246, 98580503, 98563373, 98552954, 98530006, 98478121, 98422080, 98380691, 98349810, 98336136, 98339361, 98337871, 98325390, 98319840, 98328114, 98342484, 98359627, 98372966, 98368806, 98341376, 98299766, 98263085, 98244137, 98227477, 98183495, 98114109, 98039955, 97967154, 97904640, 97864783, 97855985, 97868806, 97869813, 97861093, 97876692, 97916991, 97962451, 98010743, 98058319, 98083985, 98073244, 98042113, 98015231, 97983301, 97931194, 97878522, 97843212, 97817427, 97785890, 97746605, 97712559, 97692889, 97687513, 97696251, 97722143, 97753924, 97757357]
2979.9I7757357l8617n0867l3146j5915j5163l5298p3564j21915j83976k41590k52562
3002.3I6694744j92690q1748Q70k4485j73235m10939o65360p71898n25660J3560M47292
3024.7I4310451N05733K88594n4819m80902q27026o51634K37692J131588J238376P29304
3045.1I6427357J85043j65576l12763k48009j14715j26148k19243k14512r7555R5261
3065.5I5209140K93600L42626K18564J04922J22911J70719J05614l2217j14512j47128
3085.9I6274239k24215l21460k87223j07121M4233J25390K37727L47549L58790K97326
3106.3I6745235K27618J62035J22672J17559J02335O5297J6993k5737k4045J0890K4819
3128.8I7545671j066k5815o801L0321K9403o944k1082o932n85P022J9127K462k5934
$$ y = [97757357, 97718740, 97667873, 97634727, 97618812, 97603649, 97568351, 97494787, 97372872, 97188896, 96947306, 96694744, 96502054, 96420306, 96421176, 96396691, 96223456, 95812517, 95147157, 94375259, 93849599, 93863159, 94310451, 94816184, 95104778, 95049959, 94569057, 93742031, 93090397, 93328089, 94459677, 95698053, 96427357, 96612400, 96446824, 96134061, 95886052, 95771337, 95645189, 95425946, 95211434, 95113879, 95209140, 95502740, 95845366, 96063930, 96168852, 96291763, 96462482, 96568096, 96535879, 96421367, 96274239, 96050024, 95728564, 95441341, 95334220, 95378453, 95503843, 95741570, 96089119, 96447909, 96745235, 96972853, 97134888, 97257560, 97375119, 97477454, 97542751, 97559744, 97534007, 97509962, 97520852, 97545671, 97544605, 97518790, 97511989, 97542310, 97571713, 97564769, 97543687, 97536755, 97536170, 97543192, 97562319, 97564781, 97538847]
3155.3I7538847k0856k432o705k6650l7646l0863k3306k9385l8516l5584k5845j8418
3179.8I7242641j3500q523l589p21J699n37j4203l5781m8208m1801l2425l6520n0038
3206.3I6958494n7393n0742m7534n7495n9318n3090n9146o8450o4439n3429m6802l6174
3230.7I6304482l0833n9063q5973p5370n7042m2564k8956l8725o5386o8718m7982m3064
3255.2I5660806o2579p3612o8605o0707m1807n263K1642l093n1427o4975n6440n2327
3279.7I5141613m9835m2444l4124k9296k0420j7441l8200p2420r7901r2524n8114l8547
3304.2I4550347o5607j12211j35267j34814j30760j26231j19507j17732j21122j24723
3324.6I3362373j38903j62547j78123j78563j67501j67156k00385k40200k63030k97403
$$ y = [97538847, 97517991, 97515559, 97508854, 97482204, 97444558, 97413695, 97390389, 97361004, 97322488, 97286904, 97261059, 97242641, 97229141, 97220618, 97217029, 97216308, 97218007, 97217470, 97203267, 97167486, 97119278, 97077477, 97045052, 97008532, 96958494, 96901101, 96850359, 96802825, 96745330, 96686012, 96632922, 96573776, 96505326, 96440887, 96387458, 96340656, 96304482, 96273649, 96214586, 96128613, 96053243, 95996201, 95953637, 95924681, 95885956, 95820570, 95751852, 95703870, 95660806, 95598227, 95524615, 95456010, 95395303, 95353496, 95348233, 95369875, 95366782, 95315355, 95250380, 95193940, 95141613, 95091778, 95049334, 95015210, 94985914, 94965494, 94948053, 94909853, 94837433, 94739532, 94647008, 94588894, 94550347, 94484740, 94372529, 94237262, 94102448, 93971688, 93845457, 93725950, 93608218, 93487096, 93362373, 93223470, 93060923, 92882800, 92704237, 92536736, 92369580, 92169195, 91928995, 91665965, 91368562]
3345I1368562l48079l86286l99214l56019k20406m7332N0682M0436j8925o2149p1967
3367.4H9549303p8243j05584j42282j67352j69241j63812j68448j67948j55509j39505
3387.8H8091379j25503j25224j35481j35404j16473j02878j25563j50949j30552r4205
3408.2H6849147q0472q7983j07365j10144q5687o7342n9861l8552q130L308r805n877
3432.7H6191237K0498Q088l8224m2516K801M2469M7373L8064M4602N9652O8450Q1402
3457.1H6523896R8199R3627R1136J22070J34683Q5783L2228L9899Q5843J24109J13821
3479.6H7545294O4814O7031J09768J07080Q6373J01203J26260J28621J09333J02448
3500H8548225J11169R5540P7558R2572J24776J50424J37043J06019J09494J37078J51706
$$ y = [91368562, 91020483, 90634197, 90234983, 89878964, 89658558, 89611226, 89661908, 89702344, 89683419, 89621270, 89549303, 89471060, 89365476, 89223194, 89055842, 88886601, 88722789, 88554341, 88386393, 88230884, 88091379, 87965876, 87840652, 87705171, 87569767, 87453294, 87350416, 87224853, 87073904, 86943352, 86849147, 86768675, 86680692, 86573327, 86463183, 86377496, 86310154, 86250293, 86211741, 86203611, 86206919, 86197114, 86191237, 86211735, 86219823, 86181599, 86139083, 86141884, 86184353, 86231726, 86269790, 86314392, 86374044, 86442494, 86523896, 86622095, 86715722, 86806858, 86928928, 87063611, 87149394, 87181622, 87221521, 87307364, 87431473, 87545294, 87610108, 87677139, 87786907, 87893987, 87980360, 88081563, 88207823, 88336444, 88445777, 88548225, 88659394, 88754934, 88832492, 88925064, 89049840, 89200264, 89337307, 89443326, 89552820, 89689898, 89841604]
3522.4H9841604J29384J00142J05500J26857J46758J64390J55163J34980J49364J65128
3542.8I1219270J38778R6136R1618J09423J15233J26273J44589J57970J59055J35410
3563.2I2493755R7912J06979J68258J80619J55056J55687J77133J98245K13349K06131
3583.6I4153124J53095J03169J54651K04586J84727J78188J96475J88071J81347J84428
3604I5881861J51593J27172J53071J69003J68872J55538J26171J44077J73908J57231
3624.4I7408497J06669M9925R2113J48523J31660J03498Q1414P4655Q6182P7444J9700
3646.8I8380280k9737L4779J13684J11312J04171J06829N1540j698J3363K0003j6755
3669.2I8887771K0272M5764l1691l589O6275O1512O2865O7454L1478k2567J5641Q6915
$$ y = [89841604, 89970988, 90071130, 90176630, 90303487, 90450245, 90614635, 90769798, 90904778, 91054142, 91219270, 91358048, 91454184, 91545802, 91655225, 91770458, 91896731, 92041320, 92199290, 92358345, 92493755, 92591667, 92698646, 92866904, 93047523, 93202579, 93358266, 93535399, 93733644, 93946993, 94153124, 94306219, 94409388, 94564039, 94768625, 94953352, 95131540, 95328015, 95516086, 95697433, 95881861, 96033454, 96160626, 96313697, 96482700, 96651572, 96807110, 96933281, 97077358, 97251266, 97408497, 97515166, 97565091, 97657204, 97805727, 97937387, 98040885, 98122299, 98196954, 98283136, 98360580, 98380280, 98350543, 98385322, 98499006, 98610318, 98714489, 98821318, 98872858, 98871160, 98884523, 98904526, 98887771, 98908043, 98953807, 98922116, 98918527, 98984802, 99046314, 99109179, 99176633, 99208111, 99185544, 99201185, 99288100]
3693.7I9288100Q5884M6414Q733j0854J6450L4196j419n9426n8132L5488P8297M9174
3718.2I9512905J4055r48l934R906L9655L2801j3316m3422l910O7657O6704k9421q6063
3744.7I9562669J7482K1112o1935J2922J01441P0113J2916J9092L5733J2612O14j0181
3769.2I9794590p963K7305L9560J8048j3143j5580p081p648P475J6385O676r477k7669
3795.7I9821478k1374l5614n7191K659O14k6834L0404N6332M960m2427j3793k5850
3820.2I9693364k1613N1618N5611L9661K8354J6785J8769l0267q8448l6507L9279P7641
3844.6I9844247Q7065N6654k9034j63799r6798Q7112R0152K8443k2310k5200k182l0714
3869.1I9823636l3426L218J6779K0832k2215l5381q440l7843k9040j3548m1336K271
$$ y = [99288100, 99373984, 99420398, 99429131, 99418277, 99434727, 99468923, 99467504, 99408078, 99349946, 99385434, 99463731, 99512905, 99526960, 99526012, 99522078, 99531984, 99571639, 99604440, 99591124, 99547702, 99543792, 99611449, 99678153, 99648732, 99562669, 99580151, 99601263, 99539328, 99552250, 99653691, 99723804, 99736720, 99755812, 99791545, 99804157, 99804771, 99794590, 99786627, 99813932, 99853492, 99871540, 99858397, 99842817, 99835736, 99828088, 99835563, 99851948, 99858624, 99849147, 99821478, 99800104, 99764490, 99707299, 99709958, 99710572, 99683738, 99714142, 99770474, 99775434, 99733007, 99719214, 99693364, 99671751, 99723369, 99778980, 99818641, 99846995, 99863780, 99882549, 99852282, 99763834, 99727327, 99766606, 99844247, 99931312, 99987966, 99958932, 99795133, 99698335, 99785447, 99875599, 99904042, 99881732, 99856532, 99854350, 99823636, 99790210, 99793428, 99810207, 99831039, 99808824, 99773443, 99765003, 99727160, 99698120, 99684572, 99643236, 99645507]
3893.6I9645507N6577K7132j7917k2352l475L8213O6733N0742L1948K0414l421n686
3918.1I9884415J4347Q398n627J3495K4122n281j3185J7500K5880R245o413p123J6272
3944.6I9976045K3955O723O438J8310J1683j455L601P927J454r18m291o783m757n054
3973.1A00032878J728J3030J1539J0980J7047M911j5855k0718j6356j1802r918q094
3997.6A00009370
$$ y = [99645507, 99702084, 99729216, 99711299, 99688947, 99685472, 99723685, 99790418, 99841160, 99873108, 99893522, 99890101, 99884415, 99898762, 99907160, 99901533, 99915028, 99939150, 99933869, 99920684, 99938184, 99964064, 99973309, 99966896, 99959773, 99976045, 100000000, 100006723, 100013161, 100031471, 100043154, 100041699, 100045300, 100053227, 100054681, 100053763, 100049472, 100042689, 100037932, 100032878, 100034606, 100047636, 100059175, 100070155, 100087202, 100092113, 100076258, 100055540, 100039184, 100027382, 100017464, 100009370]
##END=$$ End of the data block
