##TITLE=Marcos I $$ Begin of the data block
##JCAMP-DX=5.00 $$ ACD/SpecManager v 10.08
##SPECTROMETER/DATA SYSTEM=Alpha
##DATE=02 Apr 2015 08:25:20
##DATA TYPE=INFRARED SPECTRUM
##DATA CLASS=XYDATA
##ORIGIN=
##OWNER=
##NPOINTS=1765
##FIRSTX=399.76428223
##LASTX=3997.64306641
##MAXX=3997.64306641
##MINX=399.76428223
##MAXY=0.82528728
##MINY=0.19487196
##XFACTOR=1.0000000000
##YFACTOR=1.000000000000000e-9
##FIRSTY=0.79723024
##DELTAX=2.03961372
##XUNITS=1/CM
##YUNITS=ARBITRARY UNITS
##XYDATA=(X++(Y..Y))
399.8G97230244J3162553R991050L796875l310144n143523K52545M827440K677500
416.1H23484540j566947m24146K573192J220643j498043j531601N95987Q71718j723469
434.4H22001874l024935o70255J371503L6240k462924k010166O46710J157522j492977
452.8H15552592l227770j225412J562893K42472k698064k332806J68085L56495k696156
471.2H05702329m080952j454591J14441k098382m980445m685223k626002l510117p687927
489.5G74693131j0804355j1887133j6100108k8518618m9322187p3526025p1826697
503.8E12708008l1496107p720411j4887422J6991913Q7732643J14201784P8862309
518.1G56392717L6458135J7047644R250164K869248j182258n13971J324594J17302
$$ plain form
399.8 797230244 810392797 820383847 824180722 820870578 815727055 815979600 820807040 823484540
416.1 823484540 821917593 821493447 824066639 825287282 823789239 822257638 822853625 823725343 822001874
434.4 822001874 818976939 818306684 819678187 819714427 817251503 815241337 815888047 817045569 815552592
452.8 815552592 812324822 811099410 812662303 812904775 810206711 807873905 808041990 808398485 805702329
471.2 805702329 801621377 800166786 800281227 798182845 793202400 788517177 785891175 782381058 774693131
489.5 774693131 763888776 752001643 735901535 707382917 658060730 584534705 512708008
503.8 512708008 481211901 473491490 458604068 475595981 563328624 677530408 756392717
518.1 756392717 792850852 809898496 819148660 822017908 820835650 820321679 821646273 821763575
534.4H21763575k437353j633167J703441K416909o98925k899229r73463J318157L8921
552.7H18598866k742528k576650K34187J321852j000523k973616j420796R71973L67045
571.1H10779810k238333k635062j91510J059771r75073l093302k211213m04000j501620
589.4G98589468n065203o869375n950809p401168j6944289l4202397m5392633k4837077
605.8F51926517K2209228M7248721L2865166Q053542j1865020k3632229r045064K4211705
622.1G41972566L6911249K2709429O462276o12736p00831Q40127o92665m337192o426096
640.4G96126127o839633n248546L5286N082488N761742L926099R86158k316296k776980
658.8G94736445l21329R27568n42343k826512k863288j7583j0252k445817l434539
$$ plain form
534.4 821763575 819326222 817693055 819396496 821813405 821114480 818215251 817241788 818559945 818598866
552.7 818598866 815856338 813279688 813513875 814835727 813835204 810861588 809440792 810412765 810779810
571.1 810779810 808541477 805906415 805714905 806774676 805799603 802706301 800495088 800091088 798589468
589.4 798589468 793524265 786654890 780704081 773302913 756358624 722156227 676763594 651926517
605.8 651926517 674135745 721384466 754249632 762303174 750438154 726805925 717760861 741972566
622.1 741972566 778883815 801593244 808055520 807442784 806741953 807582080 806889415 802552223 796126127
640.4 796126127 789286494 784037948 784073234 789155722 794917464 798843563 799829721 797513425 794736445
658.8 794736445 794415116 795342684 794800341 791973829 789110541 789092958 789082706 786636889 783202350
677.2G83202350j469552P4863j445353l694296l247678j177192j270532l801883n172372
695.5G61998355l749966k596617m858077q015990o114304n48959N95212l331899o190420
713.9G27187335n587041m306912n359114p802546q482754p289707o942690q935332
730.2F72481239j1392474j2036860j2006641j3977885j7663956k0014524j9650757
744.5E65738142j7919660j6106308j3318419q097589q70943O119907J1355757J5427590
760.8E42328477J9106507K0892203J6426146M637063J548767K1995842M1575790L4741401
777.1G03252196J7568410R062052P213592N241752J422882j303017r60946J25050j192212
795.4G40429759m279911o481469q188665j2722194k0735026k9912591m0709734n6313037
$$ plain form
677.2 783202350 781732798 781807661 780362308 776668012 773420334 772243142 770972610 767170727 761998355
695.5 761998355 758248389 755651772 750793695 742777705 736663401 736114442 736709654 733377755 727187335
713.9 727187335 721600294 717293382 711934268 704131722 695648968 688359261 681416571 672481239
730.2 672481239 661088765 649051905 637045264 623067379 605403423 585388899 565738142
744.5 565738142 547818482 531712174 518393755 510296166 509425223 515545130 526900887 542328477
760.8 542328477 561434984 582327187 598753333 603390396 604939163 626935005 668510795 703252196
777.1 703252196 720820606 729882658 737096250 742338002 743760884 742457867 741496921 741621971 740429759
795.4 740429759 736149848 729668379 721479714 708757520 688022494 658109903 617400169 561087132
811.8E61087132p4715883q4594876p1608632l5057903Q013040M3722063O5907181P0576787
828.1D83328909O5381378N8979749M7045887K9363453J7930150J6830981J5117228
842.4G33977735P149160j067638n370558n725980j447677O491303J2915075J3694167
858.7G60615587R580076M110336J125276J805485L175079K129674n7756o5089J963854
877G84382522K539873M83811j198172j46509J577318R25243j294613j686990K68996
895.4G85851479J330077k27928j951218j114249R13739R63688r88245j814425k59161
913.7G82703757J046658k68877k494514k489566p10369l35097k427340m611969o129384
932.1G64283299j1225044j9780398j5301048P797181K2426903J4775038J828492m999221
$$ plain form
811.8 561087132 486371249 401776373 330167741 295109838 303122878 346844941 412752122 483328909
828.1 483328909 548710287 607690036 654735923 684099376 702029526 718860507 733977735
842.4 733977735 741126895 740059257 734688699 728962719 727515042 734006345 746921420 760615587
858.7 760615587 770195663 774305999 775431275 777236760 780411839 782541513 782483757 782418668 784382522
877 784382522 786922395 787406206 786208034 786061525 787638843 788564086 787269473 785582483 785851479
895.4 785851479 787181556 786953628 785002410 783888161 784801900 785765588 784777343 782962918 782703757
913.7 782703757 783750415 783481538 780987024 778497458 777787089 777451992 775024652 770412683 764283299
932.1 764283299 753058255 733277857 717976809 725773990 748200893 762975931 764804423 759805202
948.4G59805202p138013p807732q816898j0719776j3028681j0911405m672647P52449
964.7F97462499R697318J8423617J6185999P561326L94404l457248m333198m925013
981.1G37009704q061111j3548195j8165887j6448259m264951J0922492J5938520J0255993
997.4G13638306K441346m233122j0131836j4741599j8999517k4830163k7841270j6066312
1013.7E99235833J1967301L1359553K0226241M989683J3022483K0523428J1247218
1028G12571740j598060j3040423k4586857l4145295l5003424j8081248J2651801L6438287
1044.3F35206521M0093660L0237615J8266678R907722O072224M742920L190398J116157
1060.6G48833895K18630R30786J438856L98218j012146r44555K22027M09127p46072
$$ plain form
948.4 759805202 752667189 744859457 736042559 725322783 712294102 701382697 696710050 697462499
964.7 697462499 707159817 725583434 741769433 749330759 749725163 746267915 741934717 737009704
981.1 737009704 728948593 715400398 697234511 680786252 676521301 687443793 703382313 713638306
997.4 713638306 716079652 711846530 701714694 686973095 667973578 643143415 615302145 599235833
1013.7 599235833 611203134 642562687 662788928 667778611 680801094 701324522 712571740
1028 712571740 710973680 697933257 673346400 639201105 604197681 586116433 598768234 635206521
1044.3 635206521 675300181 705537796 723804474 733712196 739784420 744527340 747717738 748833895
1060.6 748833895 749052525 749983311 751422167 751820385 750808239 749863684 750085711 750494838 749748766
1079G49748766j447558o10352L73483j65939j525164j763403q18014n89133j950085
1097.3G41252601l441274l444672k874732m133820q294404j4469027j8383563j1484384
1113.6F74726725L773570R903788L296316k479673J5378Q040548J3470113J1424303
1129.9G22171068O189108K142429m54962j301586n88596n2572q65519j905381j571060
1148.3G23762929l61144j81496j353085k163053j605987q60811j418471k583206k620160
1166.7G10615516j565039j365841l121138o182372j0806799j5769482j0467052P426321
1183F68764114J7386675J1730135M240572K49922k152502k719045k184510k481639
1199.3F92833722m154623o129205q075118r960950p785976k62439M567146L722370
$$ plain form
1079 749748766 748301208 747690856 748064339 747898400 746373236 744609833 743791819 743202686 741252601
1097.3 741252601 737811327 734366655 731491923 727358103 719063699 704594672 686211109 674726725
1113.6 674726725 678500295 688404083 691700399 689220726 689236104 697276652 710746765 722171068
1129.9 722171068 728360176 730502605 730047643 728746057 728157461 728104889 727239370 725333989 723762929
1148.3 723762929 723401785 723220289 721867204 719704151 718098164 717237353 715818882 713235676 710615516
1166.7 710615516 709050477 707684636 704563498 698381126 687574327 671804845 661337793 668764114
1183 668764114 686150789 697880924 702121496 702371418 700218916 697499871 695315361 692833722
1199.3 692833722 688679099 682549894 674474776 664513826 656727850 656465411 661032557 664754927
1215.6F64754927K114892L88026k419769m971505o679713o922484m120767J08063J329184
1234F43580854j159668m567802o788135p081270o080091n417943o041944p671296j0258735
1252.3E88513970j4749348k2052765l1216979l8287967l3871621m507482M4726282
1266.6D88554090P5771779O3635409L0803621O746351m438698r030521j0355174j0432005
1282.9F31254852j0994315j2262583j3203085j2912988j1717677j1409223j3633252
1297.2E45121729j7168045j7849207j0478437J0163l250182k2161185m0120185m9373358
1313.5C84731293n1209688m3488235k5163948J99318L5129130P6434701R9504262Q9971513
1329.8E66108346O0713410L0770958R991169j753867q750260j3398707j5966653j6329945
$$ plain form
1215.6 664754927 666869819 667257845 664838076 659866571 653186858 646264374 642143607 642251670 643580854
1234 643580854 642421186 637853384 631065249 623983979 617903888 612485945 606444001 598772705 588513970
1252.3 588513970 573764622 551711857 520494878 482206911 448335290 443827808 488554090
1266.6 488554090 564325869 627961278 658764899 665511250 661072552 652042031 641686857 631254852
1282.9 631254852 620260537 607997954 594794869 581881881 570164204 558754981 545121729
1297.2 545121729 527953684 510104477 499626040 499636203 496386021 474224836 434104651 384731293
1313.5 384731293 333521605 290033370 264869422 265068740 300197870 376632571 476136833 566108346
1329.8 566108346 626821756 657592714 667583883 665830016 657079756 643681049 627714396 611384451
1346.2F11384451j5247643j5518725j7603099j9653201k1795034k7487696l9294511
1360.4D54784542m8986941l1726331J4294595N6479364O3700170L6569833m932820
1374.7E40182412l4826517j9780368K5269777M3551087K3914158J30773j3730228k1153689
1391E43557405k9437184l9672106m7605127n4931939m0102869J7175853Q7206095J04626656
1407.3E40816784O6838682K5694012J147688r379387j4851868j9085348j8719077j9102812
1423.7E53358674k1061480k0740807j9597560j6159415j3374418j7747641k3142248
1437.9D21535105j8159718r728640k797872j390755p125974j4419436j6580135r689718
1454.3C41642857J3521522M6840936M8362821L6091745K6033849J2750923J440883
$$ plain form
1346.2 611384451 596136808 580618083 563014984 543361783 521566749 494079053 454784542
1360.4 454784542 405797601 374071270 388365865 444845229 508545399 545115232 540182412
1374.7 540182412 505355895 485575527 510845304 554396391 578310549 578441322 564711094 543557405
1391 543557405 514120221 474448115 426842988 371911049 331808180 348984033 436190128 540816784
1407.3 540816784 607655466 633349478 634497166 625117779 610265911 591180563 572461486 553358674
1423.7 553358674 532297194 511556387 491958827 475799412 462424994 444677353 421535105
1437.9 421535105 403375387 393646747 390848875 389458120 382332146 367912710 351332575 341642857
1454.3 341642857 355164379 402005315 450368136 486459881 512493730 525244653 526685536
1468.5E26685536m594922q633971r144724p354826o818205p574498q866817r811491
1484.9D63886082j0996669j2055755j1514634r822726j1051655j5405625j8289834
1499.1C74749184j9338876k0383835k7209163l7308186k1944046Q86991J9100950L6369651
1515.4C04922670M3659985L1891793J4672935M52578q404731j1922569j0804832r212553
1531.8C55255276p636011l952950j731872k989054o615997j2104481j8171489k0205289
1548.1B81848133j4659197K668441K4122298L6948472N4162413O2697887L6207080
1562.4D83995527K8398365L0363738L0603230K8228343J6801655M972458n361199j3525129
1578.7F04476988j9358039k5901973l0546069l3338726l5288482l5972804l5529644
$$ plain form
1468.5 526685536 522090614 513456643 504311919 496957093 490138888 482564390 473697573 463886082
1484.9 463886082 452889413 440833658 429319024 419496298 408444643 393039018 374749184
1499.1 374749184 355410308 335026473 307817310 270509124 248565078 249452069 268553019 304922670
1515.4 304922670 348582655 380474448 395147383 395599961 387195230 375272661 364467829 355255276
1531.8 355255276 347619265 343666315 341934443 338945389 332329392 320224911 302053422 281848133
1548.1 281848133 267188936 269857377 293979675 330928147 385090560 447788447 483995527
1562.4 483995527 512393892 542757630 573360860 601589203 618390858 623363316 618002117 604476988
1578.7 604476988 585118949 559216976 528670907 495332181 460043699 424070895 388541251
1593C88541251l4922689l2781452k7141958j7763198o603390J894355N069763N915701
1609.3B82208383J0560662K0436138L5809606M7147691L3120692J5421599O392211
1623.5D51096982K738416K976745J758427k914518r496004j7845005j8817126j5230209
1639.9C94267708j4098823j2162924j0262221q140623p206709j7940372l9232969l5231248
1656.2B49991819k7732193k1106333o281331R313390J8221512L1106353M7484815M6714217
1672.5C47712249M3712854M1234463L0736149K3840725K5388658L3263207K7912616
1686.8E73800921J9850195J8443465J5519321J4536083J4728188J3790965J5018821
1701.1F85687959J1822045Q722544Q633733P380068N747855M522442M348994O382465
$$ plain form
1593 388541251 353618562 320837110 293695152 275931954 269328564 271222919 276292682 282208383
1609.3 282208383 292769045 313205183 349014789 396162480 429283172 444704771 451096982
1623.5 451096982 453835398 456812143 458570570 455656052 446160048 428315043 409497917 394267708
1639.9 394267708 380168885 368005961 357743740 349603117 342396408 324456036 285223067 249991819
1656.2 249991819 222259626 201153293 194871962 204185352 222406864 253513217 300998032 347712249
1672.5 347712249 391425103 432659566 463395715 487236440 512625098 545888305 573800921
1686.8 573800921 593651116 612094581 627613902 642149985 656878173 670669138 685687959
1701.1 685687959 697510004 706232548 714866281 722246349 727994204 732516646 736865640 743248105
1717.4G43248105P362723N052209K575159J300455O95526M73261J96576J286984M053413
1735.7G66244411N038620N292236M722298L462433K779603K465129K042771J634657
1752G93682158R07719K61188j32263n92053l46720Q11577J422941J237333Q30770J269340
1772.4G99351990K413810J977622M09246q65877j075685q92461j243233k307594l098667
1790.8G94669151j181245K031744K794385K017438J838565K299309K027094R51767
1807.1H07448208J05024K38359N10752k00391j407146j751304j135528k60234L94165
1825.5H03941905M46737N51403J206159R77815j23859n41091j75237r8110l79920k09629
1845.9H05596173R8347J84596r0837q18491j281739j013159n04852o21259j364529
$$ plain form
1717.4 743248105 750610828 755663037 758238196 759538651 760234177 760707438 760904014 762190998 766244411
1735.7 766244411 771283031 776575267 781297565 784759998 787539601 790004730 792047501 793682158
1752 793682158 794589877 794851065 794718802 794126749 793780029 794591606 796014547 797251880 798082650 799351990
1772.4 799351990 801765800 803743422 804152668 803286791 802211106 801318645 800075412 797767818 794669151
1790.8 794669151 793487906 795519650 798314035 800331473 802170038 804469347 806496441 807448208
1807.1 807448208 807553232 807791591 808302343 808101952 806694806 804943502 803807974 803547740 803941905
1825.5 803941905 804388642 804940045 806146204 807124019 807000160 806459069 806283832 806185722 805805802 805596173
1845.9 805596173 805694520 805879116 805788279 804969788 803688049 802674890 802170038 801548779 800184250
1864.2H00184250j957238j426697K6644N47290P9512j15812J10567J22547l17275q93116
1884.6G96360672j279176j957774l646672o723046j0665715j3370871j1777103l511667
1900.9G43428648Q120179J4195442J2142718P378518L945411K231657J343727O94096
1917.3G93480396n0783j095593j472890m16398O76512O08981m0054l60370l42727n36084
1937.7G90450990r39309q08001K10762R53376N92173j67907m79579l12030l26395q67784
1958.1G88306296j399100j394689j146317r81688p05361l00825L4094J24633j80542
1976.4G82356501m37200p6294N30481N64694N4300k87950j42872J42336p6056p91251
1996.8G81836689j122237o28531L9339J90914p7069j75118L8564P9870k88367n87225
$$ plain form
1864.2 800184250 798227012 796800315 796826959 797374249 797453761 797337949 797448516 797571063 797253788 796360672
1884.6 796360672 795081496 793123722 789477050 782754004 772088289 758717418 746940315 743428648
1900.9 743428648 751548827 765744269 777886987 785265505 789210916 791442573 792786300 793480396
1917.3 793480396 793429613 792334020 790861130 790444732 791121244 791730225 791690171 791329801 790987074 790450990
1937.7 790450990 789511681 788703680 788914442 789867818 790459991 790292084 789812505 789500475 789174080 788306296
1958.1 788306296 786907196 785512507 784366190 783384502 782679141 782378316 782412410 782537043 782356501
1976.4 782356501 781919301 781843007 782373488 782938182 782992482 782704532 782561660 782703996 782627940 781836689
1996.8 781836689 780714452 780085921 780125260 780316174 780239105 780063987 780102551 780182421 779894054 779306829
2017.2G79306829m76062m06802p90000j143277p57634r2328P1466j77622l00705J0907
2037.6G75244772M14432L75449q3625l80755k18570N841j71959n62549o42538l53038
2058G73627460k06769m82201p76112o78539l88205m28141p66992q78930n57125k63750
2078.4G68200696m68433q85308q29280k41339K39313L18467K99991M25219M80592J88947
2098.8G67728865l14474n54442l69013j60455l11912o65605p28070m61758k81870l66866
2119.2G63514400m29273k39194N186p4983m78863p51376o80566n19216n60046o96838
2139.6G59089231n94079l05116k62618n42045p10845m62413o1750N841k68519m50253
2160G55437434l59655l56912p02441j060784q33630n2274N65887N85675L13580K33054
$$ plain form
2017.2 779306829 778830767 778423965 777633965 776490688 775733054 775640726 775712192 775534570 775233865 775244772
2037.6 775244772 775659204 776034653 775951028 775570273 775351703 775357544 775185585 774623036 773980498 773627460
2058 773627460 773420691 772938490 772162378 771483839 771095634 770667493 769900501 769021571 768464446 768200696
2078.4 768200696 767732263 766846955 766017675 765776336 766015649 766334116 766634107 767059326 767539918 767728865
2098.8 767728865 767414391 766859949 766490936 766330481 766018569 765352964 764624894 764163136 763881266 763514400
2119.2 763514400 763085127 762845933 762851119 762776136 762297273 761545897 760865331 760346115 759786069 759089231
2139.6 759089231 758495152 758190036 757927418 757385373 756674528 756212115 756150365 756156206 755887687 755437434
2160 755437434 755077779 754720867 754018426 752957642 752124012 752071738 752637625 753223300 753536880 753769934
2180.4G53769934K45929l7074m93288n73814j67906J65581k5153m25219m37856r7573
2200.8G51923561M2677k31743m87864l72708k14576m81666r44674r72986m99546j17600
2221.2G47642875j93775l39687j11103K24829J01864m35293p43806n21123k65181m89355
2241.6G44870245q63909p38144j71840J51217l6598k39432o6041J95682M9173m33921
2262G42716432o71745m86970m08947q04842j247406j149058o01769k16722j99378j17599
2282.3G36811996K73644N45562K10941n04911q71838o25014l45707n93900j096666
2300.7G33804107j172602o43671J01984N90026O93142O07610L15189k86877q85009
2319.1G33123899r76027n70356j62900K3306J75774M07338M38511J6689m82976m62294
$$ plain form
2180.4 753769934 754015863 753978789 753485501 752911687 752743781 752909362 752884209 752458990 752021134 751923561
2200.8 751923561 751966238 751734495 751246631 750873923 750659347 750177681 749233007 748260021 747760475 747642875
2221.2 747642875 747449100 747109413 746998310 747223139 747325003 746889710 746145904 745624781 745359600 744870245
2241.6 744870245 744006336 743268192 743096352 743247569 743210971 742971539 742905498 743101180 743150353 742716432
2262 742716432 742044687 741557717 741148770 740343928 739096522 737947464 737345695 737128973 736929595 736811996
2282.3 736811996 737085640 737631202 737842143 737337232 736465394 735840380 735494673 734900773 733804107
2300.7 733804107 732631505 731987834 732089818 732679844 733372986 733980596 734295785 734008908 733123899
2319.1 733123899 732147872 731577516 731414616 731437922 731613696 732021034 732459545 732476234 731993258 731530964
2339.5G31530964L1174L22640j4067l78966k71976k9684j17063o08325r36926p47442
2359.9G28780329m27127m63426n87344l02136J74284J99318k54750o17683n17666k25246
2380.2G25758553k50459n50807o77883m83752l04103m49538o74605n02288J5556L53516
2400.6G22234190K39431l695j8716J3888j73092m01795l46184n1856J05501r5785l46780
2423.1G21155107k63751k9087o7889m04060o18220m86910l35336m90427p18712o54340
2443.5G17086375l97861l10362n04195o54817m85420k22206k26498m25398l98219k1815
2463.9G13439584K91705K00570r7156k44975k17855k39074l84748m66883l69788k82526
2484.3G11628854m11570o61135p70628p04884o79017p39634n90801l4630N39839O00219
$$ plain form
2339.5 731530964 731562138 731884778 731870711 731491745 731219769 731190085 731073022 730464697 729527771 728780329
2359.9 728780329 728353202 727889776 727302432 727000296 727174580 727373898 727119148 726501465 725983799 725758553
2380.2 725758553 725508094 724957287 724279404 723795652 723491549 723042011 722367406 721865118 721880674 722234190
2400.6 722234190 722473621 722469926 722451210 722465098 722292006 721890211 721544027 721492171 721597672 721501887 721155107
2423.1 721155107 720891356 720862269 720794380 720390320 719772100 719285190 718949854 718459427 717740715 717086375
2443.5 717086375 716688514 716378152 715873957 715219140 714733720 714511514 714285016 713859618 713461399 713439584
2463.9 713439584 713731289 713931859 713834703 713589728 713371873 713132799 712748051 712281168 711911380 711628854
2484.3 711628854 711217284 710556149 709785521 709080637 708401620 707661986 707071185 707036555 707576394 708176613
2504.7G08176613K06709j95801l66986m33147n78523p83145r40860j062214j234233
2523G02788413j347363j113296m29034L68655P87913O99401L64065L9399k92301p36356
2543.4G01129496j133442j098871n42760J03891M14312M05967L16680K30431M5657
2561.8F99871361k34484l89576k60890L4213J54793q5413n04136q57890j001596p48515
2582.2F95977867j15455M55976O35564M66109J04010j98901k70367k77876m32551o56784
2602.6F95687592p22766n89013n25236p63297j154125j428783j590788j726449j645028
2620.9F85542107r71556K02835J161456J441717J284659J119494J038134P99597L49581
2639.3F91968024J311q0347j00791l07680o64293r06170r35435r73761j199663j475990
$$ plain form
2504.7 708176613 708383322 708187521 707820535 707387388 706808865 706025720 705084860 704022646 702788413
2523 702788413 701441050 700327754 699898720 700267375 701055288 701754689 702118754 702158153 701865852 701129496
2543.4 701129496 699996054 698897183 698354423 698458314 698872626 699278593 699595273 699825704 699871361
2561.8 699871361 699636877 699247301 698986411 699020624 699175417 699090004 698585868 697727978 696726382 695977867
2582.2 695977867 695862412 696318388 696953952 697420061 697524071 697325170 697054803 696776927 696344376 695687592
2602.6 695687592 694964826 694375813 693850577 693087280 691933155 690504372 688913584 687187135 685542107
2620.9 685542107 684570551 684773386 685934842 687376559 688661218 689780712 690818846 691618443 691968024
2639.3 691968024 691969335 691888988 691788197 691480517 690816224 689910054 688974619 688000858 686801195 685325205
2659.7F85325205j535415j219333n85377R8288N39482O35683M15326l58l64721m93407
2680.1F82815373m08888l11077l48746l89517k39849n1021j28150m15147o21736o76274
2700.5F79224968p15971q45015j027584j140356j176656j224398j288057j242041r17733
2718.8F69647157m31597k45750o75619j622319k540886k096892M91321L108263L219009
2737.2F68852687J571417P8857p42078j032710r71139q26478p76946p91073q28147
2755.5F64534390r38296j155973j449644j686871j685799j469552j293898j296937
2771.8F53557420j347184j338065j394391j649737k060533k464533k783537l140330
2788.2F37379110l582180l843605l602028k763689j442134J44780J747250L021836
$$ plain form
2659.7 685325205 683789790 682570457 681985080 682083368 682622850 683258533 683673859 683673501 683308780 682815373
2680.1 682815373 682406485 682095408 681746662 681357145 681117296 681066275 680938125 680522978 679901242 679224968
2700.5 679224968 678508997 677663982 676636398 675496042 674319386 673094988 671806931 670564890 669647157
2718.8 669647157 669215560 668969810 668294191 666671872 664130986 662034094 662525415 665633678 668852687
2737.2 668852687 670424104 670502961 669760883 668728173 667757034 666930556 666153610 665362537 664534390
2755.5 664534390 663596094 662440121 660990477 659303606 657617807 656148255 654854357 653557420
2771.8 653557420 652210236 650872171 649477780 647828043 645767510 643302977 640519440 637379110
2788.2 637379110 633796930 629953325 626351297 623587608 622145474 622290254 624037504 627059340
2804.5F27059340L585637L358245K668321J914144J203954M25815l74257r83834j324833
2822.8F37532532j582265j991689k480447k775848k870441k953708l082454l223300
2839.1F16572380l268659l221333l300607l453791l282667k669632k052069j869261
2855.5E93454361k104521k537548k945185k806068j113474K621353O821692Q740365
2871.8F00130975P483065M596413J772582l85463j905084k951801l508031l431976
2888.1F01800680k814829j953364j125872m75228p6532k0921l09825q38757j648187
2906.5E92537165l030956n175471p867456j0251522j0317683n787015K462804R105027
2922.8E61674893R877682O462633L023088J083791n96344l700018r057879j6014755
$$ plain form
2804.5 627059340 630644977 634003222 636671543 638585687 639789641 640215456 639841199 638857365 637532532
2822.8 637532532 635950267 633958578 631478131 628702283 625831842 622878134 619795680 616572380
2839.1 616572380 613303721 610082388 606781781 603327990 600045323 597375691 595323622 593454361
2855.5 593454361 591349840 588812292 585867107 583061039 581947565 584568918 591390610 600130975
2871.8 600130975 607614040 612210453 613983035 613597572 611692488 608740687 605232656 601800680
2888.1 601800680 598985851 597032487 595906615 595431387 595354855 595333934 595024109 594185352 592537165
2906.5 592537165 589506209 584330738 576463282 566211760 555894077 550107062 552569866 561674893
2922.8 561674893 571552575 578015208 581038296 582122087 581525743 577825725 568767846 552753091
2939.1E52753091k0269036j4471710J847029J6831040K0036697J4008046O358623L98636
2955.4E77492416m237712q394360j1563540j1491835o355703K115131R308934J2074649
2971.7E58947980J0807395P616878M351675K043426Q58665L49462r5904q12769j701951
2990.1E82364857k505302k975941k859533j893580j132K181411L443956L064871J497745
3008.4E82317352r5427q45313p60376o62446j249552k385795l707230n091965o413460
3026.8E61105788p346452p273197n675912l154158j547098j991272l218234l182888
3043.1E27716577j721919m49836n63800j707316l012955m006266m465878m376948l893972
3061.5E03517687l100097j913279k33203J783013L779471N408049O375491O624699
$$ plain form
2939.1 552753091 532484055 518012345 519859374 536690414 556727111 570735157 577093780 577492416
2955.4 577492416 573254704 564860344 553296804 541804969 535449266 537564397 546873331 558947980
2971.7 558947980 569755375 577372253 581723928 583767354 584626019 584975481 584879577 584066808 582364857
2990.1 582364857 579859555 576883614 574024081 572130501 572129369 574310780 577754736 580819607 582317352
3008.4 582317352 582221925 581376612 580616236 579953790 578704238 576318443 572611213 567519248 561105788
3026.8 561105788 553759336 546486139 540810227 537656069 536108971 534117699 530899465 527716577
3043.1 527716577 525994658 525544822 524981022 523273706 520260751 516254485 511788607 507411659 503517687
3061.5 503517687 500417590 498504311 498271108 500054121 503833592 509241641 515617132 522241831
3077.8E22241831O320000N590260M565000L462434K339899J080335m29750k199292
3094.1E42970717m111171o023586p512807p661403o038904l925681l309131m665315
3110.4D99722719o719023q128375q439242p666886n805493k839058R86755M880785
3126.7D65992182P840872R379924R612351Q864403P552743N989909M374087K964795
3143E22571266J870572R57847J39594o07312j408398k178371k706230l093361l487111
3161.4E12058496l898620m357278m900218n493670o053746o534815o892830p066309
3177.7D66861010o915689o303996n181491l524691j354367J194388L760457N825192
3194D54360813P035524P242471O427973M960954L305912J705617L54886p02798j557529
$$ plain form
3077.8 522241831 528561831 534152091 538717091 542179525 544519424 545599759 545170009 542970717
3094.1 542970717 538859546 532835960 525323153 517661750 511622846 507697165 504388034 499722719
3110.4 499722719 493003696 484875321 476436079 468769193 462963700 460124642 461111397 465992182
3126.7 465992182 473833054 483212978 492825329 501689732 509242475 515232384 519606471 522571266
3143 522571266 524441838 525399685 525539279 524931967 523523569 521345198 518638968 515545607 512058496
3161.4 512058496 508159876 503802598 498902380 493408710 487354964 480820149 473927319 466861010
3177.7 466861010 459945321 453641325 448459834 444935143 443580776 444775164 448535621 454360813
3194 454360813 461396337 468638808 475066781 480027735 483333647 485039264 485394150 484691352 483133823
3212.4D83133823k191872k619028k922237l148228l466010m002303m663050n395442
3228.7D54725653o218314p024825p748842q368999q766144q903951q852035q613467
3245C90229076q097142p293373o109923m397929k263039L963J964629K993584K653330
3263.4C69683176J106322j012534k977669m333764m968197n124449n277127n653739
3279.7C41442019o120324o389022o132067n162596l486425j262844J221926L701210
3296C17811877O002128Q039176R778261J1125118J2048632J2676298J2989253J2930185
3312.3D03400928J2491733J1631250J0452151R254933Q503020Q563369R319127J0087221
3328.6D83703732J0254831R863644R262503Q610785P910490P141590O357550N688608
$$ plain form
3212.4 483133823 480941951 478322923 475400686 472252458 468786448 464784145 460121095 454725653
3228.7 454725653 448507339 441482514 433733672 425364673 416598529 407694578 398842543 390229076
3245 390229076 382131934 374838561 368728638 364330709 362067670 362071633 364036262 367029846 369683176
3263.4 369683176 370789498 369776964 366799295 362465531 357497334 352372885 347095758 341442019
3279.7 341442019 335321695 328932673 322800606 317638010 314151585 312888741 314110667 317811877
3296 317811877 323814005 331853181 341631442 352756560 364805192 377481490 390470743 403400928
3312.3 403400928 415892661 427523911 437976062 447230995 455734015 464297384 473616511 483703732
3328.6 483703732 493958563 503822207 513084710 521695495 529605985 536747575 543105125 548793733
3345E48793733N102456M464030L807724L262937K853512K476395K008378J520455J237929
3363.3E75527549J156807J006722O37531K58148J25945J49548J41740P8916k3603j02699
3383.7E78956604r4712l3974J490q1837k66016l48389k08676r9003l34323o00755n06580
3406.1E76383829l54111l84450m88639o06179o27399m86016l64304l53038l16679k46346
3426.5E72156668k20478k23815j27733k0504j47700l48091l14594j12414L6835J26303
3446.9E70804477K05457K36452K25961K76088M39704N56409M83990M34518O04689P04885
3467.3E74972630M36842R2983J03772L88682O19292N53966K95341K61843M21405M51684
3487.7E78598440M60565N29527N23270N07474N05328M44650L68238L57330M65035O23822
$$ plain form
3345 548793733 553896189 558360219 562167943 565430880 568284392 570760787 572769165 574289620 575527549
3363.3 575527549 576684356 577691078 578328609 578586757 578712702 578862250 579003990 579082906 579059303 578956604
3383.7 578956604 578861892 578827918 578829408 578747571 578481555 578133166 577924490 577825487 577491164 576890409 576383829
3406.1 576383829 576029718 575645268 575156629 574550450 573923051 573437035 573072731 572719693 572403014 572156668
3426.5 572156668 571936190 571712375 571584642 571564138 571416438 571068347 570753753 570641339 570678174 570804477
3446.9 570804477 571009934 571246386 571472347 571748435 572188139 572744548 573228538 573663056 574267745 574972630
3467.3 574972630 575409472 575502455 575606227 575994909 576614201 577168167 577463508 577725351 578146756 578598440
3487.7 578598440 579059005 579588532 580111802 580619276 581124604 581569254 581937492 582294822 582759857 583383679
3508.1E83383679P86424R22382Q53181O94632O84619P22468P12633O02961N07295O28352
3528.5E90498626Q13961Q85308R35614Q92639P23243O98924P46727O74963O12199O57976
3548.9E98140180P17640Q37505R63271Q76069P22468N95092K77877M5598O55532J579165
3569.3F05410397J559258J131355R68039R61304J059651J187027J029253O20663O94811
3587.7F14621758J375139J441717J033068R95755J169741J178742J177430R74536M96626
3606F24464512M56750Q35896R07004Q59081P06613P14481J407385J611829Q03530j37686
3626.4F32629395j06454J144051J450539R49144O71387N71370M37260J29044m60685
3644.8F37415051j005053m29750R85384J053513M59373N86330Q91090N07653j610l62158
$$ plain form
3508.1 583383679 584170103 585092485 585945666 586640298 587324917 588047385 588760018 589362979 589870274 590498626
3528.5 590498626 591312587 592197895 593133509 594026148 594749391 595448315 596195042 596870005 597482204 598140180
3548.9 598140180 598857820 599695325 600658596 601534665 602257133 602852225 603130102 603175700 603831232 605410397
3569.3 605410397 606969655 608101010 609069049 610030353 611090004 612277031 613306284 613926947 614621758
3587.7 614621758 615996897 617438614 618471682 619467437 620637178 621815920 622993350 623967886 624464512
3606 624464512 624921262 625757158 626664162 627523243 628229856 628944337 630351722 631963551 632767081 632629395
3626.4 632629395 632522941 633666992 635117531 636066675 636738062 637309432 637746692 637875736 637415051
3644.8 637415051 636409998 635980248 636965632 638019145 638478518 639064848 639955938 640463591 640461981 640099823
3665.2F40099823q83638j174689p04705o57499p30753L61979Q90136O12914L62098
3683.5F38175666N2095k51472m0829O83605R92477P12395J93834k38120j82808J98841
3703.9F40295684J5021o56903r50873j78218P72715O71327M1604l97265l95656j56879
3724.3F39060557J00732Q6069m83811j088917q13842K39611O52134n5730j078964j193881
3744.7F35423958m13239m92394l67045P46190Q56340J49072j10090K10643J63078k77102
3765.1F35889411m20213k02715J84536K57194j23561l96728k34783J7286q3387j78933
3785.5F34708107L635Q8513j38163n32270p45237o35385o62923m74930P3314j7226
3805.9F31667435o0797J56463j96815q46267r62913n48124l74854J59562N01692O5029
$$ plain form
3665.2 640099823 639216185 638041496 637336791 636679292 635948539 636310518 637200654 637813568 638175666
3683.5 638175666 638227761 637976289 637935460 638619065 639611542 640323937 640517771 640279651 640096843 640295684
3703.9 640295684 640310705 639653802 638702929 638524711 639297426 639968753 640010357 639613092 639217436 639060557
3724.3 639060557 639161289 639247358 638763547 637674630 636860788 637100399 637752533 637696803 636617839 635423958
3744.7 635423958 635010719 634518325 634151280 634897470 635753810 635902882 635792792 636003435 636166513 635889411
3765.1 635889411 635469198 635266483 635451019 635708213 635584652 635187924 634953141 634970427 634887040 634708107
3785.5 634708107 634711742 634800255 634662092 634129822 633384585 632749200 632086277 631611347 631684661 631667435
3805.9 631667435 631606638 631763101 631566286 630720019 629757106 629208982 628834128 628993690 629495382 629560411
3826.3F29560411k14279l03745l93927m74095p21813o24776Q1361N29229M96447J27793
3846.7F28062606n42820j385629j566350J55985J159847N14030k87115o21498l35872
3865F25153184k52605o09159m11212J21772L02195J3590n48720m42326j0073L3080
3885.4F23349726O8963j34468k74182M6850l6657o71029r95636n94437J74343P95007
3905.8F21728480P45833K57611j07348l67105n80251m80175k15292k02954l01540k17676
3926.2F20259583k03550k70784l6657K20299R3877j68502l28183k78771p9215q4281
3946.6F19123816j76191o8068J0788o1870q6426m4406l8147n1498q2493j17004j00255
3969.1F18308246j00255j42276j31309j16945j53005j38163q4996j06454j62423k12729
$$ plain form
3826.3 629560411 629346132 629042387 628648460 628174365 627452552 626827776 626909137 627438366 627934813 628062606
3846.7 628062606 627519786 626134157 624567807 624723792 625883639 626397669 626110554 625489056 625153184
3865 625153184 624900579 624291420 623880208 624001980 624304175 624317765 623769045 623326719 623316646 623349726
3885.4 623349726 623418689 623284221 623010039 623056889 623020232 622349203 621353567 620759130 620933473 621728480
3905.8 621728480 622474313 622731924 622624576 622257471 621677220 621197045 620981753 620778799 620477259 620259583
3926.2 620259583 620056033 619785249 619748592 619968891 620062768 619894266 619566083 619287312 619208097 619123816
3946.6 619123816 618947625 618879557 618890345 618828475 618742049 618697643 618659496 618607998 618525505 618408501 618308246
3969.1 618308246 618207991 618065715 617934406 617817461 617664456 617526293 617441297 617334843 617172420 616959691
3989.5F16959691k79486l03030k57433j89125
3997.6F15930617
$$ plain form
3989.5 616959691 616680205 616377175 616119742 615930617
3997.6 615930617
##END=$$ End of the data block
