##TITLE=Manidu 02 $$ Begin of the data block
##JCAMP-DX=5.00 $$ ACD/SpecManager v 10.08
##SPECTROMETER/DATA SYSTEM=Alpha
##DATE=09 Sep 2014 08:39:12
##DATA TYPE=INFRARED SPECTRUM
##DATA CLASS=XYDATA
##ORIGIN=
##OWNER=
##NPOINTS=1765
##FIRSTX=399.76428223
##LASTX=3997.64306641
##MAXX=3997.64306641
##MINX=399.76428223
##MAXY=0.87224036
##MINY=0.46541199
##XFACTOR=1.0000000000
##YFACTOR=1.000000000000000e-9
##FIRSTY=0.83900428
##DELTAX=2.03961372
##XUNITS=1/CM
##YUNITS=ARBITRARY UNITS
##XYDATA=(X++(Y..Y))
$$ plain form
399.8 839004278 841916025 843175888 842773497 842674196 842841685 841871977 841148674 841137826 839731038 837397337
420.2 837397337 835586369 832549095 827129483 817684352 806319058 804436266 815669060 828322351
436.5 828322351 835219026 838864982 840198338 840086460 840775073 841283321 840960443 841231585 841505647
454.8 841505647 841111124 841172636 841021478 839984417 839614153 839637578 838769078 838331997 838573992 837819338
475.2 837819338 837010324 836971819 836290002 835409880 835371792 834700108 833132148 831612170 828709126 823054135
495.6 823054135 813706875 798053682 781570017 781079531 798771262 817762017 828484714 832984984
511.9 832984984 833852291 833688796 833756566 832885027 831730664 831308544 830199778 828297436 826764166
530.3 826764166 824312389 820065260 814715266 806758165 794438660 779210150 764351964 755575299
$$ packed form
399.8H39004278K911747J259863m02391r9301J67489r69708p23303j0848j406788k333701
420.2H37397337j810968l037274n419612r445131j1365294j882792J1232794J2653291
436.5H28322351O896675L645956J333356j11878O88613N08248l22878K71142K74062
454.8H41505647l94523O1512j51158j037061l70264K3425q68500m37081K41995p54654
475.2H37819338q09014l8505o81817q80122l8088o71684j567960j519978k903044n654991
495.6H23054135r347260j5653193j6483665m90486J7691731J8990755J0722697M500270
511.9H32984984Q67307j63495O7770q71539j154363m22120j108766j902342j533270
530.3H26764166k451777m247129n349994p957101j2319505j5228510j4858186q776665
$$ plain form
546.6 755575299 759346128 774568498 792812943 808097541 818944395 824969172 827879488 829910815
562.9 829910815 830489516 829427719 827955484 825064123 820794821 819498956 822921455 827266037 830227911
581.3 830227911 831843853 831987739 831889212 832125843 831413388 830107510 829053760 826869905 822963774
599.6 822963774 818053246 811196804 802975655 799197316 804726362 816487849 827516973 833966076
616 833966076 836318254 837440193 838695645 839148939 839030147 838865280 837494671 836095214 837389767
634.3 837389767 839647174 840496957 841090858 841724694 841664195 841762066 842238486 842153192 842004478 842116833
654.7 842116833 841499448 840483606 839727581 838296115 835969746 832585931 827731133 823890626 820047915
673.1 820047915 812515974 801071644 794601738 800662100 811820269 817913115 818269312 815548480
$$ packed form
546.6G55575299L770829J5222370J8244445J5284598J0846854O024777K910316K031327
562.9H29910815N78701j061797j472235k891361m269302j295865L422499M344582K961874
581.3H30227911J615942J43886r8527K36631p12455j305878j053750k183855l906131
599.6H22963774m910528o856442q221149l778339N529046J1761487J1029124O449103
616H33966076K352178J121939J255452M53294j18792j64867j370609j399457J294553
634.3H37389767K257407Q49783N93901O33836o0499R7871M76420q5294j48714J12355
654.7H42116833o17385j015842p56025j431466k326369l383815m854798l840507l842711
673.1H20047915p531941j1444330o469906O060362J1158169O092846L56197k720832
$$ plain form
689.4 815548480 811642885 806692183 797742426 784254611 772686481 769867480 776032805 787252724
705.7 787252724 799280047 809565365 818295121 825931132 831876040 836532831 840759218 844154358
722 844154358 846815765 849502146 851689875 853020310 854403079 855759442 856515050 857373536 858448029
740.4 858448029 858926415 859206498 859756470 859796941 859361053 858994365 857790709 854924619 850589573
758.7 850589573 843220174 827013254 795771778 760661721 753827095 784864008 823038459 844358921
775.1 844358921 852259874 855288625 856370747 856566668 856833756 856594324 855064094 852345347 848001659
793.4 848001659 842508197 840034902 844307840 853047371 861356974 866848111 869465590 870459497 871052802
811.8 871052802 870945573 870068371 869221330 868144691 866249323 864106596 861602306 857638896 852240324
$$ packed form
689.4H15548480l905595m950702q949757j3487815j1568130k819001O165325J1219919
705.7G87252724J2027323J0285318Q729756P636011N944908M656791M226387L395140
722H44154358K661407K686381K187729J330435J382769J356363P55608Q58486J074493
740.4H58448029M78386K80083N49972M0471m35888l66688j203656k866090m335046
758.7H50589573p369399j6206920l1241476l5110057o834626L1036913L8174451K1320462
775.1H44358921P900953L028751J082122J95921K67088k39432j530230k718747m343688
793.4H48001659n493462k473295M272938Q739531Q309603N491137K617479R93907N93305
811.8H71052802j07229q77202q47041j076639j895368k142727k504290l963410n398572
$$ plain form
830.1 852240324 846080244 840814352 840021133 844900787 851413190 855613112 856830597 854851842 849188983
848.5 849188983 839735389 827251017 817985773 820561171 831288815 837340355 833211541 820571601
864.8 820571601 805641472 802826405 820093155 844568491 860885441 868158579 871048808 871889830
881.1 871889830 872112632 872240365 871811748 871146560 870622456 869647801 868333220 867339313 866246462
899.5 866246462 864720106 863281012 861674547 859406471 856950521 854304314 850908041 847091079
915.8 847091079 843028784 838140130 832608283 826918423 820796728 814465880 808840036 804122865
932.1 804122865 800468683 798649311 798707843 800124049 802901506 806769609 810923278 815144241 819236934
950.5 819236934 822077274 823261678 824514508 827402651 830683529 832100809 832094312 833856285 839120865
$$ packed form
830.1H52240324o160080n265892p93219M879654O512403M199922J217485j978755n662859
848.5H49188983r453594j2484372r265244K575398J0727644O051540m128814j2639940
864.8H20571601j4930129k815067J7266750K4475336J6316950P273138K890229Q41022
881.1H71889830K22802J27733m28617o65188n24104r74655j314581r93907j092851
899.5H66246462j526356j439094j606465k268076k455950k646207l396273l816962
915.8H47091079m062295m888654n531847n689860o121695o330848n625844m717171
932.1H04122865l654182j819372N8532J416206K777457L868103M153669M220963M092693
950.5H19236934K840340J184404J252830K888143L280878J417280o497J761973N264580
$$ plain form
968.8 839120865 845555842 850036860 852114916 852508247 850947618 846902847 841574728 838936448 841698527
987.2 841698527 846806109 849780679 850022793 849078059 847583890 845311761 842440903 839143097 835035384
1005.5 835035384 830055237 824591339 819052637 814515471 812149167 811958849 814639568 821606278
1021.8 821606278 830834210 837971687 841563046 842599392 841764748 839607060 836672425 833094895
1038.2 833094895 829580665 827661216 828115165 830526471 834025502 837473094 840063751 841981828
1054.5 841981828 843436360 844159603 844320238 844286680 843951166 843360484 842803121 842067003 841032028
1072.8 841032028 840107441 839316726 838401377 837553084 836802363 835845649 834820688 833922029 832960010
1091.2 832960010 831939876 830952704 829646766 827812254 825521827 822398603 817985117 812801898
$$ packed form
968.8H39120865O434977M481018K078056L93331j560629m044771n328119k638280K762079
987.2H41698527N107582K974570K42114r44734j494169k272129k870858l297806m107713
1005.5H35035384m980147n463898n538702m537166k366304j90318K680719O966710
1021.8H21606278R227932P137477L591359J036346q34644k157688k934635l577530
1038.2H33094895l514230j919449M53949K411306L499031L447592K590657J918077
1054.5H41981828J454532P23243J60635l3558l35514n90682n57363p36118j034975
1072.8H41032028r24587p90715r15349q48293p50721r56714j024961q98659r62019
1091.2H32960010j020134r87172j305938j834512k290427l123224m413486n183219
$$ plain form
1107.5 812801898 808463395 806502342 806814194 807665825 807745516 807672679 808688521 809711456 807160974
1125.9 807160974 800229251 796084702 802321553 814999223 824896872 829374671 830782115 831048071
1142.2 831048071 830704749 829962492 829075456 827968717 826620877 825325549 824038506 822429657 820432127
1160.5 820432127 817876101 814295113 809357226 802623272 793292344 781004250 766831994 754166782
1176.9 754166782 748029888 751493216 764240444 784480929 807049632 823527396 830343902 830919206
1193.2 830919206 829221487 826816261 824351013 822213948 820254207 818328559 816528201 814680457
1209.5 814680457 812605858 810477614 808359981 806259394 804426968 802806854 800993145 799000502
1225.8 799000502 797109127 795216978 793160856 790933549 788390875 785441756 782079339 778000712
$$ packed form
1107.5H12801898m338503j961053L11852Q51631P9691p2837J015842J022935k550482
1125.9H07160974o931723m144549O236851J2677670R897649M477799J407444K65956
1142.2H31048071l43322p42257q87036j106739j347840j295328j287043j608849j997530
1160.5H20432127k556026l580988m937887o733954r330928j2288094j4172256j2665212
1176.9G54166782o136894L463328J2747228K0240485K2568703J6477764O816506N75304
1193.2H30919206j697719k405226k465248k137065j959741j925648j800358j847744
1209.5H14680457k074599k128244k117633k100587j832426j620114j813709j992643
1225.8G99000502j891375j892149k056122k227307k542674k949119l362417m078627
$$ plain form
1242.1 778000712 772963107 767138124 760473013 752505422 742806792 730853975 715986550 698208869
1258.4 698208869 679392457 664783597 662478387 677773952 706185341 735089839 753912091
1272.7 753912091 760432363 757738233 749093115 736379564 720581889 702457130 682735264 662577689
1289 662577689 644406915 631316900 625108063 625760078 633214712 647621155 666223586 681591451
1305.4 681591451 685413539 674437761 653981268 638320625 642025530 663130641 685351074 700799406
1321.7 700799406 715627491 734759390 755601287 773330271 785650432 793310344 798551857 803801477
1338 803801477 810234249 816610992 821239650 823565722 823468268 821046710 816750526 810817897 802882493
1356.4 802882493 792649388 779945016 765951931 755446196 751930833 753468275 756697774 760399818
$$ packed form
1242.1G78000712n037605n824983o665111p967591r698630j1952817j4867425j7777681
1258.4F98208869j8816412j4608860k305210J5295565K8411389K8904498J8822252
1272.7G53912091O520272k694130q645118j2713551j5797675j8124759j9721866k0157575
1289F62577689j8170774j3090015o208837O52015P454634J4406443J8602431J5367865
1305.4F81591451L822088j0975778k0456493j5660643L704905K1105111K2220433J5448332
1321.7G00799406J4828085J9131899K0841897J7728984J2320161P659912N241513N249620
1338H03801477O432772O376743M628658K326072r7454k421558m296184n932629p935404
1356.4H02882493j0233105j2704372j3993085j0505735l515363J537442L229499L702044
$$ plain form
1372.7 760399818 764575243 768603206 771779478 773308873 772745073 770865023 767847657 763267338
1389 763267338 758152544 753155649 747532010 740795791 732968807 724917710 718055427 714066386 715370834
1407.3 715370834 721937418 730645180 736934364 737701416 731471539 717975318 702607810 689907253
1423.7 689907253 682739913 685037673 698075533 718453705 740445316 762822032 782776117 796225250
1440 796225250 805708826 813190222 819062889 823585868 826722383 829261243 831677079 833672464 834221244
1458.3 834221244 833592892 832674980 831377029 829634368 827991426 826635420 824769139 821754515 817939639
1476.7 817939639 813995719 810237169 807142437 805215895 803592384 800259709 794485688 787937582
1493 787937582 780245602 769759119 757763326 746491730 736171007 723170400 702577114 683428228
$$ packed form
1372.7G60399818M175425M027963L176272J529395n63800j880050l017366m580319
1389G63267338n114794m996895n623639o736219p826984q051097o862283l989041J304448
1407.3G15370834O566584Q707762O289184P67052o229877j3496221j5367508j2700557
1423.7F89907253p167340K297760J3037860K0378172K1991611K2376716J9954085J3449133
1440G96225250R483576P481396N872667M522979L136515K538860K415836J995385N48780
1458.3H34221244o28352r17912j297951j742661j642942j356006j866281l014624l814876
1476.7H17939639l943920l758550l094732j926542j623511l332675n774021o548106
1493G87937582p691980j0486483j1995793j1271596j0320723j3000607k0593286j9148886
$$ plain form
1509.3 683428228 670766473 660762548 648902476 633310974 619728625 613204062 615614355 625974476
1525.6 625974476 641830206 659472406 678666711 700439334 719549417 736183524 756258726
1539.9 756258726 774968386 788336575 799565256 809250593 817789674 825052440 830803990 835235178
1556.2 835235178 838587105 839237213 838263571 837578177 837304831 836854219 835750401 834013283 830742955
1574.6 830742955 823848188 814518571 803594112 788988888 769317687 743952453 717288494 700335979
1590.9 700335979 700744390 713041484 725347817 730781972 727845013 716034114 696948588 679937780
1607.2 679937780 680943787 704398513 734328210 756771863 767656267 769146025 766494095 761566281
1623.5 761566281 755279303 747876942 739688993 732494950 726166189 718331754 710349321 704079568
$$ packed form
1509.3F83428228j2661755j0003925j1860072j5591502j3582349o524563K410293J0360121
1525.6F25974476J5855730J7642200J9194305K1772623J9110083J6634107K0075202
1539.9G56258726J8709660J3368189J1228681R685337Q539081P262766N751550M431188
1556.2H35235178L351927O50108r73642o85394k73346m50612j103818j737118l270328
1574.6H30742955o894767r329617j0924459j4605224j9671201k5365234k6663959j6952515
1590.9G00335979M08411J2297094J2306333N434155k936959j1810899j9085526j7010808
1607.2F79937780J006007K3454726K9929697K2443653J0884404J489758k651930m927814
1623.5G61566281o286978p402361q187949p194043o328761p834435p982433o269753
$$ plain form
1639.9 704079568 698755741 693790436 687520742 679626644 672846258 663761199 647135079 630284846
1656.2 630284846 612641990 589770794 559993505 528046966 501289129 479206294 465411991
1670.5 465411991 466309875 480988026 503118336 523632884 541120231 558742940 578836977 596105814
1686.8 596105814 610150635 623796880 635342479 645471096 655409634 667948127 687094510
1701.1 687094510 706820846 725695491 744025409 758424103 770048022 780486107 790519059
1715.3 790519059 800679445 809241772 815588236 821476936 827303231 832479775 837049842 841093957
1731.7 841093957 844693422 847210407 849085867 851100981 852972269 854674041 856460929 858109832
1748 858109832 859352112 860141993 860648572 861152291 861651659 861996412 862033486 862027705 862222373 862406909
$$ packed form
1639.9G04079568n323827m965305o269694p894098o780386r085059j6626120j6850233
1656.2F30284846j7642856k2871196k9777289l1946539k6757837k2082835j3794303
1670.5D65411991Q97884J4678151K2130310K0514548J7487347J7622709K0094037J7268837
1686.8E96105814J4044821J3646245J1545599J0128617R938538J2538493J9146383
1701.1F87094510J9726336J8874645J8329918J4398694J1623919J0438085J0032952
1715.3G90519059J0160386Q562327O346464N888700N826295N176544M570067M044115
1731.7H41093957L599465K516985J875460K015114J871288J701772J786888J648903
1748H58109832J242280P89881N06579N03719M99368L44753L7074n781J94668J84536
$$ plain form
1768.4 862406909 862452626 862256825 862032235 862289846 862897396 863203228 863115132 863009214 862955749 863072157
1788.8 863072157 863528490 863888204 863856137 863963783 864233434 864114225 863579094 863152504 863119900 863612413
1809.2 863612413 864438891 865124226 865691364 866445184 867251873 867869973 868429184 868873417 869041204 869009078
1829.6 869009078 868828773 868606150 868501186 868533969 868615866 868800521 869044602 869041204 868828773 868751407
1850 868751407 868843615 868903637 868946016 869049728 869047463 868935287 868993640 869201362 869204402 868923068 868615568
1872.4 868615568 868341386 868124366 867968678 867718637 867426455 867267609 867148876 866943061 866745472 866604447
1892.8 866604447 866478682 866481245 866610885 866665006 866688430 866736650 866597652 866299868 866074324 865890861
1913.2 865890861 865800202 865999997 866294265 866503716 866810739 867135227 867253542 867293894 867304683 867019951
$$ packed form
1768.4H62406909M5717j95801k24590K57611O07550L05832q8096j05918n3465J16408
1788.8H63072157M56333L59714l2067J07646K69651j19209n35131m26590l2604M92513
1809.2H63612413Q26478O85335N67138P53820Q06689O18100N59211M44233J67787l2126
1829.6H69009078j80305k22623j04964L2783Q1897J84655K44081l398k12431p7366
1850H68751407R2208O0022M2379J03712k265j12176N8353K07722L040k81334l07500
1872.4H68615568k74182k17020j55688k50041k92182j58846j18733k05815j97589j41025
1892.8H66604447j25765K563J29640N4121K3424M8220j38998k97784k25544j83463
1913.2H65890861r0659J99795K94268K09451L07023L24488J18315M0352J0789k84732
$$ plain form
1933.6 867019951 866574526 866362751 866355300 866452575 866670072 866784453 866684318 866596162 866453648 865942538
1954 865942538 865211070 864562392 864101768 864091814 864587128 865091383 865353227 865570128 865674317 865596235
1974.4 865596235 865588546 865610361 865463972 865347028 865348577 865276635 865242302 865341187 865275383 865059316 864978373
1996.8 864978373 864913702 864764988 864721954 864718735 864569902 864425719 864353895 864187002 864013612 863934338 863763511
2019.2 863763511 863529205 863400936 863235831 862982035 862820029 862669170 862385869 862125576 861934900 861680567
2039.6 861680567 861449659 861317456 861124873 860877156 860716522 860531986 860271811 860108495 859978735 859725058
2060 859725058 859475493 859266520 858956516 858631611 858361840 858024478 857668161 857438624 857283831 857194006
2080.4 857194006 857269526 857406974 857510924 857702374 857942283 858064711 858129501 858167231 858061194 857862532
$$ packed form
1933.6H67019951m45425k11775p451R7275K17497J14381j00135q8156j42514n11110
1954H65942538p31468o48678m60624r954M95314N04255K61844K16901J04189p8082
1974.4H65596235p689K1815j46389j16944J549p1942l4333R8885o5804k16067q0943
1996.8H64978373o4671j48714m3034l219j48833j44183p1824j66893j73390p9274j70827
2019.2H63763511k34306j28269j65105k53796j62006j50859k83301k60293j90676k54333
2039.6H61680567k30908j32203j92583k47717j60634j84536k60175j63316j29760k53677
2060H59725058k49565k08973l10004l24905k69771l37362l56317k29537j54793q9825
2080.4H57194006P5520J37448J03950J91450K39909J22428O4790L7730j06037j98662
$$ plain form
2100.8 857862532 857691646 857529521 857405722 857410729 857471287 857506037 857581675 857704997 857795060 857868254 857935250
2123.3 857935250 857931733 857894242 857862353 857776523 857678592 857634485 857566178 857451379 857356668 857258081 857108057
2145.7 857108057 856944025 856783092 856601000 856403112 856186509 855941355 855701923 855507553 855349660 855224669
2166.1 855224669 855164647 855182350 855229139 855257213 855266690 855260193 855228961 855181277 855131567 855078578 855023205 854946852
2190.6 854946852 854821205 854666948 854527652 854401648 854270160 854158700 854060709 853931427 853804469 853709161
2211 853709161 853593111 853459299 853326797 853137136 852886260 852649093 852437615 852252543 852104187 851912141
2231.4 851912141 851641953 851389766 851183891 850958407 850751638 850621939 850510240 850405157 850367844 850347757
2251.8 850347757 850269437 850164294 850010395 849767029 849516928 849301577 849091411 848911703 848753035 848540068
$$ packed form
2100.8H57862532j70886j62125j23799N007O0558L4750P5638J23322R0063P3194O6996
2123.3H57935250l517l7491l1889q5830r7931m4107o8307j14799r4711r8587j50024
2145.7H57108057j64032j60933j82092j97888k16603k45154k39432j94370j57893j24991
2166.1H55224669o0022J7703M6789K8074R477o497l1232m7684m9710n2989n5373p6353
2190.6H54946852j25647j54257j39296j26004j31488j11460r7991j29282j26958r5308
2211H53709161j16050j33812j32502j89661k50876k37167k11478j85072j48356j92046
2231.4H51912141k70188k52187k05875k25484k06769j29699j11699j05083l7313k0087
2251.8H50347757p8320j05143j53899k43366k50101k15351k10166j79708j58668k12967
$$ plain form
2272.2 848540068 848295033 848073065 847847342 847634435 847448170 847192705 846836567 846484184 846163332 845782101
2292.5 845782101 845359147 844978631 844626129 844327331 844118059 843908668 843671679 843481779 843308926 843071401
2312.9 843071401 842792749 842457592 841982961 841425419 840916872 840471864 840004146 839502096 839059174 838756442
2333.3 838756442 838555992 838315368 837982714 837665677 837511182 837687016 838064075 838159502 837713838 836885214
2353.7 836885214 836038351 835338652 834787726 834394634 834097981 833884120 833833396 833858252 833815396 833751500
2374.1 833751500 833737195 833728969 833720565 833705485 833585322 833344400 833060503 832720160 832319021 831933141 831554890
2396.6 831554890 831160903 830812693 830487847 830096841 829669118 829248071 828811765 828401983 828042388 827653408
2417 827653408 827240825 826884270 826545417 826188028 825884104 825606048 825249672 824849784 824455917 824025869
$$ packed form
2272.2H48540068k45035k21968k25723k12907j86265k55465l56138l52383l20852l81231
2292.5H45782101m22954l80516l52502k98798k09272k09391k36989j89900j72853k37525
2312.9H43071401k78652l35157m74631n57542n08547m45008m67718n02050m42922l02732
2333.3H38756442k00450k40624l32654l17037j54495J75834L77059R5427m45664q28624
2353.7H36885214q46863o99699n50926l93092k96653k13861n0724K4856m2856o3896
2374.1H33751500j4305q226q404j5080j20163k40922k83897l40343m01139l85880l78251
2396.6H31554890l93987l48210l24846l91006m27723m21047m36306m09782l59595l88980
2417H27653408m12583l56555l38853l57389l03924k78056l56376l99888l93867m30048
$$ plain form
2437.4 824025869 823561549 823085725 822570562 822051048 821569502 821052015 820462644 819846034 819172502 818430841
2457.8 818430841 817735851 817138076 816582084 816055536 815545857 815028787 814554632 814147413 813729346 813274026
2478.1 813274026 812805772 812269747 811643064 811008394 810411751 809845448 809326530 808853030 808393121 807958245
2498.5 807958245 807541490 807079077 806532979 805902481 805194139 804411411 803577900 802725911 801850975 800930262
2518.9 800930262 799966455 798986793 798002660 797025025 796052277 795054257 794043064 793043017 792043030
2537.3 792043030 791088879 790218592 789406955 788709581 788248777 788060069 788114071 788453221 789116919 790068686
2557.7 790068686 791275978 792652309 794090331 795589268 797134221 798652828 800128996 801536143
2574 801536143 802751064 803701580 804434717 804916561 805064499 804909229 804490507 803848624 803128898 802467585
$$ packed form
2437.4H24025869m64320m75824n15163n19514m81546n17487n89371o16610o73532p41661
2457.8H18430841o94990n97775n55992n26548n09679n17070m74155m07219m18067m55320
2478.1H13274026m68254n36025o26683o34670n96643n66303n18918m73500m59909m34876
2498.5H07958245m16755m62413n46098o30498p08342p82728q33511q51989q74936r20713
2518.9H00930262r63807r79662r84133r77635r72748r98020j011193j000047r99987
2537.3G92043030r54151q70287q11637o97374m60804j88708N4002L39150O63698R51767
2557.7G90068686J207292J376331J438022J498937J544953J518607J476168J407147
2574H01536143J214921R50516P33137M81844J47938j55270m18722o41883p19726o61313
$$ plain form
2594.4 802467585 801907837 801572204 801616609 801964164 802461147 803047597 803583324 803949594 804167747 804208994
2614.8 804208994 804031670 803727031 803366303 802917957 802415550 801932275 801431835 800897717 800368965 799823463
2635.2 799823463 799270272 798747599 798204780 797615588 797070682 796602607 796125650 795632958 795183778 794737279
2655.6 794737279 794253707 793774426 793308079 792869389 792564094 792408168 792360365 792525589 792980790 793688178
2676 793688178 794646978 795829594 797126412 798512280 800019681 801558316 803018630 804367304 805569470
2694.3 805569470 806627274 807578444 808362663 808905363 809249640 809401035 809275627 808871090 808286071
2712.7 808286071 807597280 806887388 806309223 805956662 805812538 805864036 806067169 806363046 806808770 807385147
2733.1 807385147 807944596 808432281 808783114 808854818 808643162 808263659 807733476 806980491 806011379 804943383
$$ packed form
2594.4H02467585n59748l35633M4405L47555M96983N86450N35727L66270K18153M1247
2614.8H04208994j77324l04639l60728m48346n02407m83275n00440n34118n28752n45502
2635.2G99823463n53191n22673n42819n89192n44906m68075m76957m92692m49180m46499
2655.6G94737279m83572m79281m66347m38690l05295j55926m7803J65224M55201P07388
2676G93688178R58800J182616J296818J385868J507401J538635J460314J348674J202166
2694.3H05569470J057804R51170P84219N42700L44277J51395j25408m04537n85019
2712.7H08286071o88791p09892n78165l52561j44124N1498K03133K95877M45724N76377
2733.1H07385147N59449M87685L50833P1704k11656l79503n30183p52985r69112j067996
$$ plain form
2753.5 804943383 803883970 802881122 801968515 801147223 800412118 799775600 799180448 798566043 797946572
2771.8 797946572 797251999 796347082 795286059 794217467 793172240 792219579 791456640 790803552 790133059
2790.2 790133059 789453268 788829267 788293302 787797570 787256777 786692321 786192179 785747826 785280943 784761369
2810.6 784761369 784213841 783666968 783144176 782682717 782298088 781991422 781811893 781778574 781832218 781954288
2831 781954288 782170832 782434940 782689929 782897770 783022881 783155799 783401966 783674538 783857882 784040630
2851.4 784040630 784332633 784714222 785183430 785656750 785932600 785979450 785884321 785639703 785334587 785133064
2871.8 785133064 784910500 784489572 784039259 783734500 783518434 783353806 783217251 783044994 782895625 782902658
2892.2 782902658 783051252 783193946 783293903 783457041 783729196 784058630 784346819 784556448 784756899 784844816
$$ packed form
2753.5H04943383j059413j002848r12607q21292p35105o36518n95152o14405o19471
2771.8G97946572o94573r04917j061023j068592j045227r52661p62939o53088o70493
2790.2G90133059o79791o24001n35965m95732n40793n64456n00142m44353m66883n19574
2810.6G84761369n47528n46873n22792m61459l84629l06666j79529l3319N3644J22070
2831G81954288K16544K64108K54989K07841J25111J32918K46167K72572J83344J82748
2851.4G84040630K92003L81589M69208M73320K75850M6850r5129k44618l05116k01523
2871.8G85133064k22564m20928m50313l04759k16066j64628j36555j72257j49369P033
2892.2G82902658J48594J42694R9957J63138K72155L29434K88189K09629K00451Q7917
$$ plain form
2912.6 784844816 784562945 783911228 783058107 782071590 781069398 780187249 779501259 779101193 778975189
2930.9 778975189 779028177 779202104 779471397 779799521 780173481 780585170 780893087 780903280 780664980 780419111
2951.3 780419111 780137599 779692948 779257059 778948128 778662801 778313279 777897835 777467966 777096391 776846826
2971.7 776846826 776697397 776607513 776693642 776982307 777218580 777330995 777492344 777707100 777904034 778017879
2992.1 778017879 777956605 777829587 777745724 777660370 777657807 777825892 778110862 778488278 778924882 779210448
3012.5 779210448 779149830 778825462 778390527 777881086 777357101 776858807 776364267 775972605 775830328 775968790
3032.9 775968790 776292562 776730657 777297676 777863681 778214872 778273225 778163791 778300822 779073298 780313075
3053.3 780313075 781543255 782540500 783297002 783830225 784169495 784270704 783964396 783178329 782073498
$$ packed form
2912.6G84844816k81871o51717q53121r86517j002192q82149o85990m00066j26004
2930.9G78975189N2988J73927K69293L28124L73960M11689L07917J0193k38300k45869
2951.3G80419111k81512m44651m35889l08931k85327l49522m15444m29869l71575k49565
2971.7G76846826j49429q9884Q6129K88665K36273J12415J61349K14756J96934J13845
2992.1G78017879o1274j27018q3863q5354k563J68085K84970L77416M36604K85566
3012.5G79210448o0618l24368m34935n09441n23985m98294m94540l91662j42277J38462
3032.9G75968790L23772M38095N67019N66005L51191N8353j09434J37031P72476J239777
3053.3G80313075J230180R97245P56502N33223L39270J01209l06308p86067j104831
$$ plain form
3071.7 782073498 781004310 780536532 780952632 781762362 782327950 782458067 782219470 781951487 782074988
3090 782074988 782593012 783257663 783900619 784318209 784218848 783576846 782805145 782337844 782260239 782482922
3110.4 782482922 783096671 784150302 785321772 786274672 786855400 787129164 787449837 788036644 788791955
3128.8 788791955 789511204 790077388 790617943 791339278 792118490 792623520 792902052 793192685 793467164 793704331
3149.2 793704331 793949008 793965340 793594062 793097436 792620420 792054236 791352630 790503383 789472103 788244009
3169.6 788244009 786805868 785127997 783271551 781420529 779794097 778607666 777930260 777563453 777238667
3187.9 777238667 776810467 776209235 775492311 774878383 774517179 774395704 774459481 774573743 774516404 774197578
3208.3 774197578 773719668 773163915 772531688 771847546 771082997 770140171 769009769 767678440 766109109
$$ packed form
3071.7G82073498j069188m67778M16100Q09730N65588J30117k38597k67983J23501
3090G82074988N18024O64651O42956M17590r9361o42002p71701m67301p7605K22683
3110.4G82482922O13749J053631J171470R52900N80728K73764L20673N86807P55311
3128.8G88791955P19249N66184N40555P21335P79212N05030K78532K90633K74479K37167
3149.2G93704331K44677J6332l71278m96626m77016n66184p01606q49247j031280j228094
3169.6G88244009j438141j677871j856446j851022j626432j186431o77406l66807l24786
3187.9G77238667m28200o01232p16924o13928l61204j21475O3777J14262n7339l18826
3208.3G74197578m77910n55753o32227o84142p64549r42826j130402j331329j569331
$$ plain form
3226.7 766109109 764420629 762747228 760983407 758876503 756436467 753873944 751260877 748607278
3243 748607278 745875597 742929578 739690721 736261308 732812643 729430377 726105094 722866118 719829381
3261.3 719829381 717014134 714296997 711625397 709006250 706235349 703218520 700165570 697143435
3277.7 697143435 694049716 690701246 686820269 682223141 676982582 671328187 665364921 659109771
3294 659109771 652610898 645937920 639481485 633990645 630036712 627816439 627451420 629088998 632715404
3312.3 632715404 638051212 644566417 651679814 658957958 666063786 672675967 678560555 683648944
3328.6 683648944 687947333 691480935 694344401 696637452 698401451 699706614 700624943 701140523 701233089
3347 701233089 700918734 700223207 699195147 697882175 696292579 694458842 692460716 690327346 688117087
$$ packed form
3226.7G66109109j688480j673401j763821k106904k440036k562523k613067k653599
3243G48607278k731681k946019l238857l429413l448665l382266l325283l238976l036737
3261.3G19829381k815247k717137k671600k619147k770901l016829l052950l022135
3277.7F97143435l093719l348470l880977m597128n240559n654395n963266o255150
3294F59109771o498873o672978o456435n490840l953933k220273l65019J637578L626406
3312.3F32715404N335808O515205P113397P278144P105828O612181N884588N088389
3328.6F83648944M298389L533602K863466K293051J763999J305163R18329N15580R2566
3347G01233089l14355o95527j028060j312972j589596j833737j998126k133370k210259
$$ plain form
3365.4 688117087 685906529 683629274 681230724 678827226 676542044 674360812 672223747 670111418
3381.7 670111418 668054998 666080058 664230108 662562609 660926461 659154415 657410979 655910313
3398 655910313 654539585 652974844 651174545 649490118 648093462 646831453 645591676 644353151 643128157
3416.3 643128157 642013729 641057670 640215158 639501631 638998687 638714314 638485551 638318956 638374209 638432980
3436.7 638432980 638281286 638196945 638431311 638921201 639525831 640157104 640868604 641695440 642599881 643636525
3457.1 643636525 644824624 646003008 647177994 648613274 650226891 651510596 652341366 653222740 654466927
3475.5 654466927 655983150 657515287 658794999 659976363 661330223 662727714 664045572 665409327
3491.8 665409327 666897953 668460310 669974029 671492279 673117042 674572051 675805449 677221119
$$ packed form
3365.4F88117087k210558k277255k398550k403498k285182k181232k137065k112329
3381.7F70111418k056420j974940j849950j667499j636148j772046j743436j500666
3398F55910313j370728j564741j800299j684427j396656j262009j239777j238525j224994
3416.3F43128157j114428r56059q42512p13527n02944k84373k28763j66595N5253N8771
3436.7F38432980j51694q4341K34366M89890O04630O31273P11500Q26836R04441J036644
3457.1F43636525J188099J178384J174986J435280J613617J283705Q30770Q81374J244187
3475.5F54466927J516223J532137J279712J181364J353860J397491J317858J363755
3491.8F65409327J488626J562357J513719J518250J624763J455009J233398J415670
$$ plain form
3508.1 677221119 678887010 680665374 682437360 684071302 685707748 687541068 689545214 691420853
3524.4 691420853 693032444 694663703 696461618 698394835 700493932 702568233 704450607 706461251
3540.8 706461251 708768964 711018145 712875366 714540422 716341078 718239903 720151186 722174704
3557.1 722174704 724379122 726654470 728875518 731117904 733467698 735724390 737839937 740048170
3573.4 740048170 742435813 744917214 747530520 750349522 753286421 756186843 758883357 761387646
3589.7 761387646 763911247 766573727 769315064 772099197 774901867 777605116 780202031 782786369
3606 782786369 785418093 788021207 790548682 793026149 795353770 797594130 799773514 801679730 803472698
3624.4 803472698 805392087 807370961 809079885 810477555 811829090 813129008 814359665 815614700
$$ packed form
3508.1F77221119J665891J778364J771986J633942J636446J833320K004146J875639
3524.4F91420853J611591J631259J797915J933217K099097K074301J882374K010644
3540.8G06461251K307713K249181J857221J665056J800656J898825J911283K023518
3557.1G22174704K204418K275348K221048K242386K349794K256692K115547K208233
3573.4G40048170K387643K481401K613306K819002K936899K900422K696514K504289
3589.7G61387646K523601K662480K741337K784133K802670K703249K596915K584338
3606G82786369K631724K603114K527475K477467K327621K240360K179384J906216J792968
3624.4H03472698J919389J978874J708924J397670J351535J299918J230657J255035
$$ plain form
3640.7 815614700 816929877 818325996 819785476 821102619 821888149 822254121 822626770 823197246 823845148
3659 823845148 824312270 824615359 825040698 825611830 826089084 826427400 826651216 826492906 826045930 825845957
3679.4 825845957 825974047 826426625 827297747 828454196 829219639 829297662 829301536 829475939 829731166 830042779
3699.8 830042779 830274642 830380559 830613732 831027150 831344604 831359565 831252456 831255674 831356406 831454396
3720.2 831454396 831491828 831466675 831425607 831469536 831700742 832129419 832474113 832445085 832250118 832161188 832162380
3742.7 832162380 832189977 832251549 832197309 831853092 831440866 831294477 831308842 831239998 831099153 831076324 831177294
3765.1 831177294 831231236 831125498 830893874 830696225 830679476 830835342 830920696 830732346 830442071 830211043
3785.5 830211043 830081463 830094159 830171108 830236793 830330193 830433488 830408752 830228925 830064058 829912782
$$ packed form
3640.7H15614700J315177J396119J459480J317143P85530L65972L72649N70476O47902
3659H23845148M67122L03089M25339N71132M77254L38316K23816j58310m46976j99973
3679.4H25845957J28090M52578Q71122J156449P65443P8023L874J74403K55227L11613
3699.8H30042779K31863J05917K33173M13418L17454J4961j07109L218J00732R7990
3720.2H31454396L7432k5153m1068M3929K31206M28677L44694k9028j94967q8930J192
3742.7H32162380K7597O1572n4240l44217m12226j46389J4365o8844j40845k2829J00970
3765.1H31177294N3942j05738k31624j97649j6749J55866Q5354j88350k90275k31028
3785.5H30211043j29580J2696P6949O5685R3400J03295k4736j79827j64867j51276
$$ plain form
3805.9 829912782 829674184 829501510 829539299 829678833 829778850 829845846 829742253 829371750 829049349 828867972
3826.3 828867972 828732491 828696787 828811526 829030573 829121768 828918815 828661859 828462958 828262210 828188956
3846.7 828188956 828348398 828518808 828206599 827580571 827309906 827282310 827326953 827342033 827303529 827278912
3867.1 827278912 827195168 827010691 826780736 826574981 826485515 826447308 826387525 826393902 826390088 826237142 826072276
3889.5 826072276 825952470 825841606 825859845 825986147 826032519 825884402 825537145 825146019 824899435 824795365
3909.9 824795365 824794352 824861705 824870527 824781001 824696064 824635029 824559391 824489236 824438274 824352324 824201226 824049354
3934.4 824049354 823955655 823891819 823813796 823743880 823726773 823724389 823643148 823510826 823424041 823360682 823273659
3956.8 823273659 823205292 823169529 823084295 822962821 822919071 822940469 822937787 822887361 822815418 822746992 822688878
$$ packed form
3805.9H29912782k38598j72674L7789J39534J00017O6996j03593l70503l22401j81377
3826.3H28867972j35481l5704J14739K19047R1195k02953k56956j98901k00748p3254
3846.7H28188956J59442J70410l12209o26028k70665k7596M4643J5080l8504k4617
3867.1H27278912q3744j84477k29955k05755q9466l8207n9783O377l814j52946j64866
3889.5H26072276j19806j10864J8239J26302M6372j48117l47257l91126k46584j04070
3909.9H24795365j013O7353Q822q9526q4937o1035p5638p0155n0962q5950j51098j51872
3934.4H24049354r3699o3836p8023o9916j7107k384q1241j32322q6785o3359q7023
3956.8H23273659o8367l5763q5234j21474m3750K1398k682n0426p1943o8426n8114
$$ plain form
3979.3 822688878 822659492 822648644 822580218 822430670 822278619 822200000 822156250 822076261 821964681
3997.6 821964681
$$ packed form
3979.3H22688878k9386j0848o8426j49548j52051p8619m3750p9989j11580
3997.6H21964681
##END=$$ End of the data block
