##TITLE=Manidu - 3 - N-N-dimetil $$ Begin of the data block
##JCAMP-DX=5.00 $$ ACD/SpecManager v 10.08
##SPECTROMETER/DATA SYSTEM=Alpha
##DATE=22 Oct 2014 14:05:46
##DATA TYPE=INFRARED SPECTRUM
##DATA CLASS=XYDATA
##ORIGIN=
##OWNER=
##NPOINTS=1765
##FIRSTX=399.76428223
##LASTX=3997.64306641
##MAXX=3997.64306641
##MINX=399.76428223
##MAXY=0.88093507
##MINY=0.43464512
##XFACTOR=1.0000000000
##YFACTOR=1.000000000000000e-9
##FIRSTY=0.83562189
##DELTAX=2.03961372
##XUNITS=1/CM
##YUNITS=ARBITRARY UNITS
##XYDATA=(X++(Y..Y))
399.8H35621893j03056O06120j263023m400849o133497n424261m137337l761947k911985
418.1H08092058J783013O825090Q335530O181658J812219n61356K04086J397431P79390
436.5H34849119j045823j844108k32935J403511k42353k417982o90639L784478N619109
454.8H39182377K867460j272321k380550P9692K598703J595437k019703l966391j907349
473.2H34777355N83232j296759n549908o090700j438499K185285r71138o431461m112660
491.5H11654747N107224Q941411L932357l949344j0049224j2301445j1018157n694747
507.9G86622822K359569N225480Q51989l104925j33694P432402J1320412J0344386
524.2H20918441R110033P343889L175914o82652p54237J872599K877652N48244k359152
$$ plain form
399.8 835621893 835518837 836124957 834861934 830461085 824327588 818903327 814765990 811004043 808092058
418.1 808092058 809875071 816700161 825035691 831217349 833029568 832468212 832672298 834069729 834849119
436.5 834849119 833803296 831959188 831726253 833129764 832887411 830469429 829778790 833563268 839182377
454.8 839182377 842049837 840777516 838396966 838476658 841075361 842670798 840651095 836684704 834777355
473.2 834777355 835360587 834063828 828513920 822423220 820984721 823170006 822198868 815767407 811654747
491.5 811654747 816761971 825703382 829635739 825686395 815637171 803335726 792317569 786622822
507.9 786622822 788982391 794207871 795059860 791954935 791821241 799253643 810574055 820918441
524.2 820918441 830028474 837372363 840548277 839865625 839111388 840983987 843861639 844409883 842050731
542.5H42050731k311408N11467K227068L45707l007531m597306l313780K98738L106356
560.9H35310042K143323K30611R16898K278805J274049j188159j952708j8298J939058
579.3H40933621J217663j096070j981318m86195J309336J198232n28455j635134o38485
597.6H38293195J174807J374066k61545j482069p92981P63893J122594m12583k055645
616H37723732j502037N36978J521409R30667k16306p02619m50730p29144k223492m307151
636.4H30581307o920635r090722n170643N331278J1543512Q982003M973173L250718
652.7H43479991K184570R61721J88946M14849R14573r89615o007135l974975M361988
671H41534913L647804P90834k8789k87950m61459j54376M18484P04527M38154o9261
$$ plain form
542.5 842050731 839739323 840250790 842477858 842823565 839816034 835218728 831904948 832203686 835310042
560.9 835310042 837453365 837683976 838600874 840879679 842153728 840965569 839012861 838994563 840933621
579.3 840933621 842151284 841055214 839073896 838587701 839897037 841095269 840566814 838931680 838293195
597.6 838293195 839468002 840842068 840580523 839098454 838305473 839069366 840191960 839779377 837723732
616 837723732 836221695 836758673 838280082 839210749 838994443 838291824 837841094 837111950 834888458 830581307
636.4 830581307 823660672 814569950 809399307 814730585 826274097 835256100 840229273 843479991
652.7 843479991 845664561 846626282 846815228 847230077 848144650 847155035 841147900 837172925 841534913
671 841534913 845182717 845973551 845944762 845656812 845195353 845040977 845459461 846163988 846602142 846532881
691.4H46532881l04341j40786N007n00918j830578l836989o044626n312264N17904
709.8H29085290N100608L496766J526416K406001K785504J592517j72198j480699k000272
728.1H42339933l164411n893111o671250j553714M721403N286813J621902k137423
744.5H34550142m734993o658911r209514j1880875r008526L325700J6103804J8274367
760.8H30761194J2129128N311847J019120m68314k42292k36094j430214l138363m142940
779.1H39563072m551053o516457j3148785k2143542k0126939n013347K446950J284837
795.4G71794736J0795415K2762179K0163179J0248422L244460j273692m849016q374215
811.8H24511468j4958202k6880444l2633781j2824655K0817399L4028590K3756504
$$ plain form
691.4 846532881 846228540 846087754 846092761 845591843 843761265 839924276 833879650 828567386 829085290
709.8 829085290 834185898 837682664 839209080 841615081 844400585 845993102 845820904 844340205 842339933
728.1 842339933 839175522 833282411 826611161 825057447 829778850 835065663 836687565 834550142
744.5 834550142 829815149 823156238 813946724 802065849 793057323 796383023 812486827 830761194
760.8 830761194 842890322 848202169 849221289 848752975 848510683 848274589 846844375 843706012 839563072
779.1 839563072 835012019 828495562 815346777 793203235 773076296 768062949 770509899 771794736
795.4 771794736 782590151 805352330 825515509 835763931 839008391 837734699 832885683 824511468
811.8 824511468 809553266 782672822 750039041 737214386 758031785 792060375 815816879
826H15816879J0795474L979981J948953K578556L329933K385974M99010m59909r4772
844.4H40780079L66569j49429j254558j511693m36008O36696M71950o50108j443386
862.8H36810112j116157k66134j64330j052618j903952j769363r53019p04706j505554
881.1H27374279k630233l241360l723383n399824p648825m849077M677475J0402918
897.4H14961970O784439J271903j366376k073706j796603j377880j592815k501428
913.7H12309504l460646l968537m271030n229056p430256j0888159j5420198k0550251
930.1G41091371k3556769j8152476l447711P750451Q162201J2236714K5709093L0646682
946.4G80439556K1002233R914040M133463J332104o03556j971841k523184k574027
$$ plain form
826 815816879 826612353 830592334 832541287 835119843 838449776 840835750 841334760 840874851 840780079
844.4 840780079 841146648 840997219 839742661 838230968 837794960 838431656 838903606 838253498 836810112
862.8 836810112 835693955 835427821 835263491 834210873 832306921 830537558 829584539 828879833 827374279
881.1 827374279 824744046 821502686 817779303 812379479 804730654 799881577 804559052 814961970
897.4 814961970 821746409 823018312 821651936 819578230 817781627 816403747 814810932 812309504
913.7 812309504 808848858 804880321 800609291 795380235 787949979 777061820 761641622 741091371
930.1 741091371 717534602 699382126 695934415 703684866 711847067 724083781 749792874 780439556
946.4 780439556 801441789 811355829 815489292 816821396 816217840 814245999 811722815 809148788
962.7H09148788k846539l478586l478050k647102k906025n397916o134331j57654O889582
981.1G88992167O330549J495660j536549l040313m328072n653739p823229r856701
997.4G64579773n379915L442824L153920l203333k626240K022505K777517j99676l446281
1015.7G61121094n721032p699609r490490j0116339q158386l136038L266096Q554101
1032G28619397J1401057J1122405Q107365M231989J020193j109183k138853k321899
1048.4G58932471k305984k600253l149271l462732l202259k526999j897633j611054
1064.7G38176286j575053j576304j670778k091288k773524l335833l546417l661990
1081G17945099m041374m711926n398989n776226n785644n625665n373538m943907m406750
$$ plain form
962.7 809148788 806302249 802823663 799345613 796698511 793792486 788394570 782260239 782102585 788992167
981.1 788992167 795322716 796818376 795281827 792241514 787913442 782259703 774436474 764579773
997.4 764579773 759199858 762642682 765796602 762593269 759967029 761989534 764767051 764567375 761121094
1015.7 761121094 755400062 747700453 738209963 728093624 719935238 716799200 720065296 728619397
1032 728619397 740020454 751142859 759250224 763482213 764502406 763393223 761254370 758932471
1048.4 758932471 756626487 754026234 750876963 747414231 744211972 741684973 739787340 738176286
1064.7 738176286 736601233 735024929 733354151 731262863 728489339 725153506 721607089 717945099
1081 717945099 713903725 709191799 703792810 698016584 692230940 686605275 681231737 676287830 671881080
1099.4F71881080m063547m227400m916251n846440o731749p645965r084999j1276186
1115.7F18088543j3548195j4975309j5621662j6525865j7651141j6478419r874046
1129.9E13413906J512170J1502027J5465439J7281115K2185147K6082575K0480633
1144.2F27923012N303144j1038601k2182167k7974307l0228257k9167414k4127841
1158.5D88507569j5718132n732537M511297J4215410K2011071K6126206K5204480J8947720
1174.8E78073084Q913279j341164p742107p480800j50860J1633456K3075164K9936671
1191.1F34916723L0845463K6989520K0888984J5240729J1040747O960511K121866j547933
1207.5G47456610j629054P06732K125502L728091Q757174J3464332J1807203N155087
$$ plain form
1099.4 671881080 667817533 663590133 658673882 652827442 646095693 638449728 629364729 618088543
1115.7 618088543 604540348 589565039 573943377 557417512 539766371 523287952 513413906
1129.9 513413906 514926076 526428103 541893542 559174657 581359804 607442379 627923012
1144.2 627923012 633226156 622187555 600005388 572031081 541802824 512635410 488507569
1158.5 488507569 472789437 467056900 471568197 485783607 507794678 533920884 559125364 578073084
1174.8 578073084 586986363 585645199 577903092 570422292 570271432 581904888 604980052 634916723
1191.1 634916723 665762186 692751706 713640690 728881419 739922166 746882677 749004543 747456610
1207.5 747456610 745827556 746534288 748659790 752387881 761145055 774609387 786416590 791571677
1223.8G91571677r95577l389418k815783k831757n353093q498788r171665n600690
1240.1G52914906P83503N525827N911350L742874J544475r66668n233407j1129379
1256.4G53093481j6254306j6190648p320523O029427J3244688J0244430K253890n253256
1272.7G39847183j0747075j5223026k0383179k6765824l3037960l6272884l2601535
1287E64815700j9111037K121270K3309111L7193120M2132318M0415406L4426987K5994539
1303.3G51297414J7320454J0540069O202459L253043O77764j617551l202975l919601
1319.6G80551076m543126p036745j2664974j9234240j9505799q850098L675402O521344
1336G18912840J730084k364039k630413j602709k147973m580974p573724j0254323
$$ plain form
1223.8 791571677 790576100 787186682 784370899 781539142 776186049 767687261 758515596 752914906
1240.1 752914906 753698409 759224236 765135586 768878460 770422935 769456267 764222860 753093481
1256.4 753093481 736839175 720648527 713328004 719357431 732602119 742846549 745100439 739847183
1272.7 739847183 729100108 713877082 693493903 666728079 633690119 597417235 564815700
1287 564815700 545704663 547825933 571135044 608328164 650460482 690875888 725302875 751297414
1303.3 751297414 768617868 779157937 785360396 788613439 789291203 787673652 784470677 780551076
1319.6 780551076 776007950 768971205 756306231 737071991 717566192 708716094 712391496 718912840
1336 718912840 720642924 718278885 715648472 714045763 711897790 707316816 699743092 689488769
1352.3F89488769j3045371j6048431j8845559k2336244k6988924k8954208k7377545
1366.6E35892487k4030030j4577836K82466J1136979Q663893M982412J4929533K9688895
1382.9E66968799L5820067L2768607J9421696L70384j5199900k2714675j7369270o794512
1399.2E93271196K865612J3485134K6068270L0744612J8462539j276016m170895J3324678
1415.5F92775130K8509736K9533267J7916918P906974L027081q33333n398333r607136
1431.8G63830304j2231290j5040338j2739241k497018O727994J1611104J0458886M844964
1448.1G54965365j469016m793227m521787j67251P831157R371697N961836K498448
1464.5G69677222l20256k370596n266130r743988j2045920j2279392j3265013j5231490
$$ plain form
1352.3 689488769 676443398 660394967 641549408 619213164 592224240 563270032 535892487
1366.6 535892487 511862457 497284621 497567087 508704066 517367959 522350371 537279904 566968799
1382.9 566968799 602788866 635557473 654979169 655349553 640149653 617434978 600065708 593271196
1399.2 593271196 596136808 609621942 635690212 666434824 684897363 683621347 679450452 692775130
1415.5 692775130 721284866 750818133 768735051 776642025 779669106 778835773 773437440 763830304
1431.8 763830304 751599014 736558676 723819435 721322417 728050411 739661515 750120401 754965365
1448.1 754965365 753496349 748703122 744181335 744014084 751845241 761216938 767178774 769677222
1464.5 769677222 769356966 766986370 761720240 751976252 739930332 727650940 714385927 699154437
1480.8F99154437j7335475j8850028k1980405k7378857l0036867k5939524k4429441
1495E33203840k7029633k5303871k0386994j5370428j0105133l62665J0088593J4310628
1511.4D59044337J6819299J9641697K2839725K4893701L0358374L1455755K7533114
1525.6F32586002K4884820J7513395Q010328k302409j0356426j4150202j4421642j146436
1542F40617430J2277603J6617597J7105519J7765165J7563581J6094685J3779103J4970601
1558.3G66791284J7386437J0567843O908656N907356N273164N785823N254507M278421
1574.6H28153491M424036L668904K111316R91046J54674n51999j086294j757562l060282
1593H33047330n228817q071065j1593044j6104936k0992876k4210393k3911238j8378853
$$ plain form
1480.8 699154437 681818962 662968934 640988529 613609672 583572805 557633281 533203840
1495 533203840 506174207 480870336 460483342 445112914 435007781 434645116 444733709 459044337
1511.4 459044337 475863636 495505333 518345058 543238759 573597133 605052888 632586002
1525.6 632586002 657470822 674984217 682994545 680692136 670335710 656185508 641763866 640617430
1542 640617430 652895033 669512630 686618149 704383314 721946895 738041580 751820683 766791284
1558.3 766791284 784177721 794745564 801654220 807561576 812834740 818620563 823875070 828153491
1574.6 828153491 832577527 836246431 838357747 839348793 839503467 838951468 837865174 836107612 833047330
1593 833047330 827818513 819747448 808154404 792049468 771056592 746846199 722934961 704556108
1609.3G04556108q229971K115905J2697816K3579836K2724330J7280042J4720440J0389745
1625.6G99834251O135047L909767K630293J686692J250923J268208J528442K086639
1641.9H20330262K511800K784073L081560K140880Q89420J847506K270758O25670j358211
1660.3H35123718k479196j837849j426757l123522m791140m341364n291164o892085
1676.6H04940641p520616q701623j2724518k0107091k1381557k4386287l2335281l4450293
1692.9F43333375l4978508k8075874p787347J1691689K0035923K6074231L2054603
1707.2F62348092L0767798K6840568K1971821J7092824J3792217R332717L301978p95126
1723.5G84652889j979470K94208M030228O742239R129345R797871P514954O757200
$$ plain form
1609.3 704556108 696326137 698442042 711139858 734719694 757444024 774724066 789444506 799834251
1625.6 799834251 805969298 809879065 812509358 814196050 815446973 816715181 818243623 820330262
1641.9 820330262 822842062 825626135 828707695 830848575 831737995 833585501 835856259 836481929 835123718
1660.3 835123718 832644522 830806673 829379916 826256394 821465254 817123890 811832726 804940641
1676.6 804940641 797420025 788718402 775993884 755886793 734505236 710118949 677783668 643333375
1692.9 643333375 608354867 580278993 572491646 584183335 604219258 630293489 662348092
1707.2 662348092 693115890 719956458 741928279 759021103 772813320 782146037 785448015 784652889
1723.5 784652889 782673419 782967627 786997855 793740094 802869439 812667310 820182264 826939464
1739.8H26939464O377935N012393M197955L936947M712820N473256M542410L150582
1756.1H64343762K366484J921892J928329J923740J187623O83248O40332J047135J414656
1774.5H77457201R94564J84893k44140j36495L1233J62959p9394m19318O437P03931
1794.9H78661871M68969j27434k49029K40147N34833L39866O0200J5676K64883L26455
1815.3H80536437K53677J44959j74523n46276m28021j24872j12295J12593J78457n6506
1835.7H79783630q2671o0082m77552q81434m68433P8559P5579k22802n19335o17624
1856.1H76607835m94539k98202k39373m75585q64625q32915n5075L07262j90914p03335
1876.5H72760534p88867n84781l90053k99335k69949j05918L92616O43254L50713K6286
$$ plain form
1739.8 826939464 833317399 838329792 842527747 846464694 851177514 856650770 861193180 864343762
1756.1 864343762 866710246 868632138 870560467 872484207 873671830 874355078 874995410 876042545 877457201
1774.5 877457201 878451765 878636658 878392518 878256023 878287256 878450215 878370821 877951503 877957940 878661871
1794.9 878661871 879130840 879003406 878754377 878994524 879529357 879869223 879929423 879945099 880209982 880536437
1815.3 880536437 880790114 880935073 880760550 880214274 879786253 879661381 879549086 879661679 879840136 879783630
1835.7 879783630 879700959 879640877 879163325 878281891 877813458 877892017 877967596 877744794 877225459 876607835
1856.1 876607835 876113296 875815094 875575721 875100136 874235511 873402596 873347521 873654783 873463869 872760534
1876.5 872760534 871971667 871386886 870996833 870697498 870427549 870321631 870714247 871357501 871708214 871734500
1896.9H71734500j55151k17020j56880k26438n53071q06630o45518l42846l27230m73201
1917.3H67830515l88324k40267n6863J81318n5313n97477q72493p61867n14805l73542
1937.7H64150882l87490l40879P4625M51565L08871j22428m06921k70903J12116K55585
1958.1H63825023k7239m30703o25968m87566j11640K2829k29001l93689k23279J1146
1978.5H61329913j1563k82765n25117n00023k99871k72870m57346o84023q71003p44879
1998.8H56680453l32713j40548k64943j94013K15590M43936J79112l25919n48005l15666
2019.2H55397284n3704p9453k96652m60386l69728j05023K4259j38819l84033l73423
2039.6H53160322j11819L3260j64807m68671n32270k69770O7830J67250L8922l9637
$$ plain form
1896.9 871734500 871579349 871362329 871205449 870979011 870425940 869619310 868973792 868630946 868303716 867830515
1917.3 867830515 867442191 867201924 867145061 867326379 867271066 866673589 865801096 865039229 864524424 864150882
1937.7 864150882 863763392 863422513 863497138 863948703 864257574 864135146 863728225 863457322 863569438 863825023
1958.1 863825023 863797784 863367081 862741113 862253547 862141907 862164736 861935735 861542046 861318767 861329913
1978.5 861329913 861318350 861035585 860510468 860010445 859710574 859437704 858980358 858296335 857425332 856680453
1998.8 856680453 856347740 856207192 855942249 855748236 855963826 856407762 856586874 856260955 855712950 855397284
2019.2 855397284 855343580 855264127 854967475 854507089 854137361 854032338 854056597 853917778 853533745 853160322
2039.6 853160322 853048503 853081763 852916956 852448285 851916015 851646245 851714075 851881325 851920247 851880610
2060H51880610P6771K23934K03312k6226k47300k28524m6909J7941j54912l73841l85225
2082.5H50939631j88171m9413j44601l44753l88622k14517k1994m6850k58386l70383
2102.9H48911941k30074j1027L1472j34171l25501l05116q5950K5630j35421l59416
2123.3H47382367l83258k11239n5730r8288k80262l57687k01642L6239R0838j01448
2143.7H45819890k87652k53021q2255m530j52766l62695l79681k11895q3744j56343
2164.1H43845308l24965l22580r5487J38343J55389n6744k57551k24114m8220p510
2184.5H42801869j60694k73764j90080k801J03116J3888j68383k12968n5432R9540
2204.8H41954291K8372j69337k53379j92404r9182j17243k86758m33325m03107k73645
$$ plain form
2060 851880610 851957381 852181315 852384627 852358401 852111101 851882577 851835668 851853609 851698697 851324856 850939631
2082.5 850939631 850751460 850702047 850557446 850212693 849824071 849609554 849587560 849540710 849282324 848911941
2102.9 848911941 848681867 848670840 848702312 848568141 848242640 847937524 847851574 847877204 847741783 847382367
2123.3 847382367 846999109 846787870 846732140 846633852 846353590 845995903 845794261 845830500 845921338 845819890
2143.7 845819890 845532238 845279217 845196962 845192432 845039666 844676971 844297290 844085395 844001651 843845308
2164.1 843845308 843520343 843197763 843102276 843240619 843396008 843339264 843081713 842857599 842809379 842801869
2184.5 842801869 842641175 842367411 842177331 842174530 842277646 842291534 842123151 841910183 841854751 841954291
2204.8 841954291 841982663 841813326 841559947 841367543 841268361 841151118 840864360 840431035 840027928 839754283
2225.2H39754283k30848l43204n06878n22554l36468j40905r0897j31369j15633N543
2245.6H37341070J10626L2664k26498m26233l62515k01762k29597m06444m98951l93569
2266H34738791j61469K4676K7836m0293L3736K04802K66254O7711l74079p53403q09252
2288.5H33225310p29740p86602r78232j146972j185536j141191j248061j702428k247870
2306.8H22058678k464772k267539j852870j755536k463221l396333l423094k482355
2323.1H01952958j777828j994073k226174j469374m67121m76420j010537j189351p49052
2341.5G90593028R45151L975987M373014J83344m946768p283926o303072m295290k082705
2359.9G75158763O5565K019823L664076M707694N172014N287648N226373N143166N030334
$$ plain form
2225.2 839754283 839523435 839180231 838673353 838150799 837814331 837673426 837582529 837451160 837335527 837341070
2245.6 837341070 837451696 837484360 837257862 836831629 836469114 836267352 836037755 835631311 835132360 834738791
2266 834738791 834577322 834601998 834629834 834589541 834623277 834828079 835094333 835162044 834787965 834034562 833225310
2288.5 833225310 832495570 831708968 830730736 829583764 828398228 827257037 826008976 824306548 822058678
2306.8 822058678 819593906 817326367 815473497 813717961 811254740 807858407 804435313 801952958
2323.1 801952958 800175130 798181057 795954883 794485509 794018388 793541968 792531431 791342080 790593028
2341.5 790593028 791538179 795514166 799887180 800070524 795123756 787839830 781536758 777241468 775158763
2359.9 775158763 775224328 777244151 780908227 785615921 790787935 796075583 801301956 806445122 811475456
2378.2H11475456M705310L984034K935052J844108R26256K35259k29239m41074m37260
2396.6H24997902l82900l78251l77655l52741k84314j54614k2889O8963J48416K56896
2417H23518813L72648L78072K06471k3425j50442j42515j07586j76370l24428m10796
2437.4H23140442l88205l06070k53617l28183m68851m90903l60132k40624k45869l16083
2457.8H19741905l19004k06054m2200L7909m6611j42336q6248K8908L9518n7160j40489
2480.2H18808138j16288L338N6862o7234k33352k87950k33412j71065k22564l70264
2500.6H17166209m51326l90530k94268k87592l61443m07755l30508j42753k0981r4295
2521H14384758k28583k51353j73688j13726j74582k71260k11895l9935N6088K0862
$$ plain form
2378.2 811475456 816180766 820164800 823099852 824943960 825870216 826105475 825876236 825435162 824997902
2396.6 824997902 824615002 824236751 823859096 823506355 823222041 823067427 823044538 823113501 823261917 823518813
2417 823518813 823891461 824269533 824476004 824452579 824302137 824159622 824052036 823875666 823551238 823140442
2437.4 823140442 822752237 822446167 822192550 821864367 821395516 820904613 820544481 820303857 820057988 819741905
2457.8 819741905 819422901 819216847 819174647 819212556 819165945 819023609 818937361 818966269 819005787 818948627 818808138
2480.2 818808138 818691850 818695188 818752050 818684816 818451464 818163514 817930102 817759037 817536473 817166209
2500.6 817166209 816714883 816324353 816030085 815742493 815381050 814973295 814642787 814500034 814479053 814384758
2521 814384758 814156175 813904822 813731134 813617408 813442826 813171566 812959671 812919736 812975824 812996686
2541.4H12996686r3163j59978p0692Q9884J15514k3186j38700p9394P4685R3460p1287
2563.8H12733829k21968k04742j01864q5592j88947l04043l11137j80602n3346q6963
2584.2H10994625j84655j82033n7637J01208J15931o1810k24888k08318j17004j40488
2604.6H10034931k98322m38332m30524l15369k53915l67821n58138n82218m14490k89143
2625H06086659l61681n04195m99368l18706j05739l039k3544l4690O3419J71960J21951
2647.4H04593027q4997k52902k47717j53840j42395l15726n58019o41584n51641m51207
2667.8H01192999l96133l16262j67966P749J34706J57178R7573J05023K42054L84033
2688.2H01440954M18484L46244K69830K67804K88129K38120J02103l1114q2850r5546
$$ plain form
2541.4 812996686 812903523 812743545 812672853 812762737 812878251 812855065 812716365 812636971 812711656 812805116 812733829
2563.8 812733829 812511861 812307119 812205255 812119663 811930716 811626673 811315536 811134934 811081588 810994625
2584.2 810994625 810809970 810627937 810570300 810671508 810787439 810725629 810500741 810292423 810175419 810034931
2604.6 810034931 809736609 809298277 808867753 808552384 808298469 807930648 807372510 806790292 806375802 806086659
2625 806086659 805724978 805220783 804721415 804402709 804296970 804293931 804270387 804235697 804299116 804471076 804593027
2647.4 804593027 804508030 804255128 804007411 803853571 803711176 803395450 802837431 802195847 801644206 801192999
2667.8 801192999 800796866 800480604 800312638 800320387 800455093 800612271 800709844 800814867 801056921 801440954
2688.2 801440954 801859438 802205682 802475512 802743316 803031445 803269565 803371668 803340554 803257704 803162158
2708.6H03162158j48654k51651l51787l79622l28123k88547l14652l37065k91645j99855
2729H00270557j22189r2924j03950j19388j14501r8050j20461j96278k30491j40011
2749.4G98932314k921K0862o9976j61409j83046q3208N5492K2173j89007l56018l91007
2771.8G97594249m09901m91977n42700m69148l50535k84016k81215l43323m52697n58078
2792.2G93410659o16074o44445p31111q86738r75907q88288o21140k78950l6597K1458
2812.6G87752867k2173q9228j89960l26038m49836n09918n01334l95179j86026j6153
2833G85067022L397j05738l70562p27952r64403j072109j165330j207054j058578p24852
2853.4G77673841m07339j90675j9133J06573K07544K60472J79469N5015n0425k52008
$$ plain form
2708.6 803162158 803013504 802761853 802410066 802030444 801702321 801413774 801099122 800762057 800470412 800270557
2729 800270557 800148368 800055444 799951494 799832106 799717605 799619555 799499094 799302816 799072325 798932314
2749.4 798932314 798929393 798950255 798880279 798718870 798535824 798452616 798508108 798530281 798341274 797985256 797594249
2771.8 797594249 797184348 796692371 796149671 795680523 795329988 795045972 794764757 794421434 793968737 793410659
2792.2 793410659 792794585 792150140 791419029 790532291 789556384 788668096 788046956 787768006 787731409 787752867
2812.6 787752867 787730694 787641466 787451506 787125468 786675632 786165714 785664380 785269201 785083175 785067022
2833 785067022 785070419 784964681 784594119 783866167 782901764 781829655 780664325 779457271 778398693 777673841
2853.4 777673841 777266502 777075827 777056694 777163267 777370811 777631283 777810752 777865767 777815342 777563334
2873.8G77563334m56036m49061l00467j55270j02699j97112l31283m34697m66883l97503
2894.2G74272323m00365n75840p00534o47544n57483m79400l99589l54052l59237m16517
2914.6G69381762m66228m38690l55542k51174j41382l2425j9491k41220l81827m590
2935G67049193O58870J057804J004636O30140J51873j19448R5725O58930R99868R14991
2955.4G73102582P41660O18994M32074J79887k4259j52945l05295n63026j082301k000153
2975.8G70947218k716899j663983J579642M286409L869414J554966n5551j81258L37660
2994.2G77957618M89056J56343j03414J46210P41303R95934O00756k3783m60505o64532
3014.5G79834986n84543r7334N54263Q66533P27295L69549k1875k80261l21626k68221
$$ plain form
2873.8 777563334 777107298 776658237 776357770 776202500 776099801 775902689 775571406 775136709 774669826 774272323
2894.2 774272323 773871958 773296118 772595584 771948040 771390557 770911157 770511568 770157516 769798279 769381762
2914.6 769381762 768915534 768476844 768121302 767870128 767728746 767696321 767676830 767435610 767053783 767049193
2935 767049193 767708063 768765867 769770503 770400643 770552516 770433068 770528793 771187723 772187591 773102582
2955.4 773102582 773844242 774463236 774895310 775075197 775050938 774897993 774592698 774029672 772947371 770947218
2975.8 770947218 768230319 766566336 768145978 772432387 776301801 777856767 777801216 777619958 777957618
2994.2 777957618 778446674 778603017 778499603 778645813 779387116 780383050 780983806 780960023 780499518 779834986
3014.5 779834986 779250443 779153109 779707372 780573905 781301200 781670749 781648874 781368613 781046987 780778766
3034.9G80778766k46525k05875o9856P4208P9155o4135k25484l35038m04179m09961
3055.3G78971076m25100n04434n51284n29766m68731m73201o05643p23362p30395o39677
3075.7G73319483m79102l43919k71142k06053j50263r5070k3424Q1002L03746O38902
3096.1G72774160Q29399O62624K98500N1320P7307K58804L59356L93271L92437K18213
3116.5G76315391n5313l27468n36978n36084l83675k87831l56615m35650l41594j64867
3136.9G72889316j66953l86714n11170m71413m37379l41773j84774k59638n14865n78761
3157.3G69035876m89950m40419m29690m38869m85063n59389n84364n53548n38707n42879
3177.7G63972998n76675o20127n94497n43594n50032o26623p28667p76112p29025o45816
$$ plain form
3034.9 780778766 780532241 780326366 780256510 780330718 780409873 780345738 780120254 779785216 779381037 778971076
3055.3 778971076 778545976 778041542 777490258 776960492 776491761 776018560 775412917 774689555 773959160 773319483
3075.7 773319483 772840381 772496462 772225320 772019267 771869004 771773934 771750510 771831512 772135258 772774160
3096.1 772774160 773603559 774266183 774564683 774616003 774693310 774952114 775311470 775704741 776097178 776315391
3116.5 776315391 776260078 775932610 775395632 774859548 774475873 774188042 773831427 773395777 773054183 772889316
3136.9 772889316 772722363 772335649 771824479 771353066 770915687 770573914 770389140 770129502 769614637 769035876
3157.3 769035876 768545926 768105507 767675817 767236948 766751885 766192496 765608132 765054584 764515877 763972998
3177.7 763972998 763396323 762776196 762181699 761638105 761088073 760461450 759732783 758956671 758227646 757581830
3198.1G57581830o34551o80685o92010o54280o17802o38306p12693p59006p28607o80089
3218.5G50783801o74963p13706p67887p75516p29858o54459o33717q40247j050055
3236.9G43943393r46700p40707o61135o30677o22034p04229p54714o72042o61731p57456
3257.3G36791968p08341n80549n53012n38707m35531k92123l78012o65605q11935q05795
3277.7G31022358p47919o87897o64235o54637o51181n81741n08070o44088r32455j164377
3298G23785758j154184q36194n51164p39872j260043j590311j573801j392722j289130
3316.4G13398337j340210j407504j370013j302123j454353j737237j829148j763582
3332.7G01194167j639485j488328j579642j918972k162457k209961j996398j709282
$$ plain form
3198.1 757581830 756947279 756266594 755574584 754920304 754302502 753664196 752951503 752192497 751463890 750783801
3218.5 750783801 750108838 749395132 748627245 747851729 747121871 746467412 745833695 744993448 743943393
3236.9 743943393 742996693 742255986 741594851 740964174 740342140 739637911 738883197 738211155 737549424 736791968
3257.3 736791968 736083627 735503078 734950066 734411359 733975828 733683705 733305693 732640088 731828153 731022358
3277.7 731022358 730274439 729586542 728922307 728267670 727616489 727034748 726526678 725882590 724950135 723785758
3298 723785758 722631574 721795380 721244216 720504344 719244301 717653990 716080189 714687467 713398337
3316.4 713398337 712058127 710650623 709280610 707978487 706524134 704786897 702957749 701194167
3332.7 701194167 699554682 698066354 696486712 694567740 692405283 690195322 688198924 686489642
3349F86489642j914502k406895k487898k258300k180398k297997k346754k187729k077282
3367.4F66331887k267301k572715k590120k337933k146601k043724j947582j875699
3383.7F48550212j795709j673341j555025j566410j680196j709103j589239j480400
3400F35500789j592577j745641j637340j377105j161397j014590r29415q76189q01444
3418.4F24365091p57813p20024n82457l96371k59518k47598k15411q6308j51157l64483
3438.8F20583951l29554o5386J50144K89858M29928N23448N42223N77093O66916P36534
3459.2F24105155O81520P14838J011730J162350Q48949M16458M14788P60973J026153
3477.5F31142914J013398Q25525Q29696R82464R55879R18389J014113J022578R54628
$$ plain form
3349 686489642 684575140 682168245 679680347 677422047 675241649 672943652 670596898 668409169 666331887
3367.4 666331887 664064586 661491871 658901751 656563818 654417217 652373493 650425911 648550212
3383.7 648550212 646754503 645081162 643526137 641959727 640279531 638570428 636981189 635500789
3400 635500789 633908212 632162571 630525231 629148126 627986729 626972139 626042724 625166535 624365091
3418.4 624365091 623607278 622887254 622304797 621908426 621648908 621401310 621185899 621099591 620948434 620583951
3438.8 620583951 620254397 620189011 620339155 620629013 621058941 621582389 622124612 622701705 623368621 624105155
3459.2 624105155 624786675 625501513 626513243 627675593 628524542 628941000 629355788 630116761 631142914
3477.5 631142914 632156312 632981837 633811533 634793997 635749876 636668265 637682378 638704956 639659584
3495.9F39659584R01103R11891J007557R83536Q37863Q30888J069308J357913J285612
3514.2F48845255R84908R32633J096905J245677J151800R50456J080811J374960J478493
3532.6F59141898J461864J335740J190901J277566J374781J236081J092970J176775
3548.9F69288576J278460J326501J419723J419902J354396J294256J017510P12455
3565.2F79111779J287460K276599K187014J662374J565754J658142J711547J731575
3581.5F93192244J515567J052260J087189J826584J926542J561045J670420J965464
3597.9G05797315J924336J798749J639366J307308J349271J766503J764774J520812
3614.2G18868434J260221J166225J673758J854002J163960K85625L20912J772940K296805
$$ plain form
3495.9 639659584 640560687 641472578 642480135 643463671 644301534 645132422 646201730 647559643 648845255
3514.2 648845255 649830163 650762796 651859701 653105378 654257178 655207634 656288445 657663405 659141898
3532.6 659141898 660603762 661939502 663130403 664407969 665782750 667018831 668111801 669288576
3548.9 669288576 670567036 671893537 673313260 674733162 676087558 677381814 678399324 679111779
3565.2 679111779 680399239 682675838 684862852 686525226 688090980 689749122 691460669 693192244
3581.5 693192244 694707811 695760071 696847260 698673844 700600386 702161431 703831851 705797315
3597.9 705797315 707721651 709520400 711159766 712467074 713816345 715582848 717347622 718868434
3614.2 718868434 720128655 721294880 722968638 724822640 725986600 726272225 726593137 728366077 730662882
3632.5G30662882J822293J443625J229047J102209Q35360K05218m86016r9122J377582
3650.9G38093078J586378Q60452P71046J074970P59959K48134p6890n83350q98540
3669.2G41835237k45691m9412m28677L57271J022279Q67426N54323Q0407m90427o29306
3689.6G42873430J28150P51019N54144n36l97921k52902L32057L37303k99096o43909
3710G43381739N3882R40681O76453k29061q81612r14574n63144m3989L31283J6332
3730.4G42767990o75857n95749O72758J339853N15103p13825q16405J80781j2338l99590
3750.8G42262721M98712R31084M43280J31309K64943J23381j93178j77622r2924R8288
3771.2G44289994K90036R9600j79529k18630j31965j90616j38938J41442K23160k8015
$$ plain form
3632.5 730662882 732485175 733928800 735157847 736260056 737095416 737300634 736814618 736715496 738093078
3650.9 738093078 739679456 740539908 741310954 742385924 743145883 743394017 743317127 742733777 741835237
3669.2 741835237 741589546 741540134 741111457 741468728 742491007 743358433 743912756 743993163 743502736 742873430
3689.6 742873430 743001580 743752599 744306743 744306207 743908286 743655384 743987441 744324744 744025648 743381739
3710 743381739 743435621 744376302 745052755 744823694 743942082 743027508 742464364 742420375 742751658 742767990
3730.4 742767990 742092133 741496384 742169142 743508995 744024098 743310273 742493868 742674649 742662311 742262721
3750.8 742262721 742761433 743692517 744135797 744267106 744532049 744655430 744462252 744284630 744191706 744289994
3771.2 744289994 744580030 744679630 744500101 744281471 744149506 743958890 743819952 743961394 744184554 744156539
3791.6G44156539m64558p03156n23031m86374l40283K03908J37150J22428M78744K25664
3812G42807031n10455q53061n33700l96192M7445N21183K29418k7597j53601k80261
3832.4G40850210k79844n48780p06732j01328M74811O10530L57688k91407j225710
3850.8G39139438j667500m053J217544O01411j89662m75228j77026o7234m33087k48790
3871.2G37695813L17395M84943J78755m75169n11944p3016N3287J87516k2828k66672
3891.6G37568080R9183J57237m28617q29816o38545q0705N89192P89881M01974o2704
3912G37565160l67940m86433k60711M6671k3365k01583o3062J2517j87457j28269J63317
3934.4G36068845J37627p8976k48373l05593j46329q5354j14977K7358J11401J7762
$$ plain form
3791.6 744156539 743691981 742988825 742465794 741979420 741639137 741843045 741980195 742102623 742581367 742807031
3812 742807031 742296576 741443515 740909815 740513623 740561068 741082251 741311669 741284072 741130471 740850210
3832.4 740850210 740570366 740021586 739314854 739213526 739688337 740298867 740656555 740365148 739139438
3850.8 739139438 737471938 737467885 738685429 739286840 739097178 738621950 738444924 738377690 737944603 737695813
3871.2 737695813 738013208 738498151 738676906 738201737 737689793 737616777 737670064 737857580 737834752 737568080
3891.6 737568080 737667263 737824500 737395883 736566067 735927522 735846817 736436009 737225890 737627864 737565160
3912 737565160 737197220 736710787 736450076 736496747 736473382 736271799 736208737 736221254 736033797 735905528 736068845
3934.4 736068845 736206472 736127496 735879123 735573530 735427201 735341847 735226870 735254228 735365629 735383391
3954.8G35383391j00433r0361L278L6836l2842j42932j70231j19031p9453m3332k1756
3977.2G34623134r3043j24931l0816k7537j54614j99259j40726j00375r5486p9274
3997.6G33577073
$$ plain form
3954.8 735383391 735282958 735192597 735195875 735232711 735199869 735056937 734886706 734767675 734688222 734644890 734623134
3977.2 734623134 734530091 734405160 734374344 734346807 734192193 733992934 733852208 733751833 733656347 733577073
3997.6 733577073
##END=$$ End of the data block
