##TITLE=Manidu - 2 - Cl $$ Begin of the data block
##JCAMP-DX=5.00 $$ ACD/SpecManager v 10.08
##SPECTROMETER/DATA SYSTEM=Alpha
##DATE=22 Oct 2014 14:05:46
##DATA TYPE=INFRARED SPECTRUM
##DATA CLASS=XYDATA
##ORIGIN=
##OWNER=
##NPOINTS=1765
##FIRSTX=399.76428223
##LASTX=3997.64306641
##MAXX=3997.64306641
##MINX=399.76428223
##MAXY=0.89542168
##MINY=0.56808919
##XFACTOR=1.0000000000
##YFACTOR=1.000000000000000e-9
##FIRSTY=0.86503083
##DELTAX=2.03961372
##XUNITS=1/CM
##YUNITS=ARBITRARY UNITS
##XYDATA=(X++(Y..Y))
$$ plain form
399.8 865030825 862021565 859666646 859907568 861131072 861095607 858049929 849841833 837132156 828126073
418.1 828126073 835610390 851373196 862829506 868476510 870139122 870537519 871582091 872991562
434.4 872991562 873557925 872981846 871750176 870862365 871084213 871760666 871644735 870538473 869383097
452.8 869383097 868722260 868059933 866745949 864300489 861348212 859707177 860222459 861904502 863484144
471.2 863484144 865005672 866826653 868423164 868997633 868396878 867440820 867149651 867487788 866917729
489.5 866917729 863798261 857780635 850743651 845695496 840314269 828615963 818299353 823844790
505.8 823844790 840818286 854720891 861050785 862283409 861165047 860468805 861862719 864654601
522.1 864654601 866733968 866672277 865172863 863828301 862625539 859754145 855476677 853810549 856109202
$$ packed form
399.8H65030825l009260k354919K40922J223504l5465l045678q208096j2709677r006083
418.1H28126073P484317J5762806J1456310N647004J662612L98397J044572J409471
434.4H72991562N66363n76079j231670q87811K21848O76453j15931j106262j155376
452.8H69383097o60837o62327j313984k445460k952277j641035N15282J682043J579642
471.2H63484144J521528J820981J596511N74469o00755r56058k91169L38137n70059
489.5H66917729l119468o017626p036984n048155n381227j1698306j0316610N545437
505.8H23844790J6973496J3902605O329894J232624j118362o96242J393914K791882
522.1H64654601K079367o1691j499414j344562j202762k871394m277468j666128K298653
$$ plain form
540.5 856109202 859314799 861561894 863317609 864680827 864935458 864609718 865282178 867100060 868567050
558.9 868567050 868324697 866675615 865427077 865904033 867446244 868270218 867558837 866071641 865385234
577.2 865385234 866274059 867724419 868212759 867395461 866198361 865700662 866290271 867313027 867763877
595.6 867763877 867499232 867230058 867610276 868302941 868205428 866935015 865833580 866411030 868125319
613.9 868125319 869513392 870175302 870382011 870469213 870780945 871327400 871667504 871641755 871481001 870895207
634.3 870895207 869312286 866474450 862444818 858608723 858097851 862591922 869490147 874855518 877698600
652.7 877698600 879391432 880948305 882233202 882624269 882173598 881612897 881428778 881775141 881570041
671 881570041 879305363 875122786 872511446 874324143 878285348 880964994 881858587 881731510 881384075
$$ packed form
540.5H56109202L205597K247095J755715J363218K54631l25740O72460J817882J466990
558.9H68567050k42353j649082j248538M76956J542211Q23974p11381j487196o86407
577.2H65385234Q88825J450360M88340q17298j197100m97699N89609J022756M50850
595.6H67763877k64645k69174L80218O92665r7513j270413j101435N77450J714289
613.9H68125319J388073O61910K06709Q7202L11732N46455L40104k5749j60754n85794
634.3H70895207j582921k837836m029632l836095n10872M494071O898225N365371K843082
652.7H77698600J692832J556873J284897L91067m50671n60701j84119L46363k05100
671H81570041k264678m182577k611340J812697L961205K679646Q93593j27077l47435
$$ plain form
689.4 881384075 881125331 880018830 877609372 876309633 878188968 881658018 884647071 886371315 886298060
707.7 886298060 884285986 880048156 874502361 872939229 878051162 884031951 886309505 886693895 887360454
726.1 887360454 888246477 888180375 886280596 883266866 881483972 882299781 884147406 884523690 882488728
744.5 882488728 879045844 876720667 877605319 880852163 883745372 884947896 885061026 885199368 885817528
762.8 885817528 886490524 886743903 886590600 886322916 886080503 885707080 884922445 883583307 881486237
781.2 881486237 878219664 873050809 864520133 850478351 833446622 825059533 832000136 846836865
797.5 846836865 861426353 872333348 878327429 880810797 881019473 879306853 876041293 871422052
813.8 871422052 864466310 850721419 825038850 800408959 803843439 831477761 851201653 849898279
$$ packed form
689.4H81384075k58744j106501k409458j299739J879335L469050K989053J724244p3255
707.7H86298060k012074m237830n545795j563132N111933N980789K277554L84390O66559
726.1H87360454Q86023o6102j899779l013730j782894Q15809J847625L76284k034962
744.5H82488728l442884k325177Q84652L246844K893209J202524J13130J38342O18160
762.8H85817528O72996K53379j53303k67684k42413l73423p84635j339138k097070
781.2H81486237l266573n168855q530676j4041782j7031729q387089O940603J4836729
797.5H46836865J4589488J0906995N994081K483368K08676j712620l265560m619241
813.8H71422052o955742j3744891k5682569k4629891L434480K7634322J9723892j303374
$$ plain form
830.1 849898279 839631140 835533261 843247235 856550813 864237547 861132383 850343823 842430115
846.4 842430115 848523796 865236282 880076349 887493193 888938248 888277411 889214694 891897976
862.8 891897976 894307911 895421684 895035326 893382013 890905797 888369203 887656868 889638066 891858995
881.1 891858995 892210007 891551077 890954375 889906943 887083411 883039296 880874515 882094502 884716809
899.5 884716809 886248052 885758281 883993149 882431626 881447256 880602062 879990101 879130244 876516998
917.8 876516998 871852398 865959704 858316302 846810460 829770207 808879793 790936828 784029067
934.1 784029067 790664136 807244301 828376830 848716617 864103675 873633087 878907084 881559551
950.5 881559551 882513523 882025719 879324734 873802006 869300008 870709956 874960363 876540959 876037300
$$ packed form
830.1H49898279j0267139m097879P713974J3303578P686734l105164j0788560p913708
846.4H42430115O093681J6712486J4840067P416844J445055o60837R37283K683282
862.8H91897976K409935J113773l86358j653313k476216k536594p12335J981198K220929
881.1H91858995L51012o58930n96702j047432k823532m044115k164781J219987K622307
899.5H84716809J531243m89771j765132j561523r84370q45194o11961q59857k613246
917.8H76516998m664600n892694p643402j1505842j7040253k0890414j7942965o907761
934.1G84029067O635069J6580165K1132529K0339787J5387058R529412N273997K652467
950.5H81559551R53972m87804k700985n522728m501998J409948M250407J580596n03659
$$ plain form
968.8 876037300 875512183 875075459 875101268 875782669 876414597 876421213 875722349 874452293 872844756 871033907
989.2 871033907 868778944 865507960 860450804 852818966 842359602 830121756 818199217 808793128
1005.5 808793128 802893341 804035902 816264153 831435442 838976443 840264976 838262677 831892490
1021.8 831892490 821279109 808740854 796437562 787208855 786952555 798787892 816870272 832726538
1038.2 832726538 843187988 849354506 853222728 856065750 858169436 859229445 859040082 858175159
1054.5 858175159 857686162 857879877 857988417 857226074 855351150 852439582 848524272 843987346 839807034
1072.8 839807034 836395025 832843900 827930868 820220888 807759941 791679084 780136287 781134307
1089.2 781134307 791493833 803563416 816299915 830291629 842003465 848034501 849061906 848508298
$$ packed form
968.8H76037300n25117m36724K5809O81401O31928O616o98864j270056j607537j810849
989.2H71033907k254963l270984n057156p631838j0459364j2237846j1922539r406089
1005.5H08793128n899787J142561J2228251J5171289P541001J288533k002299o370187
1021.8H31892490j0613381j2538255j2303292r228707k56300J1835337J8082380J5856266
1038.2H32726538J0461450O166518L868222K843022K103686J060009j89363q64923
1054.5H58175159m88997J93715J08540p62343j874924k911568l915310m536926m180312
1072.8H39807034l412009l551125m913032p709980j2460947j6080857j1542797R98020
1089.2G81134307J0359526J2069583J2736499J3991714J1711836O031036J027405n53608
$$ plain form
1105.5 848508298 848958075 849675715 848302126 843589783 836115777 829128683 826699674 829517782 835562408
1123.8 835562408 842501223 848101318 851580977 853491068 854296982 854328275 854003429 853658438 853355587
1142.2 853355587 852835476 851855874 850534260 849093258 847576976 845772564 843383729 840310812 836841881
1160.5 836841881 833379507 829954624 826135874 821150541 814077377 804102004 791183710 777604043
1176.9 777604043 767523527 760980248 752750576 740135312 724158227 706192613 690066636 683108151
1193.2 683108151 690474331 708562493 727120221 739008784 744953036 748807669 753154814 759687304
1209.5 759687304 769208193 779869020 787216008 787655592 782707155 778738379 780519307 786896050
1225.8 786896050 794434369 801916480 809745908 817977846 826101840 833460093 839528501 844122052
$$ packed form
1105.5H48508298M49777P17640j373589m712343p474006o987094k429009K818108O044626
1123.8H35562408O938815N600095L479659J910091Q05914L1293l24846l44991l02851
1142.2H53355587n20111r79602j321614j441002j516282j804412k388835l072917l468931
1160.5H36841881l462374l424883l818750m985333p073164r975373j2918294j3579667
1176.9G77604043j0080516o543279q229672j2615264j5977085j7965614j6125977o958485
1193.2F83108151P366180J8088162J8557728J1888563N944252L854633M347145O532490
1209.5G59687304R520889J0660827P346988M39584m948437l968776J780928O376743
1225.8G86896050P538319P482111P829428Q231938Q123994P358253O068408M593551
$$ plain form
1242.1 844122052 847145498 848313808 847370505 844448626 840138614 835139513 830289781 826661825
1258.4 826661825 824435890 822277427 819206297 815886676 812823534 808536828 800708473 788091302
1274.8 788091302 770516336 749694109 732607484 727774978 731031716 727063239 710830510 692499876
1291.1 692499876 683225930 687944353 706176221 731628954 751324177 753304839 741743982 733364582
1307.4 733364582 735103786 740883529 745821714 750094354 755053401 761619210 770008743 779445708
1323.7 779445708 788855016 798046529 807564557 817382157 826811492 835171402 842078865 847507417
1340 847507417 851428986 854089975 855998337 857299209 857630134 856484890 853628933 849394500 844472468
1358.4 844472468 838666499 830240190 818050206 804137588 793789029 792580009 798846722 802911162
$$ packed form
1242.1H44122052L023446J168310r43303k921879m310012m999101m849732l627956
1258.4H26661825k225935k158463l071130l319621l063142m286706p828355j2617171
1274.8G88091302j7574966k0822227j7086625m832506L256738l968477j6232729j8330634
1291.1F92499876r273946M718423J8231868K5452733J9695223J980662j1560857q379400
1307.4G33364582J739204N779743M938185M272640M959047O565809Q389533R436965
1323.7G79445708R409308R191513R518028R817600R429335Q359910O907463N428552
1340H47507417L921569K660989J908362J300872L30925j145244k855957m234433m922032
1358.4H44472468n805969q426309j2189984j3912618j0348559j209020O266713M064440
$$ plain form
1374.7 802911162 793058336 770318151 753533304 758937538 779290199 799151301 812366486 818987370
1391 818987370 817880630 808612227 800737798 803865492 809362113 806348085 803645968 812386870 825963020
1409.4 825963020 835520566 840444922 843195438 845739663 849765003 854586422 859153926 863209605
1425.7 863209605 866127849 867971838 868911326 868912876 868480086 868494272 869110286 870058894 870962620 871375263
1446.1 871375263 871526420 871752560 871603072 870554030 868444860 866442740 865693092 865672350 866567671
1464.5 866567671 868130684 868883193 868382752 867632568 867498279 866773665 863442481 854650021 838502467
1482.8 838502467 821227431 814848363 823992252 837933362 846708417 853070378 860538483 867354989
1499.1 867354989 871403337 873046517 873097479 873296618 874759197 876331031 877493680 878060281 878164232
$$ packed form
1374.7H02911162r852826k2740185j6784847N404234K0352661J9861102J3215185O620884
1391H18987370j106740r268403p874429L127694N496621l014028k702117Q740902J3576150
1409.4H25963020R557546M924356K750516K544225M025340M821419M567504M055679
1425.7H63209605K918244J843989R39488J550m32790J4186O16014R48608R03726M12643
1446.1H71375263J51157K26140j49488j049042k109170k002120p49648k0742Q95321
1464.5H66567671J563013P52509n00441p50184j34289p24614l331184q792460j6147554
1482.8H38502467j7275036o379068R143889J3941110Q775055O361961P468105O816506
1499.1H67354989M048348J643180N0962J99139J462579J571834J162649N66601J03951
$$ plain form
1517.5 878164232 877956212 877875865 878254831 878592789 878646493 878242850 877348483 876530468 875978410 874892950
1537.9 874892950 873255730 872355998 872219265 872188330 871864021 871085823 869734287 867446363 863962650
1556.2 863962650 858069777 851461709 849782705 852720618 857435942 859340370 857168496 852868199
1572.6 852868199 846208394 835432231 821989834 805481434 787759900 780672669 791275918 809236288
1588.9 809236288 820672750 822677732 819006860 813312352 807614028 802165627 796304047 789012492
1605.2 789012492 779217780 767308474 756338120 748629987 741643488 731253743 720409274 715386927
1621.5 715386927 723156989 743187010 765656948 783630192 794627011 801958919 809307992 815456688
1637.8 815456688 819382310 822535515 825542092 829577506 834634781 837838829 840030134 843751192
$$ packed form
1517.5H78164232k08020q0347L78966L37958N3704m03643q94367q18015n52058j085460
1537.9H74892950j637220q99732j36733l0935l24309p78198j351536k287924l483713
1556.2H63962650n892873o608068j679004K937913M715324J904428k171874m300297
1572.6H52868199o659805j0776163j3442397j6508400j7721534p087231J0603249J7960370
1588.9H09236288J1436462K004982l670872n694508n698324n448401n861580p291555
1605.2G89012492r794712j1909306j0970354p708133o986499j0389745j0844469n022347
1621.5G15386927P770062K0030021K2469938J7973244J0996819P331908P349073O148696
1637.8H15456688L925622L153205L006577M035414N057275L204048K191305L721058
$$ plain form
1654.1 843751192 847162426 849631965 851846814 853996038 855732083 856489122 856844068 857691526 858518481
1672.5 858518481 858964682 859155595 858692288 857391238 855538428 854076326 853300989 852144897 850189567
1690.9 850189567 847435176 843162835 837734282 832737803 828538120 824896097 820223391 814107418
1707.2 814107418 806991994 798184395 787304878 774100602 757889688 741719842 726620615 708270252
1723.5 708270252 685664833 660966098 635368943 610434294 584855735 568089187 571948767
1737.8 571948767 598095775 639191329 679713309 712204397 735275090 751113236 760944366
1752 760944366 765794158 767652154 767018497 762975872 755701125 747116446 738306701 731429458 734088540
1770.4 734088540 751791120 774678826 791383982 802522779 810588717 817255914 823932290 830451429
$$ packed form
1654.1H43751192L411234K469539K214849K149224J736045P57039L54946Q47458Q26955
1672.5H58518481M46201J90913m63307j301050j852810j462102p75337j156092j955330
1690.9H50189567k754391m272341n428553m996479m199683l642023m672706o115973
1707.2H14107418p115424q807599j0879517j3204276j6210914j6169846j5099227j8350363
1723.5G08270252k2605419k4698735k5597155k4934649k5578559j6766548L859580
1737.8E71948767K6147008M1095554M0521980L2491088K3070693J5838146R831130
1752G60944366M849792J857996o33657m042625p274747q584679q809745o877243K659082
1770.4G34088540J7702580K2887706J6705156J1138797Q065938O667197O676376O519139
$$ plain form
1786.7 830451429 835685670 840236902 845136583 849215865 851849020 853917301 856144488 858644962
1803 858644962 860988557 862948000 864483416 865752697 866735637 867361546 867795110 868205607 868606210
1821.4 868606210 869021893 869602025 870117366 870614290 871246338 871773601 872160554 872540474 872734785 872584224
1841.8 872584224 872525036 872903407 873376071 873707891 873871982 873841465 873729467 873611629 873447657 873063087
1862.2 873063087 872284353 871296883 870823324 871351123 872236371 872898936 873269022 873504639 873745203 874018073
1882.6 874018073 874238849 874208033 873939574 873656392 873423278 873320937 873437464 873503149 873304963 872954071
1903 872954071 872710705 872713506 872896671 872976482 872667968 872122228 871853709 872043252 872219622 872135878 871878684
1925.4 871878684 871566534 871325016 871194959 871111989 871099651 871255040 871471047 871723354 872123301 872529805
$$ packed form
1786.7H30451429N234241M551232M899681M079282K633155K068281K227187K500474
1803H58644962K343595J959443J535416J269281R82940O25909M33564M10497M00603
1821.4H68606210M15683N80132N15341M96924O32048N27263L86953L79920J94311j50561
1841.8H72584224n9188L78371M72664L31820J64091l0517j11998j17838j63972l84570
1862.2H73063087p78734r87470m73559N27799Q85248O62565L70086K35617K40564K72870
1882.6H74018073K20776l0816k68459k83182k33114j02341J16527O5685j98186l50892
1903H72954071k43366K801J83165P9811l08514n45740k68519J89543J76370q3744k57194
1925.4H71878684l12150k41518j30057q2970j2338J55389K16007K52307L99947M06504
$$ plain form
1945.8 872529805 872757852 872807801 872756898 872702777 872714698 872761786 872738361 872557104 872256458 872022152 871986270
1968.3 871986270 872037947 872058809 872042000 871991813 871918082 871827364 871727824 871612072 871482193 871328354 871148944
1990.7 871148944 871027946 870983005 870930791 870839834 870712519 870540559 870331585 870148361 870053053 870009303
2011.1 870009303 869893670 869630039 869346857 869232357 869250298 869219780 869053721 868812323 868585765 868432939
2031.5 868432939 868386328 868381798 868292153 868084192 867865264 867760956 867765009 867715538 867470801 867059410 866677761
2053.9 866677761 866548955 866715968 867015719 867238462 867332041 867426336 867643237 867949605 868167460 868148625
2074.3 868148625 867958486 867819607 867883205 868083715 868192732 868083835 867863595 867739797 867817819 867985666
2094.7 867985666 868046284 867919147 867675662 867511392 867567480 867719233 867746651 867568851 867280781 867087424
$$ packed form
1945.8H72529805K28047M9949n0903n4121J1921M7088k3425j81257l00646k34306l5882
1968.3H71986270N1677K0862j6809n0187p3731r0718r9540j15752j29879j53839j79410
1990.7H71148944j20998m4941n2214r0957j27315j71960k08974j83224r5308m3750
2011.1H70009303j15633k63631k83182j14500J7941l0518j66059k41398k26558j52826
2031.5H68432939m6611m530q9645k07961k18928j04308M053m9471k44737m11391l81649
2053.9H66677761j28806J67013K99751K22743R3579R4295K16901L06368K17855j8835
2074.3H68148625j90139j38879O3598K00510J09017j08897k20240j23798P8022J67847
2094.7H67985666O0618j27137k43485j64270N6088J51753K7418j77800k88070j93357
$$ plain form
2115.1 867087424 867089868 867158890 867120504 866957664 866774559 866686285 866732240 866829932 866842330 866740406 866633296
2137.5 866633296 866650224 866807282 866970778 866992295 866861165 866698980 866652429 866766453 866915464 866974950
2157.9 866974950 866947174 866897404 866885006 866913795 866953611 866979182 866963506 866897106 866828322 866802096 866806328 866795838
2182.4 866795838 866728604 866598666 866444647 866322577 866250098 866192341 866102815 865954757 865771472 865629852
2202.8 865629852 865575612 865572870 865538061 865427732 865277350 865140676 865064442 865041375 864986360 864845216 864672422
2225.2 864672422 864574194 864602506 864689708 864712119 864601851 864413261 864290297 864283144 864279330 864152193 863886595
2247.7 863886595 863584459 863388538 863356292 863402784 863397360 863299549 863198757 863189816 863244772 863251328 863122106
2270.1 863122106 862893999 862717390 862674117 862687767 862631679 862451971 862199485 862022579 862023950 862121344 862152874
$$ packed form
2115.1H67087424K444O9022l8386j62840j83105q8274M5955R7692J2398j01924j07110
2137.5H66633296J6928J57058J63496K1517j31130j62185m6551J14024J49011N9486
2157.9H66974950k7776m9770j2398K8789L9816K5571j5676o6400o8784k6226M232j0490
2182.4H66795838o7234j29938j54019j22070p2479n7757q9526j48058j83285j41620
2202.8H65629852n4240k742l4809j10329j50382j36674p6234k3067n5015j41144j72794
2225.2H64672422r8228K8312Q7202K2411j10268j88590j22964p153l814j27137k65598
2247.7H63886595l02136j95921l2246M6492n424r7811j00792q941N4956O556j29222
2270.1H63122106k28107j76609m3273J3650n6088j79708k52486j76906J371R7394L1530
$$ plain form
2292.5 862152874 862035692 861811101 861602247 861492813 861429393 861292124 861030757 860713780 860482693 860427558
2312.9 860427558 860481262 860492468 860403657 860292971 860296667 860413849 860474408 860410094 860286891 860165477 860107660
2335.4 860107660 860110641 860123694 860158145 860362828 860677481 860610187 860133827 859640241 859327197 859164774
2355.8 859164774 859117389 859108090 859070241 859000146 858971357 859060347 859256327 859470546 859564781 859513700 859438777
2378.2 859438777 859420836 859436572 859461844 859456956 859373987 859270155 859226882 859204471 859123588 858999908 858897507
2400.6 858897507 858834982 858815551 858835697 858833075 858764827 858685315 858661294 858689666 858704686 858634174 858481526
2423.1 858481526 858334124 858261883 858273327 858301520 858250439 858119309 857999444 857960820 857976019 857945561 857806802
2445.5 857806802 857609391 857452989 857390702 857365847 857262135 857057512 856828332 856659591 856595278 856577754
$$ packed form
2292.5H62152874j17182k24591k08854j09434o3420j37269k61367l16977k31087n5135
2312.9H60427558N3704J1206q8811j10686L696J17182O0559o4314j23203j21414n7817
2335.4H60107660K981J3053L4451K04683L14653o7294m76360m93586l13044j62423
2355.8H59164774m7385r299l7849p0095k8789Q8990J95980K14219R4235n1081p4923
2378.2H59438777j7941J5736K5272m888q2969j03832m3273k2411q0883j23680j02401
2400.6H58897507o2525j9431K0146k622o8248p9512k4021K8372J5020p0512j52648
2423.1H58481526j47402p2241J1444K8193n1081j31130j19865l8624J5199l0458j38759
2445.5H57806802j97411j56402o2287k4855j03712k04623k29180j68741o4313j7524
$$ plain form
2465.9 856577754 856466234 856203556 855912149 855768383 855787694 855820596 855758071 855618477 855478168 855392516
2486.3 855392516 855341911 855259240 855132759 855008602 854933202 854922295 854941666 854934573 854846954 854694784 854581118
2508.7 854581118 854562461 854594529 854601860 854526818 854416728 854386151 854422569 854430676 854364395 854216039 854061782
2531.2 854061782 853987813 853950858 853861868 853708625 853554070 853452623 853398204 853343248 853241682 853099287
2551.6 853099287 852960110 852846503 852728248 852543175 852277696 852035940 851961672 852077782 852265000 852401733
2572 852401733 852437615 852387488 852325737 852293670 852243245 852103233 851898670 851745605 851701617 851746082 851783633
2594.4 851783633 851703584 851529241 851378918 851332664 851363122 851360679 851287901 851207793 851171255 851173520 851141691
2616.8 851141691 851019382 850848615 850714505 850662947 850632250 850545406 850401461 850234926 850114882 850091338
$$ packed form
2465.9H56577754j11520k62678k91407j43766J9311L2902o2525j39594j40309q5652
2486.3H55392516n0605q2671j26481j24157p5400j0907J9371p093q7619j52170j13666
2508.7H54581118j8657L2068P331p5042j10090l0577L6418Q107o6281j48356j54257
2531.2H54061782p3969l6955q8990j53243j54555j01447n4419n4956j01566j42395
2551.6H53099287j39177j13607j18255j85073k65479k41756p4268J16110J87218J36733
2572H52401733L5882n0127o1751l2067n0425j40012k04563j53065m3988M4465L7551
2594.4H51783633q0049j74343j50323m6254L0458k443p2778q0108l6538K265l1829
2616.8H51141691j22309j70767j34110n1558l0697q6844j43945j66535j20044k3544
$$ plain form
2637.2 850091338 850086391 850008130 849863052 849684894 849528313 849449277 849419832 849358678 849227667 849077702 848975599
2659.7 848975599 848911941 848838091 848748684 848653972 848574817 848559141 848592401 848598123 848541319 848435044 848304808
2682.1 848304808 848192334 848102987 847994924 847873330 847767353 847685695 847639382 847601235 847516477 847403467
2702.5 847403467 847331285 847309709 847271860 847142041 846940398 846782029 846733212 846752942 846747041 846678853 846606672
2724.9 846606672 846526325 846397936 846292317 846226573 846131861 845976353 845792413 845665812 845605910 845541358
2745.3 845541358 845422268 845230877 845014274 844858587 844762087 844652355 844536543 844486594 844501495 844483495
2765.7 844483495 844366491 844175160 844033182 844058633 844144881 844103277 843880057 843533933 843227565 843167841
2786.1 843167841 843351007 843447387 843249083 842957079 842814684 842807531 842773378 842631638 842409253 842210650
$$ packed form
2637.2H50091338m947p8261j45078j78158j56581p9036k9445o1154j31011j49965j02103
2659.7H48975599o3658p3850q9407r4712p9155j5676L3260N722n6804j06275j30236
2682.1H48304808j12474q9347j08063j21594j05977q1658m6313l8147q4758j13010
2702.5H47403467p2182k1576l7849j29819k01643j58369m8817J9730n901o8188p2181
2724.9H46606672q0347j28389j05619o5744r4712j55508j83940j26601n9902o4552
2745.3H45541358j19090j91391k16603j55687r6500j09732j15812m9949J4901j8000
2765.7H44483495j17004j91331j41978K5451Q6248m1604k23220l46124l06368n9724
2786.1H43167841J83166R6380j98304k92004j42395p153l4153j41740k22385j98603
$$ plain form
2806.5 842210650 842160940 842213154 842202127 842034400 841753185 841519058 841436982 841456175 841432631 841247797 840927184
2828.9 840927184 840637624 840529144 840578377 840593934 840305924 839697480 839131296 838823497 838600457 838191092
2849.3 838191092 837536991 836793840 836029291 835087538 833687067 831959367 830873609 831214488 832507968
2867.7 832507968 833873987 834935188 835454941 835415006 835273027 835331082 835472107 835537910 835462749 835260808
2888.1 835260808 835025668 834890366 834876060 834745765 834323287 833788693 833311200 832794845 832203507 831744850
2908.5 831744850 831593812 831662059 831741333 831721663 831582189 831299305 830982387 830826581 830888808 831007898
2928.9 831007898 830855787 830345213 829717636 829118669 828534484 828017831 827616990 827225327 826833308 826740026
2949.3 826740026 827161789 827784479 828223586 828524530 828836501 829175174 829418898 829481840 829454184 829440534
$$ packed form
2806.5H42210650m9710N2214j1027j67727k81215k34127q2076J9193k3544j84834l20613
2828.9H40927184k89560j08480M9233J5557k88010o08444n66184l07799k23040m09365
2849.3H38191092o54101p43151p64549r41753j400471j727700j085758L40879J293480
2867.7H32507968J366019J061201N19753l9935j41979N8055J41025O5803p5161k01941
2888.1H35260808k35140j35302j4306j30295m22478n34594m77493n16355n91338m58657
2908.5H31744850j51038O8247P9274j9670j39474k82884l16918j55806O2227J19090
2928.9H31007898j52111n10574o27577n98967n84185n16653m00841l91663l92019r3282
2949.3H26740026M21763O22690M39107L00944L11971L38673K43724O2942k7656j3650
$$ plain form
2969.7 829440534 829470754 829396725 829005837 828283727 827055573 824615598 820398211 815933347 815252841
2988 815252841 819767594 825267732 827919841 828138649 827338278 825894892 823778093 820783377 817136109
3006.4 817136109 814588904 815397918 819427788 824044466 827247322 828958094 829810739 830270171 830446601
3024.7 830446601 830339074 830210447 830324888 830601215 830714643 830536604 830380738 830427408 830484271 830364883
3045.1 830364883 830083013 829801559 829502583 829102755 828718066 828369319 828043818 827904463 828003585 828206718
3065.5 828206718 828274608 828031838 827605784 827244878 827122927 827172697 827062845 826694369 826227665 825705111
3085.9 825705111 825224459 824855804 824481070 824117243 823834836 823527336 822997808 822097063 820921361
3104.3 820921361 819770217 818946004 818754435 819450855 820774138 821924031 822426021 822351038 821929514
$$ packed form
2969.7H29440534L0220p4029l90888p22110j228154k439975m217387m464864o80506
2988H15252841M514753N500138K652109K18808q00371j443386k116799k994716l647268
3006.4H17136109k547205Q09014M029870M616678L202856J710772Q52645M59432J76430
3024.7H30446601j07527j28627J14441K76327J13428j78039j55866M6670N6863j19388
3045.1H30364883k81870k81454k98976l99828l84689l48747l25501j39355R9122K03133
3065.5H28206718O7890k42770m26054l60906j21951M9770j09852l68476m66704n22554
3085.9H25705111m80652l68655l74734l63827k82407l07500n29528r00745j175702
3104.3H20921361j151144q24213j91569O96420J323283J149893N01990p4983m21524
$$ plain form
3122.6 821929514 821546257 821509302 821668386 821653903 821410537 821187854 821163476 821158230 820826411 820197523
3143 820197523 819634080 819331646 819249630 819248199 818999290 818378091 817710400 817191184 816729903 816238999
3163.4 816238999 815744996 815314889 814932585 814521909 814017475 813410163 812775731 812244952 811825633 811358869
3183.8 811358869 810772717 810101569 809357047 808628261 808024824 807498753 806954622 806367159 805758893 805193722
3204.2 805193722 804662645 804079592 803439200 802750111 802041948 801412880 800858140 800233364 799495995 798753858
3224.6 798753858 798032522 797333598 796744049 796206951 795484304 794546962 793644190 792908370 792278826 791693807
3245 791693807 791050136 790238082 789372683 788655877 788064480 787425816 786697567 785969436 785324216 784819067
3265.4 784819067 784478486 784191906 783682764 782918215 782150388 781464994 780796468 780084968 779327512 778582096
$$ packed form
3122.6H21929514l83257l6955J59084j4483k43366k22683k4378n246l31819o28888
3143H20197523n63443l02434q2016j431k48909o21199o67691n19216m61281m90904
3163.4H16238999m94003m30107l82304m10676n04434o07312o34432n30779m19319m66764
3183.8H11358869n86152o71148p44522p28786o03437n26071n44131n87463o08266n65171
3204.2H05193722n31077n83053o40392o89089p08163o29068n54740o24776p37369p42137
3224.6G98753858p21336o98924n89549n37098p22647r37342r02772p35820o29544n85019
3245G91693807o43671q12054q65399p16806n91397o38664p28249p28131o45220n05149
3265.4G84819067l40581k86580n09142p64549p67827o85394o68526p11500p57456p45416
$$ plain form
3285.8 778582096 777930498 777422249 776906431 776178062 775235593 774152696 773070395 772232056 771617770
3304.2 771617770 770809591 769510269 767898142 766291499 764808297 763397396 761985660 760535657
3320.5 760535657 759105802 757706046 756085038 754171073 752245784 750432849 748717546 747104764
3336.8 747104764 745333910 743229926 740992486 738738894 736590564 734646380 732539713 730023682
3353.1 730023682 727431059 725026727 722745359 720405340 718000591 715781629 713708997 711364090
3369.4 711364090 708586156 705779374 703338146 701159179 699030399 696907818 694837868 692936242
3385.7 692936242 691366613 690138876 688847244 687163532 685424268 684058368 682907820 681488693
3402.1 681488693 679767191 678206682 676969051 675843656 674718380 673547447 672349632 671302676
$$ packed form
3285.8G78582096o51598n08249n15818p28369r42469j082897j082301q38339o14286
3304.2G71617770q08179j299322j612127j606643j483202j410901j411736j450003
3320.5G60535657j429855j399756j621008j913965j925289j812935j715303j612782
3336.8G47104764j770854k103984k237440k253592k148330j944184k106667k516031
3353.1G30023682k592623k404332k281368k340019k404749k218962k072632k344907
3369.4G11364090k777934k806782k441228k178967k128780k122581k069950j901626
3385.7F92936242j569629j227737j291632j683712j739264j365900j150548j419127
3402.1F81488693j721502j560509j237631j125395j125276j170933j197815j046956
$$ plain form
3418.4 671302676 670459032 669713318 669091702 668681741 668414116 668133259 667887509 667780042 667654395 667380631
3438.8 667380631 667135477 667068124 667190254 667506576 667887509 668251097 668654978 669139564 669765532 670587897
3459.2 670587897 671549380 672566593 673624873 674654245 675511837 676213205 676929474 677676558 678381443
3477.5 678381443 679130673 680084050 681267083 682590306 683925509 685172975 686368108 687598586 688898444
3495.9 688898444 690127194 691269457 692537665 693791389 694846332 695977211 697344303 698810041
3512.2 698810041 700158179 701293647 702378392 703609347 705074906 706545770 707843840 709222376
3528.5 709222376 710749865 712290823 713897109 715499282 716896713 718195736 719591677 721148670
3544.8 721148670 722699642 724016368 725330651 726837456 728337824 729799688 731348395 732781887
$$ packed form
3418.4F71302676q43644p45714o21616m09961k67625k80857k45750j07467j25647k73764
3438.8F67380631k45154o7353J22130L16322L80933L63588M03881M84586O25968Q22365
3459.2F70587897R61483J017213J058280J029372Q57592P01368P16269P47084P04885
3477.5F78381443P49230R53377J183033J323223J335203J247466J195133J230478J299858
3495.9F88898444J228750J142263J268208J253724J054943J130879J367092J465738
3512.2F98810041J348138J135468J084745J230955J465559J470864J298070J378536
3528.5G09222376J527489J540958J606286J602173J397431J299023J395941J556993
3544.8G21148670J550972J316726J314283J506805J500368J461864J548707J433492
$$ plain form
3561.1 732781887 733835518 735125244 737452149 739903927 741605520 743102312 744823754 746719897
3577.5 746719897 748721182 750634432 752228975 753951609 756286025 758463681 760150671 762042940
3593.8 762042940 764213264 766332865 768445432 770406365 771888316 773226321 774984956 776887596
3610.1 776887596 778667092 780313671 781754375 783782601 786279023 787763655 788047731 788382113 790418088
3628.5 790418088 792918622 794197559 795215130 796218157 797154307 798010230 798283935 797876954 797926188
3646.8 797926188 799883425 802112818 802549481 802921474 804162621 805076897 805375099 805295467 804714978
3665.2 804714978 804099917 804340363 804522693 804277956 805285275 806499839 806827426 806962729 806704879
3683.5 806704879 806215525 806561768 807824671 808573604 808708847 808732808 808608472 808609724 809110105 809307575
$$ packed form
3561.1G32781887J053631J289726K326905K451778J701593J496792J721442J896143
3577.5G46719897K001285J913250J594543J722634K334416K177656J686990J892269
3593.8G62042940K170324K119601K112567J960933J481951J338005J758635J902640
3610.1G76887596J779496J646579J440704K028226K496422J484632K84076L34382K035975
3628.5G90418088K500534J278937J017571J003027R36150Q55923K73705m06981M9234
3646.8G97926188J957237K229393M36663L71993J241147R14276K98202p9632n80489
3665.2H04714978o15061K40446J82330k44737J007319J214564L27587J35303k57850
3683.5H06704879m89354L46243J262903P48933J35243K3961j24336J252N00381J97470
$$ plain form
3703.9 809307575 808712125 808017194 808198869 809307873 809782326 809474170 809100032 808843434 808703005
3722.3 808703005 808776438 808908463 808459342 807610333 807197213 807794809 808910251 808863461 807538867 806919217
3742.7 806919217 807685375 807501495 807085872 808284461 809403718 809236884 808964610 809302986 809517145
3761 809517145 809279919 809121609 809117198 809514821 810007215 809892416 809436083 809289575 809607685 809658647
3781.4 809658647 809458733 809507489 809619486 809595108 809225976 808624983 808198035 807656229 807535708 808233798
3801.8 808233798 808266222 808349788 808972955 808729589 807757676 807237864 807331920 806958437 807135940 807994604
3822.2 807994604 807986438 807709873 807396591 807004929 806687891 806355894 806445777 806914687 807141185 807407737
3842.6 807407737 807610035 807010770 805530488 804259956 805204332 807087243 806990683 806187272 805675507
$$ packed form
3703.9H09307575n95450o94931J81675J109004M74453l08156l74138k56598j40429
3722.3H08703005P3433J32025m49121q49009m13120N97596J115442m6790j324594o19650
3742.7H06919217P66158j83880m15623J198589J119257j66834k72274L38376K14159
3761H09517145k37226j58310m411L97623M92394j14799m56333j46508L18110N0962
3781.4H09658647j99914M8756J11997k4378l69132o00993m26948n41806j20521O98090
3801.8H08233798L2424Q3566O23167k43366r71913n19812R4056l73483J77503Q58664
3822.2H07994604q166k76565l13282l91662l17038l31997Q9883M68910K26498K66552
3842.6H07407737K02298n99265j480282j270532R44376J882911r6560q03411n11765
$$ plain form
3861 805675507 805667400 805656910 805199921 805253386 805734992 805965960 805915713 805406451 805218816 805271924 805201709
3883.4 805201709 805553913 805448472 805107594 805509567 805577517 804783762 804054797 803848565 804158330 804919839
3903.8 804919839 805480242 805481970 805324793 805028617 804585159 804463863 804661512 804630995 804433525 804466605
3924.2 804466605 804457009 804159224 804069221 804388285 804597259 804437995 804084480 803843379 803872645 803856730
3944.6 803856730 803782403 803899348 804021001 804005682 803977430 803962409 803899825 803858042 803889334 803895652 803829789
3967 803829789 803749979 803692698 803683579 803712487 803663731 803525448 803482473 803547263 803495169 803320229 803187549
3989.5 803187549 803096592 803013146 802957952 802893460
3997.6 802893460
$$ packed form
3861H05675507q107j0490m56989N3465M81606K30968n0247n09262j87635N3108p0215
3883.4H05201709L52204j05441l40878M01973O7950p93755p28965k06232L09765P61509
3903.8H04919839N60403J728j57177k96176m43458j21296J97649l0517j97470L3080
3924.2H04466605r596k97785r0003L19064K08974j59264l53515k41101K9266j5915
3944.6H03856730p4327J16945J21653j5319k8252j5021o2584m1783L1292O318o5863
3967H03829789p9810n7281r119K8908m8756j38283m2975O4790n2094j74940j32680
3989.5H03187549r0957q3446n5194o4492
3997.6H02893460
##END=$$ End of the data block
