##TITLE=Manidu - 1 - benzaldeido $$ Begin of the data block
##JCAMP-DX=5.00 $$ ACD/SpecManager v 10.08
##SPECTROMETER/DATA SYSTEM=Alpha
##DATE=22 Oct 2014 14:05:46
##DATA TYPE=INFRARED SPECTRUM
##DATA CLASS=XYDATA
##ORIGIN=
##OWNER=
##NPOINTS=1765
##FIRSTX=399.76428223
##LASTX=3997.64306641
##MAXX=3997.64306641
##MINX=399.76428223
##MAXY=0.88762671
##MINY=0.16562091
##XFACTOR=1.0000000000
##YFACTOR=1.000000000000000e-9
##FIRSTY=0.86925799
##DELTAX=2.03961372
##XUNITS=1/CM
##YUNITS=ARBITRARY UNITS
##XYDATA=(X++(Y..Y))
$$ plain form
399.8 869257987 868039727 862407207 861368179 866727650 871071279 868550539 862818360 860903025
416.1 860903025 864108145 866447568 862839103 857897699 857282877 858784676 854710639 842004359
432.4 842004359 824460208 808362365 799155295 795337856 792325497 792710960 797781646 795255184
448.7 795255184 773722172 746643007 744027793 774422646 812783301 831892014 833875000 832137704
465 832137704 836205781 844769120 850296497 850875556 849984467 848691463 846521139 844596386 843650877
483.4 843650877 843546867 843016624 839923620 836619020 838085592 844256759 851841271 857276559 858398139
501.7 858398139 857183635 856816590 857238650 856399834 853600681 850370765 848145425 847299516 847896516
520.1 847896516 849863589 853028476 856856167 859605372 859339535 856162369 851792455 847111046 838082373
$$ packed form
399.8H69257987j218260n632520j039028N359471M343629k520740n732179j915335
416.1H60903025L205120K339423l608465m941404o14822J501799m074037j2706280
432.4H42004359j7544151j6097843r207070l817439l012359L85463N070686k526462
448.7G95255184k1533012k7079165k615214L0394853L8360655J9108713J982986j737296
465H32137704M068077Q563339N527377N79059q91089j293004k170324j924753r45509
483.4H43650877j04010n30243l093004l304600J466572O171167P584512N435288J121580
501.7H58398139j214504l67045M22060q38816k799153l229916k225340q45909N97000
520.1H47896516J967073L164887L827691K749205k65837l177166m369914m681409r028673
$$ plain form
538.5 838082373 813709140 767237902 726368308 737582445 791070879 835218072 854045570
552.7 854045570 861048400 864683867 866197407 866045535 865816295 866527736 867483199 867418647 866413653
571.1 866413653 865565777 865004122 863621712 861415327 859493494 858316898 858516335 860199749 861086547
589.4 861086547 859883666 858629048 858531356 856830001 850629032 844474733 846705556 855938196 863138437
607.8 863138437 864905119 864386022 863820136 862762630 861786544 861773789 861519873 859370172 852773309
626.2 852773309 840735435 829816341 829119027 837491155 844691813 843871474 835500240 825798988
642.5 825798988 823621273 829828799 835368395 836432636 839287877 848363876 859924138 867586613
658.8 867586613 870203137 871705949 873932362 874322176 870269656 866237760 864903390 864823580 861403883
$$ packed form
538.5H38082373k4373233m6471238m0869594J1214137N3488434M4147193J8827498
552.7H54045570P002830L635467J513540j51872k29240P11441R55463o4552j004994
571.1H66413653q47876n61655j382410k206385j921833j176596J99437J683414Q86798
589.4H61086547j202881j254618r7692j701355o200969o154299K230823R232640P200241
607.8H63138437J766682n19097n65886j057506r76086j2755k53916k149701o596863
626.2H52773309j2037874j0919094o97314Q372128P200658q20339q371234r701252
642.5H25798988k177715O207526N539596J064241K855241R075999J1560262P662475
658.8H67586613K616524J502812K226413L89814m052520m031896j334370p9810l419697
$$ plain form
677.2 861403883 849993706 830675602 806301296 782937944 770636201 773341596 780630171 774127841
693.5 774127841 748963416 729264915 736915350 759113312 769157231 751002550 702303946 648329258
709.8 648329258 638052583 687687814 758547604 810743809 836893260 846995652 852576435 858668029
726.1 858668029 862219632 858555555 848688543 840162933 840966344 850474358 859825552 864822924 869791567
744.5 869791567 877250016 883074045 883263171 880293608 879848838 882878423 883882284 878074169 867574573
762.8 867574573 857811749 848230004 829958439 798034787 770533264 777554691 816863596 854351580
779.1 854351580 871051371 874277890 876056135 880150259 881697595 875334620 862525523 849266112
795.4 849266112 837906241 825822115 816885829 822287321 839787006 853552401 856801510 854564786
$$ packed form
677.2H61403883j1410177j9318104k4374306k3363352j2301743K705395P288575o502330
693.5G74127841k5164425j9698501P650435K2197962J0043919j8154681m8698604n3974688
709.8F48329258j0276675M9635231P0859790N2196205K6149451J0102392N580783O091594
726.1H58668029L551603l664077r867012q525610Q03411R508014R351194M997372M968643
744.5H69791567P458449N824029J89126k969563m44770L029585J003861n808115j0499596
762.8H67574573r762824r581745j8271565l1923652k7501523P021427L9308905L7487984
779.1H54351580J6699791L226519J778245M094124J547336o362975j2809097j3259411
795.4H49266112j1359871j2084126q936286N401492J7499685J3765395L249109k236724
$$ plain form
811.8 854564786 851710737 847913086 842783928 841089308 847409844 859005213 871015370 881492376
828.1 881492376 886999726 884148657 874860108 863850117 853734195 847688556 847350419 849353909
844.4 849353909 852385521 857236683 859502494 849459708 816934943 769944727 752398670 787095308
860.7 787095308 829120696 836546361 809677422 755426526 703289509 708209693 769333839 829816878
877 829816878 863622189 878761590 881088197 874881089 865764618 852429748 826039076 792125165
893.4 792125165 775967002 784990668 802423060 820607245 835099578 833716869 811869085 780319810
909.7 780319810 759782195 758617401 767555237 776788890 778908730 775785804 779546440 793383539
926 793383539 809577167 822414100 830762506 834669173 836606801 841610551 851501822 861382782
$$ packed form
811.8H54564786k854049l797651n129158j694620O320536J1595369J2010157J0477006
828.1H81492376N507350k851069r288549j1009991j0115922o045639l38137K003490
844.4H49353909L031612M851162K265811j0042786l2524765m6990216j7546057L4696638
860.7G87095308M2025388P425665k6868939n4250896n2137017M920184O1124146O0483039
877H29816878L3805311J5139401K326607o207108r116471j3334870k6390672l3913911
893.4G92125165j6158163R023666J7432392J8184185J4492333j382709k1847784l1549275
909.7G80319810k0537615j164794Q937836R233653K119840l122926L760636J3837099
926G93383539J6193628J2836933Q348406L906667J937628N003750R891271R880960
$$ plain form
942.3 861382782 864020526 856781125 844313741 838116825 844873071 854586720 855775714 851285815
958.6 851285815 846905828 839691520 822687447 794742107 767182112 758744001 775285423 801177561
974.9 801177561 819772661 829142809 833813190 835892200 836465955 835711420 832978964 828977108 821622908
993.3 821622908 805168152 780565977 758636355 743217885 724337816 696615100 669067025
1007.6 669067025 653288901 645235598 629666626 606283963 587913394 574796796 559293687
1021.8 559293687 554480970 584235966 643416882 702972651 747144818 778086722 798690856
1036.1 798690856 809282959 813084424 814893663 814192593 804074585 781059563 756716728 749158442
1052.4 749158442 756493270 756548882 734439135 692736983 646900833 623237073 637970746 672760963
$$ packed form
942.3H61382782K637744p239401j2467384o196916O756246R713649J188994m489899
958.6H51285815m379987p214308j7004073k7945340k7559995q438111J6541422K5892138
974.9H01177561J8595100R370148M670381K079010N73755p54535k732456m001856p354200
993.3H21622908j6454756k4602175k1929622j5418470j8880069k7722716k7548075
1007.6F69067025j5778124q053303j5568972k3382663j8370569j3116598j5503109
1021.8E59293687m812717K9754996N9180916N9555769M4172167L0941904K0604134
1036.1G98690856J0592103L801465J809239p01070j0118008k3015022k4342835p558286
1052.4G49158442P334828N5612k2109747m1702152m5836150k3663760J4733673L4790217
$$ plain form
1068.8 672760963 697222412 705397069 705149472 695705414 681992531 685828805 717737079 760881960
1085.1 760881960 794530809 812637329 819808364 822570980 823556960 820422113 810196459 793359876
1101.4 793359876 772988737 752481818 735686779 723496914 711136341 699808300 702246249
1115.7 702246249 723984122 753824890 779527128 798798025 813864172 824916720 830833256
1129.9 830833256 832621813 833585620 835793614 837771654 836881340 833184063 829411864 827007890 823509932
1148.3 823509932 815974057 806664944 799843669 795234203 789964497 782114685 771356165 758270562
1164.6 758270562 741979301 719408929 688899636 655322611 627821445 608319998 589191616
1178.9 589191616 565370440 537291825 504359186 471073002 452169269 450807631 447975397 430608004
$$ packed form
1068.8F72760963K4461449Q174657k47597r444058j3712883L836274L1908274M3144881
1085.1G60881960L3648849J8106520P171035K762616R85980l134847j0225654j6836583
1101.4G93359876k0371139k0506919j6795039j2189865j2360573j1328041K437949
1115.7G02246249K1737873K9840768K5702238J9270897J5066147J1052548N916536
1129.9H30833256J788557R63807K207994J978040q90314l697277l772199k403974l497958
1148.3H23509932p535875r309113o821275m609466n269706p849812j0758520j3085603
1164.6G58270562j6291261k2570372l0509293l3577025k7501166j9501447j9128382
1178.9E89191616k3821176k8078615l2932639l3286184j8903733j361638k832234j7367393
$$ plain form
1195.2 430608004 405381262 382906109 369404346 369263113 384036273 411172599 447411269 488191247
1211.5 488191247 525523245 553796947 573462546 586423695 594255924 599308729 602233350 600550890
1227.9 600550890 593029797 585317612 586620808 598902762 615799129 632224202 647969842 663282931
1244.2 663282931 675023556 678494871 671616495 657141685 641218901 624990404 599733770 558968604
1260.5 558968604 515787721 498026460 521048605 570163846 615521073 638340533 636815608
1274.8 636815608 616471708 583167195 542626619 501176655 464745641 437401891 422208548
1289 422208548 418855518 419430614 413598239 397787154 375724941 352291554 329151630 305763692
1305.4 305763692 283481479 265214920 252539217 246903300 251898229 270382136 300706923 337597013
$$ packed form
1195.2D30608004k5226742k2475153j3501763j41233J4773160K7136326L6238670M0779978
1211.5D88191247L7331998K8273702J9665599J2961149P832229N052805K924621j682460
1227.9F00550890p521093p712185J303196J2281954J6896367J6425073J5745640J5313089
1244.2F63282931J1740625L471315o878376j4474810j5922784j6228497k5256634m0765166
1260.5E58968604m3180883j7761261K3022145M9115241M5357227K2819460j524925
1274.8F36815608k0343900l3304513m0540576m1449964l6431014k7343750j5193343
1289D22208548l353030N75096n832375j5811085k2062213k3433387k3139924k3387938
1305.4C05763692k2282213j8266559j2675703n635917M994929J8483907L0324787L6890090
$$ plain form
1321.7 337597013 377130419 418650180 462421924 507698238 551658630 591057181 622456908
1336 622456908 640310645 641625702 638182759 647262156 669867277 694706500 714680791 729494035
1352.3 729494035 738922954 741160691 736305892 729318500 727519810 731052518 730425596 720439434
1368.6 720439434 709658086 707343757 702100873 674057841 627627790 576705456 531854391 517703235
1384.9 517703235 551235497 589490294 581694067 552978992 558218181 610879540 681691408 737508059
1401.2 737508059 768532634 787333250 801063538 811507165 819885790 826576710 831686318 835769951
1417.5 835769951 839417517 841538966 841521800 839715123 836127579 831164062 827771425 827666581 830158174
1435.9 830158174 833505630 834628761 831459820 822698534 808574796 793165982 781973720 772105098
$$ packed form
1321.7C37597013L9533406M1519761M3771744M5276314M3960392L9398551L1399727
1336F22456908J7853737J315057l442943R079397K2605121K4839223J9974291J4813244
1352.3G29494035R428919K237737m854799o987392j798690L532708o26922r986162
1368.6G20439434j0781348k314329n242884k8043032m6430051n0922334m4851065j4151156
1384.9E17703235L3532262L8254797p796227k8715075N239189N2661359P0811868N5816651
1401.2G37508059L1024575J8800616J3730288J0443627Q378625O690920N109608M083633
1417.5H35769951L647566K121449j7166j806677l587544m963517l392637j04844K491593
1435.9H30158174L347456J123131l168941q761286j4123738j5408814j1192262r868622
$$ plain form
1452.2 772105098 761516690 763282299 788204610 809874654 819778442 825622618 831920564 839068413
1468.5 839068413 846270442 853563428 859593570 863761723 866660893 868407190 868729830 867237628
1484.9 867237628 863466263 857309520 849168420 838333249 820582509 801790357 806505978 831156969
1501.2 831156969 851491511 860720754 864770055 868369043 871036291 872413158 872586787 872339487
1517.5 872339487 872325778 872870445 874026060 874845803 875278652 875542045 875290871 874997258 874791443 873264015
1537.9 873264015 870569408 870084643 871301532 871968985 871509194 870296776 869066000 867631078 865063667
1556.2 865063667 860210061 855914056 853419065 848612845 840574741 829687655 818839610 813597918
1572.6 813597918 813982129 819256008 824112177 821688354 810539186 795747936 784413218 776422918
$$ packed form
1452.2G72105098j0588408J765609K4922311K1670044R903788N844176O297946P147849
1468.5H39068413P202029P292986O030142M168153K899170J746297L22640j492202
1484.9H67237628l771365o156743q141100j0835171j7750740j8792152M715621K4650991
1501.2H31156969K0334542R229243M049301L598988K667248J376867J73629k47300
1517.5H72339487j3709N44667J155615Q19743M32849K63393k51174k93613k05815j527428
1537.9H73264015k694607m84765J216889O67453m59791j212418j230776j434922k567411
1556.2H65063667m853606m296005k494991m806220q038104j0887086j0848045n241692
1572.6H13597918L84211N273879M856169k423823j1149168j4791250j1334718p990300
$$ plain form
1588.9 776422918 768774927 762528241 759252846 756759107 750803530 740284085 729021728 721194208
1605.2 721194208 717865348 718992710 722933173 725646436 724428535 722051084 725295067 737366259
1621.5 737366259 759144247 781984270 798582554 809509516 815478027 818527222 821685255 825719297
1637.8 825719297 828827560 830627680 831516087 832622826 835390687 837735236 838519931 840608776 844135225
1656.2 844135225 846606433 847857177 848586738 849575520 850290537 849923134 849156439 848258018 846656859
1674.5 846656859 844935417 843359113 840850115 836458921 830957949 826894999 822476685 815854609
1690.9 815854609 807783902 797187030 785956740 776404977 765702069 754422128 740827322 723853827
1707.2 723853827 704818547 681827843 653855860 620720625 581482232 544081151 511045992
$$ packed form
1588.9G76422918p647991o246686l275395k493739n955577j0519445j1262357p827520
1605.2G21194208l328860J127362L940463K713263j217901k377451L243983J2071192
1621.5G37366259K1777988K2840023J6598284J0926962N968511L049195L158033M034042
1637.8H25719297L108263J800120Q88407J106739K767861K344549P84695K088845L526449
1656.2H44135225K471208J250744P29561R88782P15017l67403p66695q98421j601159
1674.5H46656859j721442j576304k508998m391194n500972m062950m418314o622076
1690.9H15854609q070707j0596872j1230290r551763j0702908j1279941j3594806j6973495
1707.2G23853827j9035280k2990704k7971983l3135235l9238393l7401081l3035159
$$ plain form
1721.5 511045992 472860277 427837431 380094320 329803705 277321339 218393400 175342798
1735.7 175342798 165620908 175052628 197141007 230536163 273585320 326980084 393110424 458646804
1752 458646804 505102754 536133885 557396650 567005396 564491928 551113307 528536320 497528017
1768.4 497528017 462466419 429934174 416191936 426532507 449519932 471676648 481290191
1782.6 481290191 476656765 466188580 461755365 476020098 517485201 570157707 618308663 662114680
1799 662114680 700617611 731001198 753450513 770580173 784099579 795186818 804132044 810992479
1815.3 810992479 816412866 820924520 824746907 828043878 831252694 834102094 836897314 840183556
1831.6 840183556 843423605 846155047 848590255 850769877 852540612 854454696 856836557 858911335
$$ packed form
1721.5E11045992l8185715m5022846m7743111n0290615n2482366n8927939m3050602
1735.7A75342798r721890R431720K2088379L3395156M3049157N3394764O6130340O5536380
1752D58646804M6455950L1031131K1262765R608746k513468j3378621k2576987l1008303
1768.4D97528017l5061598l2532245j3742238J0340571K2987425K2156716R613543
1782.6D81290191m633426j0468185m433215J4264733M1465103N2672506M8150956M3806017
1799F62114680L8502931L0383587K2449315J7129660J3519406J1087239Q945226O860435
1815.3H10992479N420387M511654L822387L296971L208816K849400K795220L286242
1831.6H40183556L240049K731442K435208K179622J770735J914084K381861K074778
$$ plain form
1847.9 858911335 860308349 861424208 862430394 863245428 863694310 863911629 864120185 864299178 864331603
1866.3 864331603 864487588 865304291 866326272 867059112 867395699 867317736 866947412 866695642 866873026 867389023
1886.7 867389023 868078232 869031608 870168567 871248722 872291505 873059213 873463213 873732924 873995960
1905 873995960 874121070 874113500 874256968 874639213 874999285 875108242 875103712 874979436 874908805 875184953 875620782
1927.5 875620782 875937998 876105487 876279533 876594841 876927078 876854956 876197159 875288308 874619544 874678075
1947.9 874678075 875750005 877242506 878370643 879009068 879261136 879122853 878592610 877819479 877279818
1966.2 877279818 877691567 878913403 880025387 880677462 881190658 881775260 882280111 882536173 882621288
1984.6 882621288 882782638 883068740 883298635 883446932 883677900 884026051 884418309 884721935 884817898 884818435
$$ packed form
1847.9H58911335J397014J115859J006186Q15034M48882K17319K08556J78993L2425
1866.3H64331603J55985Q16703J021981P32840L36587p7963l70324k51770J77384N15997
1886.7H67389023O89209R53376J136959J080155J042783P67708M04000K69711K63036
1905H73995960J25110p570J43468L82245L60072J08957m530j24276p0631K76148M35829
1927.5H75620782L17216J67489J74046L15308L32237p2122o57797r08851o68764N8531
1947.9H74678075J071930J492501J128137O38425K52068j38283n30243p73131n39661
1966.2H77279818M11749J221836J111984O52075N13196N84602N04851K56062Q5115
1984.6H82621288J61350K86102K29895J48297K30968L48151L92258L03626R5963N37
$$ plain form
2005 884818435 884945989 885219932 885402739 885298491 884989321 884800434 884877026 884935439 884724796 884369493
2025.4 884369493 884147823 884134352 884159446 884067655 883962035 884046376 884298205 884527981 884603679 884538591 884481072
2047.8 884481072 884552658 884638131 884556651 884364426 884237885 884246886 884303093 884290516 884228230 884236276 884332418
2070.2 884332418 884386837 884265125 883984625 883722723 883605897 883575857 883506417 883430183 883508682 883817911
2090.6 883817911 884235680 884555399 884699702 884778738 884913445 885059178 885091126 884974360 884813070 884701967
2111 884701967 884617627 884456038 884164989 883804739 883478880 883275688 883192658 883198440 883330107 883621216 884016871
2133.5 884016871 884433210 884789646 885073483 885361850 885695040 886020839 886268914 886455357 886660755 886938989
2153.9 886938989 887207091 887362063 887427092 887487113 887557089 887580991 887544572 887481034 887465298 887537241 887626708
$$ packed form
2005H84818435J27554K73943J82807j04248l09170j88887P6592N8413k10643l55303
2025.4H84369493k21670j3471K5094r1791j05620Q4341K51829K29776P5698o5088n7519
2047.8H84481072P1586Q5473q1480j92225j26541R001N6207j2577o2286Q046R6142
2070.2H84332418N4419j21712k80500k61902j16826l0040o9440p6234P8499L09229
2090.6H83817911M17769L19719J44303P9036J34707J45733L1948j16766j61290j11103
2111H84701967q4340j61589k91049l60250l25859k03192q3030N782J31667K91109L95655
2133.5H84016871M16339L56436K83837K88367L33190L25799K48075J86443K05398K78234
2153.9H86938989K68102J54972O5029O0021O9976K3902l6419o3538j5736P1943Q9467
$$ plain form
2176.3 887626708 887615740 887486398 887316823 887170851 887062073 887005866 887011588 887036622 887068629 887105942 887104511
2198.7 887104511 887024403 886902988 886811376 886772633 886746049 886653662 886476815 886285365 886134148 885964751
2219.1 885964751 885684431 885327816 885055661 884916902 884800732 884620309 884396911 884215295 884152710 884218454
2239.5 884218454 884283662 884224832 884099543 884053290 884098709 884117961 884054840 883957803 883874774 883766174 883527100
2262 883527100 883091688 882588983 882252276 882149875 882170379 882205665 882243514 882333517 882528484 882744789 882777512
2284.4 882777512 882619977 882499337 882525563 882587552 882575452 882538855 882549286 882542431 882346928 881831646 881144762
2306.8 881144762 880605638 880300164 880074263 879830539 879592597 879507959 879764795 880291879 880736828 880894244
2327.2 880894244 880978703 881241441 881521761 881520152 881294727 881146252 881245077 881611645 882166207 882642984
$$ packed form
2176.3H87626708j0968j29342j69575j45972j08778n6207N722K5034L2007L7313j431
2198.7H87104511q0108j21415r1612l8743k6584r2387j76847j91450j51217j69397
2219.1H85964751k80320l56615k72155j38759j16170j80423k23398j81616o2585O5744
2239.5H84218454O5208n8830j25289m6253M5419J9252o3121r7037q3029j08600k39074
2262H83527100m35412n02705l36707j02401K0504L5286L7849R0003J94967K16305L2723
2284.4H82777512j57535j20640K6226O1989j2100l6597J0431o855j95503n15282o86884
2306.8H81144762n39124l05474k25901k43724k37942q4638K56836N27084M44949J57416
2327.2H80894244Q4459K62738K80320j609k25425j48475R8825L66568N54562M76777
$$ plain form
2347.6 882642984 882783055 882588863 882251859 881879687 881424606 880957603 880705953 880702794 880701423 880598247
2368 880598247 880564451 880727410 880962610 881086230 881131113 881298363 881685078 882191896 882611156 882820725
2388.4 882820725 882953227 883255899 883766234 884265244 884546220 884641349 884743452 884937346 885093272 885020733
2408.8 885020733 884734452 884473741 884371161 884270191 884006679 883678198 883521616 883626103 883791924 883760691
2429.2 883760691 883548498 883400857 883422613 883461535 883342624 883084655 882913411 882996857 883173704 883143783
2449.6 883143783 882893801 882676721 882667840 882775843 882787585 882657230 882575393 882711589 882932842 882950127
2470 882950127 882667303 882335305 882252276 882365227 882382333 882194459 881972611 881901681 881946087 881879687 881592333
2492.4 881592333 881266057 881161928 881303728 881449640 881394804 881206214 881090760 881119013 881143272 880998611
$$ packed form
2347.6H82642984J40071j94192l37004l72172m55081m67003k51650l159j371j03176
2368H80598247l3796J62959K35200J23620M4883J67250L86715N06818M19260K09569
2388.4H82820725J32502L02672N10335M99010K80976R5129J02103J93894J55926p2539
2408.8H85020733k86281k60711j02580j00970k63512l28481j56582J04487J65821l1233
2429.2H83760691k12193j47641K1756L8922j18911k57969j71244Q3446J76847k9921
2449.6H83143783k49982k17080q881J08003J1742j30355q1837J36196K21253J7285
2470H82950127k82824l31998q3029J12951J7106j87874k21848p0930M4406o6400k87354
2492.4H81592333l26276j04129J41800J45912n4836j88590j15454K8253K4259j44661
$$ plain form
2512.8 880998611 880768120 880689263 880805671 880891204 880781114 880615890 880662739 880970716 881279528 881312072
2533.2 881312072 881100595 880931437 880972922 881093323 881067276 880903780 880855262 881071389 881364644 881426752
2553.6 881426752 881252587 881144285 881291091 881519616 881528676 881277442 881037533 881023943 881105602 880992055
2574 880992055 880643606 880373657 880438149 880690038 880806148 880689323 880550981 880605400 880773723 880797088
2594.4 880797088 880594671 880407572 880498946 880780339 880937338 880846262 880736351 880896747 881258607 881473660
2614.8 881473660 881380320 881178677 881143868 881269097 881258845 880947530 880559564 880394995 880456746 880473971
2635.2 880473971 880234718 879870772 879711270 879853666 880026579 879969776 879831791 879950583 880345702 880687952
2655.6 880687952 880702674 880509317 880476177 880715311 880949497 880899251 880637705 880498290 880632877 880799353
$$ packed form
2512.8H80998611k30491p8857J16408Q5533j10090j65224M6849L07977L08812L2544
2533.2H81312072k11477j69158M1485J20401k6047j63496m8518K16127K93255O2108
2553.6H81426752j74165j08302J46806K28525R060k51234k39909j3590Q1659j13547
2574H80992055l48449k69949O4492K51889J16110j16825j38342N4419J68323K3365
2594.4H80797088k02417j87099R1374K81393J56999r1076j09911J60396L61860K15053
2614.8H81473660r3340k01643l4809J25229j0252l11315l87966j64569O1751J7225
2635.2H80473971k39253l63946j59502J42396J72913n6803j37985J18792L95119L42250
2655.6H80687952J4722j93357l3140K39134K34186n0246k61546j39415J34587J66476
$$ plain form
2676 880799353 880694628 880378723 880198300 880350888 880651057 880733728 880549788 880446792 880607843 880791068
2696.4 880791068 880724907 880449712 880236149 880264282 880369246 880253494 879946947 879795730 879971623 880251467
2716.8 880251467 880319059 880121231 879913986 879923224 879974425 879725456 879222214 878831446 878734350 878710210 878398597
2739.2 878398597 877822578 877404273 877348065 877410114 877239704 876743972 876255393 876221538 876645386 877085984
2759.6 877085984 877261817 877358556 877641022 878002942 878109455 877833307 877400100 877152979 877155304 877154112
2780 877154112 876973748 876782119 876782715 876868725 876825035 876566350 876186728 875900626 875771105 875538766 875005126
2802.4 875005126 874357164 873909831 873722196 873510182 873062670 872577310 872351587 872373879 872356176 872092068
2822.8 872092068 871688545 871377110 871179640 870868981 870253265 869421065 868606627 867700934 866242766
$$ packed form
2676H80799353j04725l15905j80423J52588L00169Q2671j83940j02996J61051J83225
2696.4H80791068o6161k75195k13563K8133J04964j15752l06547j51217J75893K79844
2716.8H80251467O7592j97828k07245R238N1201k48969n03242l90768r7096k4140l11613
2739.2H78398597n76019m18305n6208O2049j70410m95732m88579l3855M23848M40598
2759.6H77085984J75833R6739K82466L61920J06513k76148m33207k47121K325j192
2780H77154112j80364j91629N96Q6010m3690k58685l79622k86102j29521k32339n33640
2802.4H75005126o47962m47333j87635k12014m47512m85360k25723K2292j7703k64108
2822.8H72092068m03523l11435j97470l10659o15716q32200q14438r05693j458168
$$ plain form
2841.2 866242766 863937080 860590994 855690241 848082483 835086465 810764730 768103063 712322295
2857.5 712322295 672437608 678469181 723611593 774175763 809449673 829845428 841429412
2871.8 841429412 848006606 851626694 853831768 855476677 856657386 857265651 857286990 856817603 855920374
2890.1 855920374 854393244 851637185 846283197 836292863 821744144 808539689 804339945 809346378
2906.5 809346378 817604482 825329363 832162023 838173568 843077719 846687436 849141300 850791335
2922.8 850791335 851917267 852696359 853231847 853331804 852737725 851326644 848828018 844838798 839152992
2941.1 839152992 832064986 824764252 819368482 817877233 820448756 825016677 829744637 834727645
2957.4 834727645 840316832 845756650 850042284 852924645 854765832 855980337 856858909 857443511 857539356
$$ packed form
2841.2H66242766k305686l346086m900753p607758j2996018k4321735m2661667n5780768
2857.5G12322295l9884687O031573M5142412N0564170L5273910K0395755J1583984
2871.8H41429412O577194L620088K205074J644909J180709O08265K1339m69387q97229
2890.1H55920374j527130k756059n353988r990334j4548719j3204455m199744N006433
2906.5H09346378Q258104P724881O832660O011545M904151L609717K453864J650035
2922.8H50791335J125932P79092N35488R9957n94079j411081k498626l989220n685806
2941.1H39152992p088006p300734n395770j491249K571523M567921M727960M983008
2957.4H34727645N589187N439818M285634K882361J841187J214505Q78572N84602R5845
$$ plain form
2975.8 857539356 857088804 856113791 854401529 851837695 848692119 845207453 840851545 833397865 819443524
2994.2 819443524 799063921 780682862 774896502 782285929 795406818 808902740 820367217 828291357
3010.5 828291357 832656801 834582925 835269690 835286140 835339367 837035298 840655148 844034553 845430911
3028.8 845430911 844865382 842866302 840005755 837342083 836315274 837750435 841140568 844754815
3045.1 844754815 846942663 847327709 846060336 842980862 838757098 835779369 835756540 837542653 839245677
3063.5 839245677 840385556 841277659 842280149 843573391 845162928 847282827 850079596 852910340
3079.8 852910340 854966402 856169879 856841147 857212126 857296646 857005239 856517315 856247365 856371164
3098.2 856371164 856641114 856821895 857070029 857551992 857984245 857998550 857848167 858023047 858433306 858716905
$$ packed form
2975.8H57539356m50552r75013j712262k563834l145576l484666m355908p453680j3954341
2994.2H19443524k0379603j8381059n786360P389427J3120889J3495922J1464477P924140
3010.5H28291357M365444J926124O86765J6450N3227J695931L619850L379405J396358
3028.8H45430911n65529j999080k860547k663672j026809J435161L390133L614247
3045.1H44754815K187848L85046j267373l079474m223764k977729k2829J786113J703024
3063.5H39245677J139879Q92103J002490J293242J589537K119899K796769K830744
3079.8H52910340K056062J203477O71268L70979Q4520k91407m87924k69950J23799
3098.2H56371164K69950J80781K48134M81963M32253J4305j50383J74880M10259K83599
$$ plain form
3118.6 858716905 858657241 858319879 858109653 858250797 858495712 858492076 858239412 858071446 858153760 858180344
3139 858180344 857793272 857176363 856728852 856480956 856338680 856256485 856017172 855548382 855073690 854668915
3159.4 854668915 854241192 853794396 853412747 853137612 852919877 852674723 852347314 851978481 851677597 851396680
3179.8 851396680 850959301 850374699 849816501 849306703 848694921 847951293 847205341 846560180 846039116 845561504
3200.1 845561504 844993472 844356000 843774736 843227327 842642605 842044353 841480970 840994418 840584934 840156615
3220.5 840156615 839576900 838846207 838145554 837579787 837075472 836511731 835715473 834720433 833822072 833102942
3240.9 833102942 832414567 831766427 831235409 830709755 830139220 829605460 829107344 828575611 828043222 827559054
3261.3 827559054 827039599 826529920 826275766 826278329 826103330 825534880 824789584 824088216 823561668 823116899
$$ packed form
3118.6H58716905n9664l37362k10226J41144K44915l636k52664j67966Q2314K6584
3139H58180344l87072o16909m47511k47896j42276q2195k39313m68790m74692m04775
3159.4H54668915m27723m46796l81649k75135k17735k45154l27409l68833l00884k80917
3179.8H51396680m37379n84602n58198n09798o11782p43628p45952o45161n21064m77612
3200.1H45561504n68032o37472n81264n47409n84722n98252n63383m86552m09484m28319
3220.5H40156615n79715p30693p00653n65767n04315n63741p96258r95040q98361p19130
3240.9H33102942o88375o48140n31018n25654n70535n33760m98116n31733n32389m84168
3261.3H27559054n19455n09679k54154K563j74999n68450p45296p01368n26548m44769
$$ plain form
3281.7 823116899 822552085 821870804 821249902 820857704 820541859 819915175 818902254 817790568 816877782
3300.1 816877782 816236019 815692902 814934134 813773572 812370002 810963333 809608281 808239341 806887209
3318.4 806887209 805635870 804477096 803272128 801768064 800010800 798341215 796805501 795278192
3334.8 795278192 793780982 792176425 790352106 788428962 786338687 784152269 782196999 780297101
3351.1 780297101 778099656 775729299 773433328 771266222 769073486 766801596 764688492 762694597
3367.4 762694597 760441005 757842839 755274177 753021061 750934362 748859107 746839404 744912207
3383.7 744912207 743103981 741516113 740203857 738912702 737402260 735893190 734704077 733744025
3400 733744025 732606590 731229842 729965687 728900313 727865279 726860881 725955427 725082755 724200904
$$ packed form
3281.7H23116899n64814o81281o20902l92198l15845o26684j012921j111686r12786
3300.1H16877782o41763n43117p58768j160562j403570j406669j355052j368940j352132
3318.4H06887209j251339j158774j204968j504064j757264j669585j535714j527309
3334.8G95278192j497210j604557j824319j923144k090275k186418j955270j899898
3351.1G80297101k197445k370357k295971k167106k192736k271890k113104j993895
3367.4G62694597k253592k598166k568662k253116k086699k075255k019703j927197
3383.7G44912207j808226j587868j312256j291155j510442j509070j189113r60052
3400G33744025j137435j376748j264155j065374j035034j004398r05454q72672q81851
$$ plain form
3418.4 724200904 723401904 722761631 722270310 721877337 721509218 721125424 720788419 720522404 720242262 719931901
3438.8 719931901 719650447 719434083 719283640 719195545 719222844 719405115 719696939 720044672 720387399 720690429
3459.2 720690429 721034229 721458137 721884727 722435296 723420739 724909186 726662338 728398144 729938507
3477.5 729938507 731284142 732574642 733765423 734756589 735629857 736385047 736924052 737291873 737686694
3495.9 737686694 738202512 738751531 739409268 740459561 741778314 743036985 744369209 746014059 747844815
3514.2 747844815 749681890 751518369 753292859 754993021 756704032 758422136 760171652 761992216
3530.6 761992216 763688385 765130818 766549945 768076062 769510269 770779908 772170365 773917317
3546.9 773917317 775760293 777402699 779006898 780633569 782087028 783403218 784728646 785957992
$$ packed form
3418.4G24200904p99000o40273m91321l92973l68119l83794l37005k66015k80142l10361
3438.8G19931901k81454k16364j50443q8095K7299J82271K91824L47733L42727L03030
3459.2G20690429L43800M23908M26590N50569R85443J488447J753152J735806J540363
3477.5G29938507J345635J290500J190781R91166Q73268P55190N39005L67821L94821
3495.9G37686694N15818N49019O57737J050293J318753J258671J332224J644850J830756
3514.2G47844815J837075J836479J774490J700162J711011J718104J749516J820564
3530.6G61992216J696169J442433J419127J526117J434207J269639J390457J746952
3546.9G73917317J842976J642406J604199J626671J453459J316190J325428J229346
$$ plain form
3563.2 785957992 787060976 788702250 791116536 793505192 795577705 797510982 799388170 801293015
3579.5 801293015 803153694 804640114 805854440 807549536 809797466 811764956 813392282 815125763
3595.8 815125763 816978216 818767846 820578039 822273314 823581278 824830770 826329231 827845275
3612.1 827845275 829324961 830644190 831914783 833764076 835785568 837052763 837388694 837795556 839533389
3630.5 839533389 841577649 843197107 844530940 845580816 846422076 847009659 846978426 846270740 846184909
3648.8 846184909 847906530 849790454 850876510 851983786 853338838 854219139 854521990 854442716 853841007
3667.2 853841007 853057086 852927923 852833569 852634609 853530824 854851723 855770648 856289029 856336415 856050134
3687.6 856050134 856149733 857100666 858263254 859034598 859279454 859103799 859004557 859319508 859410942 858720124
$$ packed form
3563.2G85957992J102984J641274K414286K388656K072513J933277J877188J904845
3579.5H01293015J860679J486420J214326J695096K247930J967490J627326J733481
3595.8H15125763J852453J789630J810193J695275J307964J249492J498461J516044
3612.1H27845275J479686J319229J270593J849293K021492J267195L35931M06862J737833
3630.5H39533389K044260J619458J333833J049876Q41260N87583l1233p07686q5831
3648.8H46184909J721621J883924J086056J107276J355052Q80301L02851p9274o01709
3667.2H53841007p83921j29163r4354j98960Q96215J320899R18925N18381M7386k86281
3687.6H56050134R9599R50933J162588P71344K44856j75655r9242L14951R1434o90818
$$ plain form
3708 858720124 857683778 857562006 858457565 859151661 859220982 858883142 858477235 858322859 858538270 858758628
3728.4 858758628 858340800 857261062 856639564 857499897 858797729 859019578 857924819 856791019 856773317
3746.7 856773317 856745124 856744111 857753336 858810604 859156489 859322786 859775603 859971046 859671235 859310746
3767.1 859310746 859220505 859594345 860103190 860240221 860053539 859940708 860058486 860114694 860158741 860427439
3787.5 860427439 860718906 860741735 860297561 859513879 858796299 858134568 857822239 858090401 858330429 858848691
3807.9 858848691 859655082 859802306 859034777 858107507 857601345 857204139 857419014 858065128 858279049 858296752
3828.3 858296752 858249724 858025193 857670307 857048273 856575489 856937706 857753277 858457506 858688831 858103275
3848.7 858103275 856586754 855058849 855596542 857044995 857643008 857445478 856925607 856572926 856236815
$$ packed form
3708H58720124j036346j21772Q95559O94096O9321l37840m05907j54376K15411K20358
3728.4H58758628m17828j079738o21498Q60333J297832K21849j094759j133800j7702
3746.7H56773317k8193j013J009225J057268L45885J66297M52817J95443k99811l60489
3767.1H59310746r0241L73840N08845J37031j86682j12831J17778N6208M4047K68698
3787.5H60427439K91467K2829m44174p83682p17580o61731l12329K68162K40028N18262
3807.9H58848691Q06391J47224p67529r27270n06162l97206K14875O46114K13921J7703
3828.3H58296752m7028k24531l54886o22034m72784L62217Q15571P04229K31325n85556
3848.7H58103275j516521j527905N37693J448453N98013j97530n19871l52681l36111
$$ plain form
3867.1 856236815 855744004 855784416 856388927 856935799 857021987 856571019 856300473 856415927 856501877 856625557
3887.5 856625557 856599450 856600106 857025981 857201219 856564879 855570972 855025649 855262637 856049120 856742084
3907.9 856742084 857014537 857029438 856808424 856313527 855932295 855911851 855959773 855942786 855934739 855755210 855415523
3930.3 855415523 855369747 855665088 855787277 855565071 855235934 855061054 855112553 855115056 854974210 854973793 855196476
3952.7 855196476 855430305 855498910 855452895 855483055 855695069 855931818 855970085 855854034 855793774 855883181 856038809
3975.2 856038809 856110930 856037140 855989456 856101632 856157541 855943203 855538905 855149388 854923069 854865313
3995.6 854865313 854836762
3997.6 854836762
$$ packed form
3867.1H56236815m92811M0412O04511N46872Q6188m50968k70546J15454Q5950J23680
3887.5H56625557k6107O56M25875J75238o36340r93907n45323K36988P86483O92964
3907.9H56742084K72453J4901k21014m94897l81232k0444M7922j6987q047j79529l39687
3930.3H55415523m5776K95341J22189k22206l29137j74880N1499K503j40846m17K22683
3952.7H55196476K33829O8605m6015L0160K12014K36749L8267j16051o0260Q9407J55628
3975.2H56038809P2121p3790m7684J12176N5909k14338m04298l89517k26319n7756
3995.6H54865313k8551
3997.6H54836762
##END=$$ End of the data block
