##TITLE=MV - 90F 96 - Filme sobre cela de ZnSe $$ Begin of the data block
##JCAMP-DX=5.00 $$ ACD/SpecManager v 10.08
##SPECTROMETER/DATA SYSTEM=Alpha
##DATE=09 Oct 2013 09:58:36
##DATA TYPE=INFRARED SPECTRUM
##DATA CLASS=XYDATA
##ORIGIN=
##OWNER=
##NPOINTS=3334
##FIRSTX=599.63525391
##LASTX=3998.58886719
##MAXX=3998.58886719
##MINX=599.63525391
##MAXY=1.05832505
##MINY=0.57881504
##XFACTOR=1.0000000000
##YFACTOR=0.000000010000000
##FIRSTY=0.93729055
##DELTAX=1.01978803
##XUNITS=1/CM
##YUNITS=ARBITRARY UNITS
##XYDATA=(X++(Y..Y))
$$ plain form
599.6 93729055 92218047 91349030 91444850 92475545 94079131 95808768 97360343 98567605 99385267
608.8 99385267 99913412 100259495 100469506 100596583 100668812 100692511 100700212 100716794 100732422 100714684 100657725
620 100657725 100582922 100497603 100402665 100310135 100219083 100111425 99980897 99821335 99639606 99463445 99288416
631.2 99288416 99074024 98794550 98446620 98002571 97429740 96699494 95749801 94495320 92859119 90834618
641.4 90834618 88479590 85927677 83516157 81771517 81104892 81662184 83381116 85917699 88707513
650.6 88707513 91318601 93560308 95366311 96754199 97813714 98638558 99254203 99678522 99995893
659.8 99995893 100268364 100489676 100670040 100820351 100932741 100961423 100876260 100860488 101118577 101254833
670 101254833 101294291 101322567 101338041 101315939 101320732 101372266 101391280 101390612 101395357 101381254 101394141 101434708 101453245
$$ packed form
599.6I3729055j511008q69017R5820J030695J603586J729637J551575J207262Q17662
608.8I9385267N28145L46083K10011J27077P2229K3699P701J6582J5628j7738n6959
620A00657725p4803q5319r4938r2530r1052j07658j30528j59562j81729j76161j75029
631.2I9288416k14392k79474l47930m44049n72831p30246r49693j254481j636201k024501
641.4I0834618k355028k551913k411520j744640o66625N57292J718932K536583K789814
650.6H8707513K611088K241707J806003J387888J059515Q24844O15645M24319L17371
659.8I9995893K72471K21312J80364J50311J12390K8682q5163j5772K58089J36256
670A01254833L9458K8276J5474k2102M793N1534J9014o68M745j4103J2887M0567J8537
$$ plain form
683.3 101453245 101480532 101517463 101523685 101525211 101540768 101549220 101554441 101565182 101581585 101600218 101599872 101590729 101602614
696.5 101602614 101608622 101594496 101590979 101596868 101603758 101612306 101618600 101627254 101636922 101639819 101637483 101643872 101655519 101659191
710.8 101659191 101666176 101677573 101673043 101651931 101636279 101632810 101616585 101569116 101526654 101528406 101528418 101481593 101427543
724 101427543 101405978 101394081 101367581 101328063 101264739 101175249 101069558 100934744 100749362 100481713 100108361
735.3 100108361 99649370 99136913 98614991 98152673 97822106 97709322 97909254 98412251 99046302 99627733
745.5 99627733 100079978 100392044 100568390 100635374 100641441 100617754 100554681 100425756 100236356 99997008 99660039
756.7 99660039 99155533 98445183 97471040 96132147 94371074 92276287 90176958 88551897 87776434
765.9 87776434 87958884 88924581 90332913 91807377 93021077 93792719 94142216 94223303 94239646 94401169
$$ packed form
683.3A01453245K7287L6931O222J526J5557Q452N221J0741J6403J8633l46r143J1885
696.5A01602614O008j4126l517N889O890Q548O294Q654R668K897k336O389J1647L672
710.8A01659191O985J1397m530k1112j5652l469j6225m7469m2462J752J2m6825n4050
724A01427543k1565j1897k6500l9518o3324q9490j05691j34814j85382k67649l73352
735.3A00108361m58991n12457n21922m62318l30567j12784J99932N02997O34051N81431
745.5I9627733M52245L12066J76346O6984O067k3687o3073j28925j89400k39348l36969
756.7I9660039n04506p10350r74143j338893j761073k094787k099329j625061p75463
765.9H7776434J82450R65697J408332J474464J213700P71642L49497Q1087J6343J61523
$$ plain form
776.1 94401169 94822305 95464426 96199775 96875185 97363424 97581977 97433680 96797991 95538944 93540877
786.3 93540877 90905994 88135862 86063492 85508877 86823899 89601678 92866069 95701391 97718316
795.4 97718316 98985064 99738669 100204682 100505722 100692880 100829089 100953782 101057971 101129258 101162064
805.6 101162064 101173162 101196802 101233041 101266527 101290894 101294947 101290774 101296985 101312482 101331532 101339960 101333332 101328266
818.9 101328266 101330423 101329637 101331770 101335943 101335132 101340461 101345193 101341164 101335740 101329267 101315343 101298130 101298225 101308727 101302433
834.2 101302433 101283658 101271081 101264286 101254511 101243222 101231086 101206863 101172447 101143479 101113725 101066768 101002288
846.4 101002288 100938857 100893378 100847280 100780535 100695908 100591338 100465548 100313306 100119996 99880368 99593335
857.6 99593335 99238116 98779815 98210382 97562230 96872115 96171451 95517486 94978303 94588935 94359481
$$ packed form
776.1I4401169M21136O42121P35349O75410M88239K18553j48297o35689j259047j998067
786.3I3540877k634883k770132k072370n54615J315022K777779L264391K835322K016925
795.4I7718316J266748P53605M66013L01040J87158J36209J24693J04189P1287L2806
805.6A01162064J1098K3640L6239L3486K4367M053m173O211J5497J9050Q428o628n066
818.9A01328266K157p86K133M173q11N329M732m029n424o473j3924j7213R5J0502o294
834.2A01302433j8775j2577o795r775j1289j2136k4223l4416k8968k9754m6957o4480
846.4A01002288o3431m5479m6098o6745q4627j04570j25790j52242j93310k39628k87033
857.6I9593335l55219m58301n69433o48152o90115p00664o53965n39183l89368k29454
$$ plain form
867.8 94359481 94292474 94343865 94427890 94509500 94625425 94826144 95150524 95618236 96199840 96813351 97377527
879.1 97377527 97856307 98227549 98462045 98573798 98603994 98556578 98424888 98228288 97979629 97696084
889.3 97696084 97423607 97193599 97019857 96904397 96812057 96693379 96497947 96171808 95680588 94999146
899.4 94999146 94117266 93089092 92020845 91020888 90197092 89646167 89404112 89441305 89689744 90055752
909.6 90055752 90438884 90758252 90961337 91004938 90848774 90463394 89813864 88853782 87540191 85859013
919.8 85859013 83873183 81725234 79624993 77819806 76490480 75697595 75398713 75501066 75918931
929 75918931 76583272 77444839 78478825 79677862 81032068 82502079 84021741 85528815 86976564
938.2 86976564 88325441 89543140 90599138 91454256 92063069 92372662 92340428 91958165 91245478 90278888
$$ packed form
867.8I4359481o7007N1391Q4025Q1610J15925K00719L24380M67712N81604O13511N64176
879.1I7377527M78780L71242K34496J11753L0196m7416j31690j96600k48659k83545
889.3I7696084k72477k30008j73742j15460r2340j18678j95432l26139m91220o81442
899.4I4999146q81880j028174j068247r99957q23796n50925k42055L7193K48439L66008
909.6I0055752L83132L19368K03085M3601j56164l85380o49530r60082j313591j681178
919.8H5859013j985830k147949k100241j805187j329326p92885k98882J02353M17865
929G5918931O64341Q61567J033986J199037J354206J470011J519662J507074J447749
938.2H6976564J348877J217699J055998Q55118O08813L09593l2234l82263p12687r66590
$$ plain form
948.4 90278888 89227200 88318533 87762797 87673092 88000226 88509440 88873976 88834167 88292545 87326926
958.6 87326926 86170793 85139912 84515297 84476995 85075122 86196381 87577319 88893211 89857274
967.8 89857274 90292299 90162325 89544380 88581723 87443143 86304754 85339063 84679979 84412885 84584415
978 84584415 85193115 86182457 87450528 88871425 90315449 91667682 92852437 93835968 94612360
987.1 94612360 95198911 95626032 95929700 96133101 96233708 96225470 96107101 95871401 95496446 94943625
997.3 94943625 94171119 93146586 91853607 90322548 88641399 86927384 85331774 84028965 83147031
1006.5 83147031 82736915 82796949 83281356 84092683 85082740 86080283 86926973 87510705 87812150 87909490
1016.7 87909490 87941366 88043827 88278067 88609403 88950902 89225674 89395654 89469898 89488649 89490855 89488119
$$ packed form
948.4I0278888j051688r08667n55736q9705L27134N09214L64536l9809n41622r65619
958.6H7326926j156133j030881o24615l8302N98127J121259J380938J315892R64063
967.8H9857274M35025j29974o17945r62657j138580j138389r65691o59084k67094J71530
978H4584415O08700R89342J268071J420897J444024J352233J184755R83531P76392
987.1I4612360N86551M27121L03668K03401J00607q238j18369k35700l74955n52821
997.3I4943625p72506j024533j292979j531059j681149j714015j595610j302809q81934
1006.5H3147031m10116O0034M84407Q11327R90057R97543Q46690N83732L01445R7340
1016.7H7909490L1876J02461K34240L31336L41499K74772J69980P4244J8751K206k736
$$ plain form
1027.9 89488119 89458710 89370131 89182895 88835299 88259411 87401831 86213762 84655184 82711941 80401736
1038.1 80401736 77798760 75053746 72360188 69901848 67824525 66208810 65059853 64350301 64068735
1047.3 64068735 64211917 64767390 65721035 67062849 68775553 70801544 73020744 75251728 77308071
1056.5 77308071 79076838 80511647 81600970 82378334 82916939 83294940 83567029 83770674 83940154
1065.7 83940154 84089905 84220964 84341305 84448349 84537083 84611303 84656107 84636408 84512973 84236300
1075.9 84236300 83739203 82943666 81779432 80199111 78196549 75842130 73286545 70726269 68346906
1085 68346906 66272974 64563942 63227952 62237537 61540031 61082399 60835123 60780233 60900241 61181110
1095.2 61181110 61627072 62259585 63103360 64195681 65572494 67244452 69209015 71450210 73917335
$$ packed form
1027.9H9488119k9409q8579j87236l47596n75888q57580j188069j558578j943243k310205
1038.1H0401736k602976k745014k693558k458340k077323j615715j148957p09552k81566
1047.3F4068735J43182N55473R53645J341814J712704K025991K219200K230984K056343
1056.5G7308071J768767J434809J089323P77364N38605L78001K72089K03645J69480
1065.7H3940154J49751J31059J20341J07044Q8734P4220M4804j9699j23435k76673
1075.9H4236300m97097p95537j164234j580321k002562k354419k555585k560276k379363
1085F8346906k073932j709032j335990r90415o97506m57632k47276n4890J20008K80869
1095.2F1181110M45962O32513Q43775J092321J376813J671958J964563K241195K467125
$$ plain form
1104.4 73917335 76497436 79043049 81432140 83575529 85426444 86990070 88299900 89385855
1112.6 89385855 90277272 91012454 91618454 92119300 92544180 92907488 93212169 93470109 93694252 93885440
1122.8 93885440 94049174 94202781 94352430 94487339 94599700 94687915 94753945 94793242 94790262 94742149 94656402
1134 94656402 94526470 94340873 94096339 93786269 93406260 92951715 92410427 91763502 90990573 90085900
1144.2 90085900 89041346 87845212 86501127 85016441 83399677 81680024 79916984 78178018
1152.4 78178018 76519650 74995154 73645681 72483939 71511793 70736510 70154077 69750249 69517082
1161.5 69517082 69453615 69565576 69869471 70385355 71117365 72046393 73141414 74360400 75631922
1170.7 75631922 76865554 77986121 78933197 79654479 80127245 80367124 80427593 80403858 80408841 80525750
$$ packed form
1104.4G3917335K580101K545613K389091K143389J850915J563626J309830J085955
1112.6H9385855Q91417P35182O06000N00846M24880L63308L04681K57940K24143J91188
1122.8I3885440J63734J53607J49649J34909J12361Q8215O6030L9297k980m8113q5747
1134I4656402j29932j85597k44534l10070l80009m54545n41288o46925p72929r04673
1144.2I0085900j044554j196134j344085j484686j616764j719653j763040j738966
1152.4G8178018j658368j524496j349473j161742r72146p75283n82433m03828k33167
1161.5F9517082o3467J11961L03895N15884P32010R29028J095021J218986J271522
1170.7G5631922J233632J120567R47076P21282M72766K39879O0469k3735M983J16909
$$ plain form
1180.9 80525750 80782288 81145406 81516641 81776124 81838655 81645918 81168103 80427080 79476154 78378069
1191.1 78378069 77204889 76026070 74899411 73881572 73029423 72380644 71956438 71779025 71868217
1200.3 71868217 72245795 72924250 73880374 75071901 76443136 77900207 79313248 80545866 81481886
1209.5 81481886 82030553 82132840 81774092 80989349 79869217 78562456 77255619 76142871 75407976
1218.6 75407976 75190365 75552833 76494557 77966291 79847986 81958729 84109384 86135477 87925631
1227.8 87925631 89429051 90640330 91588783 92315459 92854315 93231159 93474096 93609709 93664122 93654567
1238 93654567 93577456 93437886 93251508 93018520 92724735 92350674 91879785 91301519 90597218 89744490
1248.2 89744490 88734174 87584478 86356771 85156459 84120899 83373618 82964587 82852089 82922477
$$ packed form
1180.9H0525750K56538L63118L71235K59483O2531j92737m77815p41023r50926j098085
1191.1G8378069j173180j178819j126659j017839q52149o48779m24206j77413Q9192
1200.3G1868217L77578O78455R56124J191527J371235J457071J413041J232618R36020
1209.5H1481886N48667J02287l58748p84743j120132j306761j306837j112748p34895
1218.6G5407976k17611L62468R41724J471734J881695K110743K150655K026093J790154
1227.8H7925631J503420J211279R48453P26676N38856L76844K42937J35613N4413r555
1238I3654567p7111j39570j86378k32988k93785l74061m70889n78266p04301q52728
1248.2H9744490j010316j149696j227707j200312j035560p47281m09031j12498P0388
$$ plain form
1257.4 82922477 83037263 83094162 83068866 83006167 82947403 82862484 82660574 82244200 81546342 80535960
1267.6 80535960 79222590 77670836 75986356 74297333 72762769 71525812 70661271 70198667 70149219
1276.8 70149219 70518309 71299547 72460687 73951286 75703496 77609986 79538977 81384730 83065712
1285.9 83065712 84516406 85703933 86636990 87344742 87854183 88195300 88399523 88490868 88482791 88375729
1296.1 88375729 88165104 87854934 87455517 86966807 86373115 85658675 84806782 83804637 82659197
1305.3 82659197 81378335 79962701 78431422 76835817 75238943 73684645 72193867 70798665
1313.5 70798665 69551408 68468964 67505914 66617054 65773749 64955509 64198112 63519239 62897336
1322.7 62897336 62329620 61843377 61466473 61206287 61079663 61090600 61249882 61577404 62089181 62802529
$$ packed form
1257.4H2922477J14786N6899k5296o2699n8764q4919k01910m16374o97858j010382
1267.6H0535960j313370j551754j684480j689023j534564j236957q64541m62604m9448
1276.8G0149219L69090P81238J161140J490599J752210J906490J928991J845753J680982
1285.9H3065712J450694J187527R33057P07752N09441L41117K04223R1345q077j07062
1296.1H8375729k10625l10170l99417m88710n93692p14440q51893j002145j145440
1305.3H2659197j280862j415634j531279j595605j596874j554298j490778j395202
1313.5G0798665j247257j082444r63050q88860q43305q18240p57397o78873o21903
1322.7F2897336n67716m86243l76904k60186j26624J0937J59282L27522N11777P13348
$$ plain form
1332.9 62802529 63768417 65025532 66541320 68278700 70209140 72263074 74329352 76332414 78247911
1342 78247911 80063254 81747478 83275956 84646380 85874718 86988401 87992245 88885176 89682102
1351.2 89682102 90404022 91059804 91642779 92136210 92541003 92874950 93131971 93317366 93432981 93443507
1361.4 93443507 93269491 92811477 92155761 91437018 90606272 89538258 88055104 86073691 83739871
1370.6 83739871 81354082 79236585 77507448 76253670 75480956 74866301 73991632 72728723 71342438
1379.8 71342438 70214307 69648856 69832796 70818377 72493953 74506581 76189071 76827288 76358652
1388.9 76358652 75169051 73738486 72793645 72795480 73719674 75517195 78056371 81013912 84068465
1398.1 84068465 86833054 88928860 90464211 91720217 92784005 93678725 94314247 94678551 94952804
$$ packed form
1332.9F2802529R65888J257115J515788J737380J930440K053934K066278K003062J915497
1342G8247911J815343J684224J528478J370424J228338J113683J003844Q92931P96926
1351.2H9682102P21920O55782N82975M93431M04793L33947K57021J85395J15615J0526
1361.4I3443507j74016m58014o55716p18743q30746j068014j483154j981413k333820
1370.6H3739871k385789k117497j729137j253778p72714o14655q74669j262909j386285
1379.8G1342438j128131n65451J83940R85581J675576K012628J682490O38217m68636
1388.9G6358652j189601j430565r44841J835R24194J797521K539176K957541L054553
1398.1H4068465K764589K095806J535351J256006J063788Q94720O35522L64304K74253
$$ plain form
1407.3 94952804 95214230 95432514 95600212 95718491 95786160 95827055 95871860 95942932 96039456 96180785 96301413
1418.5 96301413 96049118 95450026 94960725 94595438 94106090 93335015 92376262 91289699 90040880
1427.7 90040880 88565630 86644226 84373659 82117188 79877961 77809852 76283079 74736738
1435.9 74736738 72401762 70695847 70099133 69776225 69625717 69733071 70086414 70647383 71410853
1445 71410853 72389609 73456883 74467659 75536597 76789778 78111345 79377717 80576628 81798011
1454.2 81798011 83012217 83873600 83969903 83643395 83241010 82835156 82521260 82381409 82513839 82718360
1464.4 82718360 82893217 83351821 84168774 85204911 86410660 87796789 89293480 90565407 91345829
1473.6 91345829 91957343 92623693 93170083 93514949 93891996 94393378 94947314 95456195 95898372 96341985
$$ packed form
1407.3I4952804K61426K18284J67698J18279O7669M0895M4805P1072R6524J41329J20628
1418.5I6301413k52295n99092m89301l65287m89348p71075r58753j086563j248819
1427.7I0040880j475250j921404k270567k256471k239227k068109j526773j546341
1435.9G4736738k334976j705915n96714l22908j50508J07354L53343N60969P63470
1445G1410853R78756J067274J010776J068938J253181J321567J266372J198911J221383
1454.2H1798011J214206Q61383R6303l26508m02385m05854l13896j39851J32430K04521
1464.4H2718360J74857M58604Q16953J036137J205749J386129J496691J271927P80422
1473.6I1345829O11514O66350N46390L44866L77047N01382N53936N08881M42177M43613
$$ plain form
1483.8 96341985 96820700 97360051 97913027 98347896 98733586 99101496 99162859 99003595 98959070 99092531
1494 99092531 99401248 99748582 99847609 99829584 99762785 99557287 99386740 99294651 99261028 99447697 99986511
1505.2 99986511 100566316 100444067 99915153 99516267 99316365 99319994 99406308 99435663 99544007 99838984
1515.4 99838984 100199294 100294840 100127673 100211883 100644028 100872350 100577986 100232661 100131512 100107324
1525.6 100107324 99965423 99802417 99618006 99439454 99431175 99660730 100061250 100284660 100120294 99975437
1535.8 99975437 100125754 100656486 101529479 102044904 101917374 101728630 101502824 101334715 101266837 101062572
1546 101062572 100823700 100796616 100968170 101083779 100971377 100878346 101051629 101328456 101329625 101361358 101926959
1557.2 101926959 102868629 103126884 102335060 101439297 100984824 100916457 101015198 101013649 100908053 100939548
$$ packed form
1483.8I6341985M78715N39351N52976M34869L85690L67910O1363j59264m4525J33461
1494I9092531L08717L47334R9027j8025o6799k05498j70547r2089l3623J86669N38814
1505.2I9986511N79805j22249n28914l98886j99902L629Q6314K9355J08344K94977
1515.4I9838984L60310R5546j67167Q4210M32145K28322k94364l45325j01149k4188
1525.6A00107324j41901j63006j84411j78552q279K29555M00520K23410j64366j44857
1535.8I9975437J50317N30732Q72993N15425j27530j88744k25806j68109o7878k04265
1546A01062572k38872k7084J71554J15609j12402r3031J73283K76827J169L1733N65601
1557.2A01926959R41670K58255p91824q95763m54473o8367R8741j549j05596L1495
$$ plain form
1567.4 100939548 101231825 101527894 101372838 101038349 100891995 100906980 101093805 101483774 101575089 101174390
1577.6 101174390 100851798 100737929 100721705 100741696 100776303 100816154 100856960 100897014 100934637 100967813 100999331
1588.8 100999331 101021969 101025844 101023531 101033640 101051760 101046324 101009500 100963092 100918376 100884902 100869930 100860655
1601.1 100860655 100838256 100793374 100721622 100649929 100607693 100573134 100533032 100483215 100376725 100238264 100136399
1612.3 100136399 100073695 100080669 100275469 100573695 100455225 100059593 99841851 99802768 99891883 100123036
1622.5 100123036 100262403 100067472 99845195 99852157 99946648 99863946 99681741 99584556 99560040 99607843 99871856
1633.7 99871856 100398719 100638616 100289702 99899137 99625295 99468464 99398977 99355799 99324954 99376160
1643.9 99376160 99640989 100029790 100139046 99881798 99507850 99308813 99524707 100286555 101016116 100486672
$$ packed form
1567.4A00939548K92277K96069j55056l34489j46354J4985J86825L89969R1315m00699
1577.6A01174390l22592j13869j6224J9991L4607L9851M0806M0054L7623L3176L1518
1588.8A00999331K2638L875k313J0109J8120n436l6824m6408m4716l3474j4972r275
1601.1A00860655k2399m4882p1752p1693m2236l4559m0102m9817j06490j38461j01865
1612.3A00136399o2704O974J94800K98226j18470l95632k17742l9083Q9115K31153
1622.5A00123036J39367j94931k22277O962R4491q2702j82205r7185k4516M7803K64013
1633.7I9871856N26863K39897l48914l90565k73842j56831o9487m3178l0845N1206
1643.9I9376160K64829L88801J09256k57248l73948j99037K15894P61848P29561n29444
$$ plain form
1654.1 100486672 99654144 99162263 98958772 98895288 98880589 98920029 99070603 99263448 99213767 98955095
1664.3 98955095 98779458 98752385 98888248 99178171 99314016 99108857 98821044 98552930 98450410 98593533
1674.5 98593533 98534346 98053819 97645247 97457695 97357225 97204155 97108001 97311753 97614485 97162700
1684.7 97162700 96195436 95596409 95288080 95033836 94739264 94404453 94100505 93921107 93967998 94173944
1694.9 94173944 94044572 93516207 93296522 93487096 93444610 92366582 91411746 90895104 90387022 89674962
1705.1 89674962 88680357 87452018 86248595 85066271 83700055 82239085 80896384 79643005 78176630
1714.2 78176630 76639438 75404269 73710030 71325409 69674885 68743128 67903191 66995198 66050726
1723.4 66050726 65234894 64634657 64188713 63931960 63850141 63682961 63612181 64132279 64863878 64683366
$$ packed form
1654.1A00486672q32528m91881k03491o3484j4699L9440J50574J92845m9681k58672
1664.3I8955095j75637k7073J35863K89923J35845k05159k87813k68114j02520J43123
1674.5I8593533n9187m80527m08572j87552j00470j53070r6154K03752L02732m51785
1684.7I7162700r67264n99027l08329k54244k94572l34811l03948j79398M6891K05946
1694.9I4173944j29372n28365k19685J90574m2486j078028r54836n16642n08082p12060
1705.1H9674962r94605j228339j203423j182324j366216j460970j342701j253379j466375
1714.2G8176630j537192j235169j694239k384621j650524r31757q39937r07993r44472
1723.4F6050726q15832o00237m45944k56753q1819j67180p0780N20098P31599j80512
$$ plain form
1733.6 64683366 63793862 64002824 64930129 65937221 66819400 67362225 68038976 69161606 70292288
1742.8 70292288 71278650 72303373 73383361 74402887 75240993 75944787 76553077 76755184 76609164
1752 76609164 76594424 76631415 76547283 76114225 75159258 74051076 73030198 71958029 70325130 68072069
1762.2 68072069 66218138 64858609 63639814 62693352 61718744 60527039 59928852 59959501 59674293
1771.4 59674293 58626252 57881504 57959044 58061326 58023530 58137453 58358067 58514303 58475208 58444446
1781.6 58444446 58644122 58854777 58792436 58655876 58735275 58921587 59191346 59595281 60029924 60174102
1791.8 60174102 60005087 60269940 61006641 61758882 62661874 63946176 65513498 67339253 69478261
1800.9 69478261 71828741 74230516 76559210 78735489 80706441 82437366 83934057 85241842
$$ packed form
1733.6F4683366q89504K08962R27305J007092Q82179N42825O76751J122630J130682
1742.8G0292288R86362J024723J079988J019526Q38106P03794O08290K02107j46020
1752G6609164j4740L6991q4132m33058r54967j108182j020878j072169j632899k253061
1762.2F8072069j853931j359529j218795r46462r74608j191705n98187L0649k85208
1771.4E9674293j048041p44748P7540J02282l7796J13923K20614J56236l9095l0762
1781.6E8444446J99676K10655o2341j36560P9399J86312K69759M03935M34643J44178
1791.8F0174102j69015K64853P36701P52241R02992J284302J567322J825755K139008
1800.9F9478261K350480K401775K328694K176279J970952J730925J496691J307785
$$ plain form
1809.1 85241842 86359787 87239963 87911129 88477141 88990015 89470547 89931923 90375990 90815926 91281831
1819.3 91281831 91791660 92328990 92888093 93492544 94123697 94622958 94954687 95337868 95871705 96389741
1829.5 96389741 96642351 96721852 96862334 97075540 97292328 97516632 97747648 97944599 98107135 98280287
1839.7 98280287 98489213 98748708 99103105 99494034 99630189 99539608 99540162 99626851 99677235 99707061 99750268
1850.9 99750268 99793196 99826223 99853611 99880069 99910873 99942368 99970561 99994761 100024176 100057995 100086927 100122476
1863.1 100122476 100181103 100271094 100398922 100555861 100700307 100728321 100591028 100431752 100354886 100334823
1873.3 100334823 100331604 100332022 100338852 100360084 100398993 100452435 100517380 100591290 100679529 100782871 100884318 100973701
1885.6 100973701 101064503 101188028 101359332 101485324 101478708 101443279 101471567 101548731 101629555 101661777 101656413
$$ packed form
1809.1H5241842J117945Q80176O71166N66012N12874M80532M61376M44067M39936M65905
1819.3I1281831N09829N37330N59103O04451O31153M99261L31729L83181N33837N18036
1829.5I6389741K52610P9501J40482K13206K16788K24304K31016J96951J62536J73152
1839.7I8280287K08926K59495L54397L90929J36155r0581N54Q6689N0384K9826M3207
1850.9I9750268M2928L3027K7388K6458L0804L1495K8193K4200K9415L3819K8932L5549
1863.1A00122476N8627Q9991J27828J56939J44446K8014j37293j59276p6866k0063
1873.3A00334823l219M18O830K1232L8909N3442O4945P3910Q8239J03342J01447Q9383
1885.6A00973701R0802J23525J71304J25992o616l5429K8288P7164Q0824L2222n364
$$ plain form
1896.8 101656413 101661706 101680386 101699710 101720226 101744568 101771426 101796448 101814651 101832342 101866150 101908839 101942313
1909 101942313 101949680 101918876 101884639 101874173 101871908 101873648 101918578 102032959 102085006 101979494 101875651 101879704
1921.3 101879704 101939499 101950955 101886010 101826882 101812744 101819313 101831853 101846588 101859450 101875567 101900828 101924610
1933.5 101924610 101944602 101966596 101986742 102001595 102013648 102035058 102094376 102202630 102265644 102212679 102148378
1944.7 102148378 102133822 102123308 102105331 102095222 102089989 102087712 102087069 102086556 102092898 102101719 102103126 102100623 102100372 102103364
1959 102103364 102109325 102111506 102107656 102108216 102115369 102131510 102166474 102190328 102161348 102110052 102082205 102076721 102076328 102073073
1973.3 102073073 102069473 102070749 102076352 102078903 102079403 102082610 102082217 102073812 102062368 102053320 102045882 102038157 102035701 102044117
1987.5 102044117 102053189 102056003 102078283 102117991 102114856 102069592 102046335 102058518 102081287 102104211 102123582 102136087
$$ packed form
1896.8A01656413N293J8680J9324K0516K4342K6858K5022J8203J7691L3808M2689L3474
1909A01942313P367l0804l4237j0466k265J740M4930J14381N2047j05512j03843M053
1921.3A01879704N9795J1456o4945n9128j4138O569J2540J4735J2862J6117K5261K3782
1933.5A01924610J9992K1994K0146J4853J2053K1410N9318J08254O3014n2965o4301
1944.7A02148378j4556j0514j7977j0109n233k277o43n13O342Q821J407k503k51K992
1959A02103364N961K181l850N60P153J6141L4964K3854k8980n1296k7847n484l93l255
1973.3A02073073l600J276N603K551N00L207l93q405j1444r048p438p725k456Q416
1987.5A02044117R072K814K2280L9708l135m5264k3257J2183K2769K2924J9371J2505
$$ plain form
1999.8 102136087 102144337 102147496 102144814 102138388 102122915 102097201 102070522 102045679 102018380 101986539 101955116 101928830
2012 101928830 101903999 101879478 101863921 101859498 101841629 101799047 101755905 101723254 101699698 101690722 101689672 101688886 101699317
2025.3 101699317 101721239 101740849 101761782 101792884 101829600 101866722 101904869 101945865 101988065 102026165 102056062
2036.5 102056062 102079535 102098632 102114475 102129233 102137673 102137804 102135646 102129447 102119017 102109170 102097774 102082777 102068889
2049.8 102068889 102056825 102041280 102025771 102016020 102005386 101990306 101973677 101953304 101931393 101913583 101897252 101879013
2062 101879013 101866663 101867580 101866913 101857328 101857674 101873982 101898777 101927936 101960099 101994693 102027118 102060306 102097833
2075.3 102097833 102132785 102163017 102189529 102209961 102224946 102236152 102239692 102234948 102233005 102239823 102244985 102241015 102231979
2088.5 102231979 102220070 102203560 102182436 102160263 102141738 102128422 102115285 102097309 102079582 102066171 102052069
$$ packed form
1999.8A02136087Q250L159k682o426j5473k5714k6679k4843k7299l1841l1423k6286
2012A01928830k4831k4521j5557m423j7869m2582m3142l2651k3556q976j050p86J0431
2025.3A01699317K1922J9610K0933L1102L6716L7122L8147M0996M2200L8100K9897
2036.5A02056062K3473J9097J5843J4758Q440J31k158o199j0430r847j1396j4997j3888
2049.8A02068889j2064j5545j5509r751j0634j5080j6629k0373k1911j7810j6331j8239
2062A01879013j2350R17o67r585L46J6308K4795K9159L2163L4594L2425L3188L7527
2075.3A02097833L4952L0232K6512K0432J4985J1206L540m744j943O818N162l970r036
2088.5A02231979j1909j6510k1124k2173j8525j3316j3137j7976j7727j3411j4102
$$ plain form
2099.7 102052069 102032316 102006602 101980674 101959085 101940477 101922965 101906061 101890814 101869893 101841068 101814866
2110.9 101814866 101787722 101755774 101727235 101704264 101681256 101652658 101616657 101576674 101538908 101500642 101455867
2122.2 101455867 101404858 101352775 101305556 101256800 101201952 101152492 101112306 101077521 101049805 101029122 101015270
2133.4 101015270 101010334 101012588 101016414 101022828 101040936 101070225 101102996 101138341 101180363 101234710 101299405 101358712
2145.6 101358712 101406527 101457763 101522231 101592433 101660836 101729679 101797295 101856172 101912487 101973534 102028978
2156.8 102028978 102073300 102112007 102149987 102191007 102229166 102258933 102286398 102309763 102323437 102335966 102350020
2168 102350020 102358615 102360988 102356696 102348578 102341783 102335203 102330244 102327597 102320266 102304471 102286398 102275014 102269375 102262104
2182.3 102262104 102254331 102251506 102256560 102269638 102284122 102298510 102317727 102339613 102365661 102395964 102419853 102436018
$$ packed form
2099.7A02052069j9753k5714k5928k1589j8608j7512j6904j5247k0921k8825k6202
2110.9A01814866k7144l1948k8539k2971k3008k8598l6001l9983l7766l8266m4775
2122.2A01455867n1009n2083m7219m8756n4848m9460m0186l4785k7716k0683j3852
2133.4A01015270m936K254L826O414J8108K9289L2771L5345M2022N4347O4695N9307
2145.6A01358712M7815N1236O4468P0202O8403O8843O7616N8877N6315O1047N5444
2156.8A02028978M4322L8707L7980M1020L8159K9767K7465K3365J3674J2529J4054
2168A02350020Q595K373m292q118o795o580m959k647p331j5795j8073j1384n639p271
2182.3A02262104p773k825N054J3078J4484J4388J9217K1886K6048L0303K3889J6165
$$ plain form
2194.6 102436018 102449453 102461493 102475154 102490056 102504659 102519584 102534735 102550745 102563715 102570903 102576637 102581799
2206.8 102581799 102586496 102591693 102595663 102598929 102604485 102612221 102621889 102633047 102642882 102651381 102657139 102656853 102654552 102654243
2221.1 102654243 102649152 102636790 102628064 102626312 102622044 102610338 102596998 102592480 102596915 102597034 102592409 102594244 102601516 102606428
2235.4 102606428 102609837 102618313 102628946 102636766 102642596 102644265 102642989 102644241 102649224 102654612 102657580 102660620 102664924 102668691
2249.6 102668691 102671742 102669454 102662456 102659714 102660525 102659774 102659070 102662337 102668583 102670932 102670360 102674115 102676523 102671337 102668989
2264.9 102668989 102675951 102680171 102676129 102670717 102667177 102667201 102669609 102672291 102673030 102672863 102674377 102676558 102680361 102685058 102689779
2280.2 102689779 102692235 102691758 102692115 102693069 102690375 102686048 102687323 102689588 102684069 102668273 102648365 102635550 102627993 102614784
2294.5 102614784 102592134 102566874 102542734 102515852 102483487 102446187 102413619 102390647 102365816 102333999 102300084
$$ packed form
2194.6A02436018J3435J2040J3661J4902J4603J4925J5151J6010J2970P188N734N162
2206.8A02581799M697N197L970L266N556P736R668J1158R835Q499N758k86k301l09
2221.1A02654243n091j2362q726j752m268j1706j3340m518M435J19m625J835P272M912
2235.4A02606428L409Q476J0633P820N830J669j276J252M983N388K968L040M304L767
2249.6A02668691L051k288o998k742Q11p51p04L267O246K349n72L755K408n186k348
2264.9A02668989O962M220m042n412l540K4K408K682P39j67J514K181L803M697M721
2280.2A02689779K456m77L57R54k694m327J275K265n519j5796j9908j2815p557j3209
2294.5A02614784k2650k5260k4140k6882l2365l7300l2568k2972k4831l1817l3915
$$ plain form
2305.7 102300084 102267432 102235782 102202928 102175283 102162850 102162635 102163780 102166283 102173293 102180862 102179134 102165449 102155900
2319 102155900 102159357 102163494 102157629 102161968 102186513 102201521 102198136 102205956 102242887 102274847 102273607 102257657 102248979
2332.2 102248979 102255630 102264643 102253711 102227616 102199852 102179098 102184534 102187884 102161372 102146828 102156067 102168560
2344.5 102168560 102184260 102200294 102184665 102114153 102024508 101960003 101918125 101886499 101871216 101863265 101851344 101842344
2356.7 101842344 101842165 101837254 101816487 101784837 101760459 101760495 101769423 101759934 101755846 101784921 101806366 101794529 101789045
2370 101789045 101808846 101843393 101893783 101943243 101979887 102015615 102058208 102109849 102162123 102210200 102254248 102290809
2382.2 102290809 102327621 102370656 102412140 102441049 102458715 102478480 102502584 102524722 102540827 102547228 102546465 102543235
2394.4 102543235 102539885 102539742 102544188 102547538 102542925 102537763 102538276 102534509 102524829 102512956 102497399 102481723 102466667 102454197
$$ packed form
2305.7A02300084l2652l1650l2854k7645j2433k15J145K503P010P569j728j3685r549
2319A02155900L457M137n865M339K4545J5008l385P820L6931L1960j240j5950q678
2332.2A02248979O651R013j0932k6095k7764k0754N436L350k6512j4544R239J2493
2344.5A02168560J5700J6034j5629p0512q9645o4505m1878l1626j5283p951j1921r000
2356.7A01842344j79m911k0767l1650k4378L6Q928r489m088K9075K1445j1837n484
2370A01789045J9801L4547N0390M9460L6644L5728M2593N1641N2274M8077M4048L6561
2382.2A02290809L6812M3035M1484K8909J7666J9765K4104K2138J6105O401p63l230
2394.4A02543235l350j43M446L350m613n162N13l767r680j1873j5557j5676j5056j2470
$$ plain form
2408.7 102454197 102444386 102429438 102410150 102389348 102367187 102349114 102337635 102332139 102330661 102327538 102327466 102340281 102359247
2422 102359247 102373791 102384675 102397597 102418959 102450454 102483642 102513373 102545178 102580297 102611351 102634263 102655196
2434.2 102655196 102679181 102699804 102711844 102721190 102734363 102751434 102767265 102778244 102794397 102817059 102828693 102828181
2446.4 102828181 102831817 102841198 102845705 102848494 102851224 102848244 102849185 102856266 102856994 102855134 102858329 102863157 102865970 102864134 102863371
2461.7 102863371 102872872 102887464 102895570 102897525 102900243 102905393 102912617 102920032 102924347 102926350 102927923 102927506 102928579 102936864
2476 102936864 102946508 102949703 102949035 102949405 102954245 102962482 102969384 102975631 102976727 102975118 102979362 102982700 102985728 102993631 102997196
2491.3 102997196 102998459 103007436 103016222 103014791 103009975 103013062 103019249 103021431 103023076 103022230 103017688 103016245 103019023 103018534 103013098
2506.6 103013098 103006113 103001285 103001070 102994895 102982998 102976942 102970171 102962327 102959514 102957189 102954710 102953160 102954459 102957511
$$ packed form
2408.7A02454197r811j4948j9288k0802k2161j8073j1479n496j478l123p2J2815J8966
2422A02359247J4544J0884J2922K1362L1495L3188K9731L1805L5119L1054K2912K0933
2434.2A02655196K3985K0623J2040R346J3173J7071J5831J0979J6153K2662J1634n12
2446.4A02828181L636R381M507K789K730k980R41P081P28j860L195M828K813j836p63
2461.7A02863371R501J4592Q106J955K718N150P224P415M315K003J573m17J073Q285
2476A02936864R644L195o68L70M840Q237O902O247J096j609M244L338L028P903L565
2491.3A02997196J263Q977Q786j431m816L087O187K182J645q46m542j443K778m89n436
2506.6A03013098o985m828k15o175j1897o056o771p844k813k325k479j550J299L052
$$ plain form
2520.9 102957511 102957928 102958357 102961218 102967882 102976310 102983594 102993453 103003788 103007925 103013146 103029037 103046668 103061450 103079176
2535.2 103079176 103092337 103101456 103119755 103144193 103163135 103174710 103184295 103194749 103204560 103209484 103206861 103203475 103207469
2548.4 103207469 103213930 103215253 103211510 103205359 103203392 103201938 103196716 103194928 103189886 103177261 103165591 103156388 103148627 103142822
2562.7 103142822 103135896 103124774 103112841 103103793 103099561 103097188 103085518 103069365 103060389 103050971 103037083 103022802 103009748
2576 103009748 103001225 102991617 102973604 102954876 102938199 102917111 102897167 102881944 102860641 102834499 102815294 102799642
2588.2 102799642 102783179 102771103 102760994 102745032 102723885 102707899 102702677 102702415 102705669 102715302 102726698 102738643
2600.4 102738643 102755070 102774000 102790427 102802646 102811742 102820981 102833414 102852404 102879286 102907634 102934837 102962542
2612.7 102962542 102987015 103006995 103027451 103052068 103075421 103092659 103105283 103112233 103115690 103121531 103129613 103138137
$$ packed form
2520.9A02957511M17M29K861O664Q428P284R859J0335M137N221J5891J7631J4782J7726
2535.2A03079176J3161R119J8299K4438J8942J1575R585J0454R811M924k623l386L994
2548.4A03207469O461J323l743o151j967j454n222j788n042j2625j1670r203p761n805
2562.7A03142822o926j1122j1933r048m232k373j1670j6153q976r418j3888j4281j3054
2576A03009748q523r608j8013j8728j6677k1088j9944j5223k1303k6142j9205j5652
2588.2A02799642j6463j2076j0109j5962k1147j5986n222k62L254R633J1396J1945
2600.4A02738643J6427J8930J6427J2219R096R239J2433J8990K6882K8348K7203K7705
2612.7A02962542K4473J9980K0456K4617K3353J7238J2624O950L457N841Q082Q524
$$ plain form
2624.9 103138137 103145611 103151596 103160095 103165245 103162050 103162372 103167784 103167331 103164756 103169489 103171456 103161407 103153741 103158736
2639.2 103158736 103168786 103174031 103174126 103175461 103176987 103173006 103166676 103163636 103160882 103159964 103171253 103184760 103184164 103185344
2653.5 103185344 103198528 103211462 103224003 103239119 103251481 103260183 103270686 103281379 103287995 103290820 103292406 103299236
2665.7 103299236 103309917 103319275 103327537 103336012 103342104 103334022 103311253 103294563 103292048 103287482 103272867 103261220 103252614
2679 103252614 103236151 103227377 103238654 103248036 103237700 103217292 103201032 103188217 103171659 103151739 103135538 103124166
2691.2 103124166 103108466 103086424 103070128 103061414 103047705 103025389 103004670 102993023 102984929 102974284 102963078 102953696
2703.4 102953696 102947652 102941966 102926135 102907717 102903557 102907145 102910852 102918768 102931118 102945268 102956057 102957880 102958560
2716.7 102958560 102968335 102979815 102983785 102978384 102970719 102973282 102977967 102968800 102952433 102944469 102951372 102965117 102973843
$$ packed form
2624.9A03138137P474N985Q499N150l195L22N412m53k575M733J967j0049p666M995
2639.2A03158736J0050N245R5J335J526l981o330l040k754r18J1289J3507n96J180
2653.5A03185344J3184J2934J2541J5116J2362Q702J0503J0693O616K825J586O830
2665.7A03299236J0681R358Q262Q475O092q082k2769j6690k515m566j4615j1647q606
2679A03252614j6463q774J1277R382j0336k0408j6260j2815j6558j9920j6201j1372
2691.2A03124166j5700k2042j6296q714j3709k2316k0719j1647q094j0645j1206r382
2703.4A02953696o044n686j5831j8418m160L588L707P916J2350J4150J0789J823O80
2716.7A02958560R775J1480L970n401p665K563M685r167j6367p964O903J3745Q726
$$ plain form
2729.9 102973843 102973962 102964115 102948296 102934968 102928615 102919877 102901411 102892077 102903342 102923286 102940762 102951944 102962410
2743.2 102962410 102976513 102989638 102995718 102998984 103014886 103035784 103050232 103075206 103108644 103128636 103128159 103116858
2755.4 103116858 103113425 103120232 103124070 103127205 103136456 103145564 103149092 103146279 103142178 103143835 103150046 103151143 103145409 103142011
2769.7 103142011 103135049 103114903 103089380 103061128 103035915 103043592 103079438 103105128 103117907 103129196 103137314 103145611
2782 103145611 103159511 103175032 103186965 103188097 103169131 103129077 103090358 103081179 103088975 103095543 103097868 103082800 103053701
2795.2 103053701 103025651 102991879 102949619 102923119 102913022 102894807 102862191 102819109 102773404 102728903 102684867
2806.4 102684867 102649105 102613103 102561677 102511632 102479553 102458858 102440310 102416563 102386057 102349997 102307439
2817.6 102307439 102264214 102230740 102210248 102198803 102191627 102182698 102166855 102142775 102115262 102093518 102075028 102051151
$$ packed form
2729.9A02973843J19r847j5819j3328o353q738j8466r334J1265J9944J7476J1182J0466
2743.2A02962410J4103J3125O080L266J5902K0898J4448K4974L3438J9992m77j1301
2755.4A03116858l433O807L838L135R251R108L528k813m101J657O211J097n734l398
2769.7A03142011o962k0146k5523k8252k5213P677L5846K5690J2779J1289Q118Q297
2782A03145611J3900J5521J1933J132j8966m0054l8719r179P796O568K325j5068k9099
2795.2A03053701k8050l3772m2260k6500j0097j8215l2616m3082m5705m4501m4036
2806.4A02684867l5762l6002n1426n0045l2079k0695j8548k3747l0506l6060m2558
2817.6A02307439m3225l3474k0492j1445p176q929j5843k4080k7513k1744j8490k3877
$$ plain form
2829.9 102051151 102027488 102008224 101979506 101932526 101881015 101838779 101792145 101725173 101662016 101625121 101591706
2841.1 101591706 101531291 101441944 101338470 101218569 101066041 100890553 100727737 100587070 100445449 100295186
2851.3 100295186 100145423 100009453 99905401 99831581 99773914 99736339 99716038 99695963 99683130 99691850 99707574
2862.5 99707574 99704790 99675441 99625671 99568510 99513400 99447262 99354208 99235588 99087423 98914129 98775005
2873.7 98775005 98724127 98726684 98731637 98742664 98771507 98814124 98871553 98943835 99021161 99096423 99160033 99209583
2886 99209583 99254429 99294460 99329895 99358469 99371290 99373227 99371970 99359089 99324942 99288177 99279064 99287415 99277079
2899.2 99277079 99236149 99176085 99106586 99028653 98946565 98866397 98785299 98694295 98590142 98478597 98367643
2910.4 98367643 98260069 98151582 98058075 98004276 97968078 97915405 97851694 97789490 97720772 97625500 97490817
$$ packed form
2829.9A02051151k3663j9264k8718m6980n1511m2236m6634o6972o3157l6895l3415
2841.1A01591706o0415q9347j03474j19901j52528j75488j62816j40667j41621j50263
2851.3A00295186j49763j35970j04052p3820n7667l7575k0301k0075j2833Q720J5724
2862.5I9707574k784k9349m9770n7161n5110o6138r3054j18620j48165j73294j39124
2873.7I8775005n0878K557M953J1027K8843M2617N7429P2282P7326P5262O3610M9550
2886I9209583M4846M0031L5435K8574J2821J937j257j2881l4147l6765r113Q351j0336
2899.2I9277079m0930o0064o9499p7933q2088q0168q1098r1004j04153j11545j10954
2910.4I8367643j07574j08487r3507n3799l6198n2673o3711o2204o8718r5272j34683
$$ plain form
2921.7 97490817 97312236 97086561 96813440 96489918 96112978 95681477 95202059 94713002 94268233 93880481
2931.9 93880481 93547970 93300420 93152744 93094122 93108070 93164361 93230319 93287826 93334484 93367535 93375659
2943.1 93375659 93357337 93312413 93210870 93028826 92772311 92426705 91968185 91418517 90835726 90275145
2953.3 90275145 89777505 89379847 89115638 88993591 88997501 89112103 89314234 89555001 89789641 89983076
2963.5 89983076 90086693 90068972 89928263 89664733 89295757 88860816 88396949 87938249 87510127 87118638
2973.7 87118638 86764240 86450571 86176610 85945749 85777915 85674733 85614824 85605383 85670853 85813141
2983.9 85813141 86025554 86312234 86670846 87086868 87551934 88062578 88616782 89204693 89798766 90378004
2994.1 90378004 90944874 91506124 92051566 92564309 93041778 93481427 93872255 94213182 94504672 94753784
$$ packed form
2921.7I7490817j78581k25675k73121l23522l76940m31501m79418m89057m44769l87752
2931.9I3880481l32511k47550j47676n8622J3948N6291O5958N7507M6658L3051Q124
2943.1I3375659j8322m4924j01543j82044k56515l45606m58520n49668n82791n60581
2953.3I0275145m97640l97658k64209j22047L910J14602K02131K40767K34640J93435
2963.5H9983076J03617j7721j40709k63530l68976m34941m63867m58700m28122l91489
2973.7H7118638l54398l13669k73961k30861j67834j03182n9909r441O5470J42288
2983.9H5813141K12413K86680L58612M16022M65066N10644N54204N87911N94073N79238
2994.1I0378004N66870N61250N45442N12743M77469M39649L90828L40927K91490K49112
$$ plain form
3004.3 94753784 94979060 95182276 95356369 95507878 95650351 95791113 95939654 96101087 96263605 96435100
3014.5 96435100 96631116 96833134 97032207 97238594 97437465 97619885 97798014 97965091 98115844 98266649
3024.7 98266649 98417723 98554701 98675627 98786026 98896044 99005616 99102747 99188262 99274254 99373376
3034.9 99373376 99481821 99584740 99684030 99776912 99848139 99906182 99970740 100044060 100110769 100155711 100195014
3046.1 100195014 100243223 100279319 100278962 100236213 100177515 100133932 100096357 100047469 99988747 99916458 99827546 99745643
3058.3 99745643 99682325 99613476 99535406 99469292 99422419 99388927 99354231 99313205 99288523 99298680 99331516 99367774
3070.6 99367774 99409163 99463451 99527216 99601221 99680871 99746311 99797714 99858719 99932492 100005758 100071895 100112891
3082.8 100112891 100115764 100099635 100083315 100056076 100004864 99930274 99834150 99730492 99641895 99567789 99487275
$$ packed form
3004.3I4753784K25276K03216J74093J51509J42473J40762J48541J61433J62518J71495
3014.5I6435100J96016K02018J99073K06387J98871J82420J78129J67077J50753J50805
3024.7I8266649J51074J36978J20926J10399J10018J09572R7131Q5515Q5992R9122
3034.9I9373376J08445J02919R9290R2882P1227N8043O4558P3320O6709M4942L9303
3046.1A00195014M8209L6096l57m2749n8698m3583l7575m8888n8722p2289q8912q1903
3058.3I9745643o3318o8849p8070o6114m6873l3492l4696m1026k4682J0157L2836L6258
3070.6I9367774M1389N4288O3765P4005P9650O5440N1403O1005P3773P3266O6137M0996
3082.8A00112891K873j6129j6320k7239n1212p4590r6124j03658q8597p4106q0514
$$ plain form
3094 99487275 99404109 99340540 99301499 99281251 99280542 99308246 99366498 99440378 99517816 99611068 99729383 99855179
3106.2 99855179 99969667 100077534 100199747 100340593 100483251 100614643 100730467 100834477 100932181 101028049
3116.4 101028049 101124823 101205432 101265585 101340497 101444888 101547015 101621699 101684833 101758575 101831698 101884162
3127.7 101884162 101919472 101951921 101993966 102048743 102103746 102147090 102177262 102195013 102203798 102209258 102217174 102242196
3139.9 102242196 102287185 102329171 102358103 102386963 102414167 102428210 102437723 102452064 102467811 102477074 102475417 102471304
3152.1 102471304 102477646 102498102 102530015 102568722 102601039 102622128 102633488 102635217 102639019 102648807 102660894 102670598
3164.4 102670598 102677310 102684188 102683806 102683473 102694499 102708292 102717948 102726090 102735281 102740920 102745152 102761650 102785194 102795446
3178.6 102795446 102794361 102797091 102803612 102810597 102818942 102823818 102823091 102823293 102827191 102831507 102835584 102841902 102854502 102865922
$$ packed form
3094I9487275q3166o3569l9041k0248p09K7704N8252P3880P7438R3252J18315J25796
3106.2I9855179J14488J07867J22213J40846J42658J31392J15824J04010R7704R5868
3116.4A01028049R6774Q0609O0153P4912J04391J02127P4684O3134P3742P3123N2464
3127.7A01884162L5310L2449M2045N4777N5003M3344L0172J7751Q785N460P916K5022
3139.9A02242196M4989M1986K8932K8860K7204J4043R513J4341J5747R263j657m113
3152.1A02471304O342K0456L1913L8707L2317K1089J1360J729L802R788J2087R704
3164.4A02670598O712O878l82l33J1026J3793R656Q142R191N639M232J6498K3544J0252
3178.6A02795446j085K730O521O985Q345M876p27K02L898M316M077O318J2600J1420
$$ plain form
3192.9 102865922 102867830 102870917 102876067 102881289 102890289 102890706 102879345 102873683 102889466 102918231 102937412 102944136 102946627
3206.2 102946627 102946472 102952754 102970994 102983999 102985692 102994752 103014898 103029394 103036702 103041005 103037322 103035581 103040755
3219.4 103040755 103040218 103039026 103044558 103044856 103042817 103052127 103066528 103077841 103091300 103101516 103098297 103083479 103056431
3232.7 103056431 103038883 103061724 103109479 103146636 103161907 103160346 103152204 103150308 103156412 103166699 103180480 103191876
3244.9 103191876 103183699 103158307 103156769 103187752 103213620 103223264 103232706 103248739 103259468 103247929 103234529 103247535
3257.2 103247535 103270578 103287101 103296924 103298819 103300536 103309071 103327048 103342342 103337538 103323710 103315568 103306055 103284144
3270.4 103284144 103270602 103299618 103346360 103364909 103365505 103374624 103390288 103404856 103418887 103433764 103444719 103447747
3282.7 103447747 103452086 103458571 103457224 103454602 103459823 103464770 103458703 103434515 103402591 103392363 103404832 103418350 103433204
$$ packed form
3192.9A02865922J908L087N150N222R000M17j1361n662J5783K8765J9181O724K491
3206.2A02946627j55O282J8240J3005J693R060K0146J4496P308M303l683j741N174
3219.4A03040755n37j192N532K98k039R310J4401J1313J3459J0216l219j4818k7048
3232.7A03056431j7548K2841M7755L7157J5271j561q142j896O104J0287J3781J1396
3244.9A03191876q177k5392j538L0983K5868R644R442J6033J0729j1539j3400J3006
3257.2A03247535K3043J6523R823J895J717Q535J7977J5294m804j3828q142r513k1911
3270.4A03284144j3542K9016M6742J8549N96R119J5664J4568J4031J4877J0955L028
3282.7A03447747M339O485j347k622N221M947o067k4188l1924j0228J2469J3518J4854
$$ plain form
3295.9 103433204 103458428 103485191 103500426 103503704 103500664 103490233 103462780 103419673 103383136 103374743 103394127 103419507
3308.2 103419507 103434384 103450620 103475523 103494453 103497338 103486490 103478372 103482068 103488517 103491724 103494012 103501976 103510761
3321.4 103510761 103506172 103495276 103478432 103446543 103435242 103460836 103482759 103491986 103501403 103499854 103493488 103499579 103505969
3334.7 103505969 103499603 103481746 103449118 103419602 103428090 103454995 103465080 103475404 103499937 103522396 103528070 103522658
3346.9 103522658 103515494 103500533 103476357 103471553 103507173 103547168 103558159 103556323 103558350 103563702 103565347 103550255 103527594
3360.2 103527594 103524315 103539789 103553903 103556073 103535140 103489411 103447247 103422284 103409195 103423822 103469527 103513324
3372.4 103513324 103532708 103536534 103531528 103520620 103518009 103525031 103528798 103534186 103551412 103567016 103564513 103552353 103546238
3385.7 103546238 103545392 103541231 103524184 103482389 103426671 103403592 103438234 103483105 103489053 103477776 103474903 103461254
$$ packed form
3295.9A03433204K5224K6763J5235L278l040j0431k7453m3107l6537q393J9384K5380
3308.2A03419507J4877J6236K4903J8930K885j0848q118L696O449L207K288P964Q785
3321.4A03510761m589j0896j6844l1889j1301K5594K1923R227R417j549o366O091O390
3334.7A03505969o366j7857l2628k9516Q488K6905J0085J0324K4533K2459N674n412
3346.9A03522658p164j4961k4176m804L5620L9995J0991j836K027N352J645j5092k2661
3360.2A03527594l279J5474J4114K170k0933m5729m2164k4963j3089J4627M5705M3797
3372.4A03513324J9384L826n006j0908k611P022L767N388J7226J5604k503j2160o115
3385.7A03546238q46m161j7047m1795n5718k3079L4642M4871N948j1277k873j3649
$$ plain form
3397.9 103461254 103418624 103359556 103320920 103334630 103396487 103458595 103476536 103464532 103448284 103415787 103374231
3409.1 103374231 103363371 103371215 103355205 103327799 103320336 103332794 103347456 103347981 103339756 103333890 103318155 103288198 103255939
3422.4 103255939 103224075 103188550 103145623 103104234 103058970 102990866 102917981 102877438 102880895 102888954 102842689 102748358
3434.6 102748358 102683079 102680004 102709520 102772224 102856374 102923834 102969313 102985406 102968001 102953720 102973962 103008866
3446.8 103008866 103026080 103028417 103031552 103033781 103038180 103053045 103073406 103101254 103128731 103134489 103121960 103103304
3459.1 103103304 103102851 103155017 103225696 103245378 103220582 103181398 103113091 103032815 102981102 102977872 103062499 103205240
3471.3 103205240 103304803 103344429 103357613 103345251 103311133 103269672 103214502 103163862 103183460 103262568 103308582
3482.5 103308582 103292525 103242648 103177381 103127086 103127241 103156340 103162456 103131926 103075218 103016996 102977693 102956605
$$ packed form
3397.9A03461254m2630n9068l8636J3710O1857O2108J7941j2004j6248l2497m1556
3409.1A03374231j0860P844j6010k7406p463J2458J4662N25q225n866j5735k9957l2259
3422.4A03255939l1864l5525m2927m1389m5264o8104p2885m0543L457Q059m6265r4331
3434.6A02748358o5279l075K9516O2704Q4150O7460M5479J6093j7405j4281K0242L4904
3446.8A03008866J7214K337L135K229M399J4865K0361K7848K7477N758j2529j8656
3459.1A03103304m53N2166P0679J9682k4796l9184o8307q0276n1713l230Q4627J42741
3471.3A03205240R9563L9626J3184j2362l4118m1461n5170n0640J9598P9108M6014
3482.5A03308582j6057m9877o5267n0295J55K9099O116l0530n6708n8222l9303k1088
$$ plain form
3494.8 102956605 102937639 102894676 102838838 102813506 102820516 102807546 102754092 102718115 102725458 102715325 102669954 102647114
3507 102647114 102661467 102666044 102622688 102540064 102449286 102364039 102312410 102309644 102306020 102277935 102250159 102227449
3519.3 102227449 102204633 102180004 102133965 102051294 101987243 101992416 102022958 102033448 102010965 101942444 101847386 101764917
3531.5 101764917 101705682 101654828 101601934 101544464 101497424 101491308 101508260 101500237 101459575 101404297 101376820 101402354
3543.7 101402354 101430953 101455426 101519942 101570165 101555204 101533353 101556230 101623034 101681137 101679158 101654816 101660192
3556 101660192 101692390 101732373 101785171 101837349 101858330 101899397 102021635 102199662 102421904 102677643 102838755
3567.2 102838755 102795243 102602112 102425504 102382934 102443182 102530718 102610409 102669287 102717268 102762675 102800596
3578.4 102800596 102832568 102838302 102806735 102797973 102843559 102901280 103017998 103272402 103507578 103514409 103321946
$$ packed form
3494.8A02956605j8966m2963n5838k5332P010j2970n3454l5977P343j0133m5371k2840
3507A02647114J4353M577m3356q2624r0778q5247n1629k766l624k8085k7776k2710
3519.3A02227449k2816k4629m6039q2671o4051N173L0542J0490k2483o8521r5058q2469
3531.5A01764917n9235n0854n2894n7470m7040o116J6952q023m0662n5278k7477K5534
3543.7A01402354K8599K4473O4516N0223j4961k1851K2877O6804N8103j979k4342N376
3556A01660192L2198L9983N2798N2178K0981M1067J22238J78027K22242K55739J61112
3567.2A02838755m3512j93131j76608m2570O0248Q7536P9691N8878M7981M5407L7921
3578.4A02800596L1972N734l1567q762M5586N7721J16718K54404K35176O831j92463
$$ plain form
3589.6 103321946 103102446 103012681 103071392 103169906 103221750 103208137 103121066 103014004 102953756 102940643 102939904
3600.8 102939904 102892482 102800143 102733254 102723444 102784550 102908158 103010941 103018117 102912748 102789962 102789795
3612.1 102789795 102830076 102738392 102573669 102484322 102533162 102649486 102683008 102545583 102289486 102069283
3622.2 102069283 101969612 101963985 102012789 102136838 102407813 102766252 102841687 102482569 102097940 101943564
3632.4 101943564 101946032 101923895 101835942 101782644 101792562 101807690 101803756 101809800 101850975 101902735 101939654 102027261
3644.7 102027261 102261221 102625370 102958369 103142214 103183353 103035951 102726007 102442753 102357769 102498233
3654.9 102498233 102726555 102781761 102613997 102477920 102477705 102532494 102593374 102657354 102727604 102803922 102903020
3666.1 102903020 103080487 103387523 103751719 103978932 103938305 103738499 103713560 104075909 104574335 104599559
$$ packed form
3589.6A03321946k19500q9765N8711R8514N1844j3613q7071j07062o0248j3113p39
3600.8A02939904m7422r2339o6889r810O1106J23608J02783P176j05369j22786j67
3612.1A02789795M0281r1684j64723q9347M8840J16324L3522j37425k56097k20203
3622.2A02069283r9671n627M8804J24049K70975L58439P5435l59118l84629j54376
3632.4A01943564K468k2137q7953n3298R918J5128l934O044M1175N1760L6919Q7607
3644.7A02027261K33960L64149L32999J83845M1139j47402l09944k83254q4984J40464
3654.9A02498233K28322N5206j67764j36077k15N4789O0880O3980P0250P6318R9098
3666.1A02903020J77467L07036L64196K27213m0627j99806k4939L62349M98426K5224
$$ plain form
3676.3 104599559 104214573 103933382 103851676 103791440 103707159 103677118 103698492 103734648 103805077 103972304 104279494
3687.5 104279494 104603910 104702902 104647851 104546869 104337990 104137886 104061806 104057455 104070032 104077160 104085374
3698.7 104085374 104157507 104338455 104514289 104482460 104300070 104181600 104173362 104238677 104392660 104633105
3708.9 104633105 104846084 104971647 105060112 104949820 104641199 104408836 104316831 104303861 104344928 104390287
3719.1 104390287 104409301 104470491 104580271 104601943 104553103 104579163 104638040 104588664 104444098 104360795 104451227
3730.3 104451227 104710162 104976547 105087376 105188239 105325186 105268085 105018103 104748654 104576540 104539061
3740.5 104539061 104582536 104754210 105246925 105776536 105561483 105035007 104873550 105113196 105421031 105477810
3750.7 105477810 105434680 105296135 104934800 104645002 104594374 104638064 104662871 104721797 104766178 104646850 104456019
$$ packed form
3676.3A04599559l84986k81191q1706o0236q4281l0041K1374L6156P0429J67227L07190
3687.5A04279494L24416R8992n5051j00982k08879k00104p6080m351J2577P128Q214
3698.7A04085374P2133J80948J75834l1829j82390j18470q238O5315J53983K40445
3708.9A04633105K12979J25563Q8465j10292l08621k32363r2005j2970M1067M5359
3719.1A04390287J9014O1190J09780K1672m8840K6060N8877m9376j44566q3303R0432
3730.3A04451227K58935K66385J10829J00863J36947n7101k49982k69449j72114l7479
3740.5A04539061M3475J71674M92715N29611k15053n26476j61457K39646L07835N6779
3750.7A05477810m3130j38545l61335k89798n0628M3690K4807N8926M4381j19328j90831
$$ plain form
3762 104456019 104364884 104414475 104557669 104641187 104577839 104542172 104671991 104781783 104644096 104416716 104303932
3773.2 104303932 104275012 104264760 104279256 104343271 104467201 104594290 104580951 104435194 104344416 104362535 104417181
3784.4 104417181 104431760 104385090 104332244 104300177 104274607 104257071 104259717 104275703 104302251 104381001 104540229
3795.6 104540229 104669571 104629076 104538333 104630923 104955125 105205488 105023301 104658127 104492092 104610038
3805.8 104610038 104834604 104819608 104557991 104349172 104275119 104256070 104268706 104374814 104655337 104989386
3816 104989386 104990089 104737461 104688334 104965734 105261624 105163538 104782283 104495537 104421914 104484248 104525781
3827.2 104525781 104454696 104381263 104435599 104581487 104649293 104599988 104607725 104698682 104792905 104975808 105129910
3838.4 105129910 105039442 104892445 104791224 104701436 104659879 104570544 104386508 104262590 104248679 104286957 104375565
$$ packed form
3762A04456019r1135M9591J43194Q3518o3348l5667J29819J09792j37687k27380j12784
3773.2A04303932k8920j0252J4496O4015J23930J27089j3339j45757r0778J8119N4646
3784.4A04417181J4579m6670n2846l2067k5570j7536K646J5986K6548P8750J59228
3795.6A04540229J29342m0495r0743R2590L24202K50363j82187l65174j66035J17946
3805.8A04610038K24566j4996k61617k08819p4053j9049J2636J06108K80523L34049
3816A04989386P03k52628m9127K77400K95890r8086l81255k86746p3623O2334M1533
3827.2A04525781p1085p3433N4336J45888O7806m9305P737R0957R4223J82903J54102
3838.4A05129910r0468j46997j01221q9788m1557q9335j84036j23918j3911L8278Q8608
$$ plain form
3849.7 104375565 104566479 104959226 105501199 105832505 105628026 105085564 104675961 104485595 104372418 104340684
3859.9 104340684 104433990 104565930 104644370 104725170 104810977 104708755 104497719 104500437 104795539 105046141 104899502
3871.1 104899502 104618919 104558015 104649138 104600191 104395282 104262984 104302621 104496217 104718697 104721332 104522145
3882.3 104522145 104411376 104507959 104689074 104698968 104464066 104262209 104280674 104481208 104669785 104619563
3892.5 104619563 104421020 104290605 104239345 104246974 104372668 104597771 104769742 104788613 104791451 104840720 104848182
3903.7 104848182 104790676 104629266 104411137 104247296 104168570 104152405 104161012 104168081 104168177 104188287 104251194 104349315
3915.9 104349315 104447877 104477060 104432201 104384041 104335511 104291058 104309881 104371464 104391491 104327285 104243231
3927.2 104243231 104231930 104276037 104318869 104358149 104379380 104339600 104254794 104180646 104141033 104132819 104140759 104156291
$$ packed form
3849.7A04375565J90914L92747N41973L31306k04479n42462m09603j90366j13177l1734
3859.9A04340684R3306J31940P8440Q0800Q5807j02222k11036K718K95102K50602j46639
3871.1A04899502k80583o0904R1123m8947k04909j32298L9637J93596K22480K635j99187
3882.3A04522145j10769R6583J81115R894k34902k01857J8465K00534J88577n0222
3892.5A04619563j98543j30415n1260P629J25694K25103J71971J8871K838M9269P462
3903.7A04848182n7506j61410k18129j63841p8726j6165Q607P069R6K0110O2907R8121
3915.9A04349315R8562K9183m4859m8160m8530m4453J8823O1583K0027o4206q4054
3927.2A04243231j1301M4107M2832L9280K1231l9780q4806p4148l9613q214P940J5532
$$ plain form
3939.4 104156291 104180050 104219890 104281795 104306459 104251361 104192805 104200363 104248285 104269707 104251850 104218113 104177141
3951.6 104177141 104150176 104141557 104139578 104148507 104161370 104158962 104142654 104138505 104160202 104185605 104184365 104167795 104166484
3964.9 104166484 104170227 104166627 104171431 104183459 104187596 104186201 104187655 104184139 104174411 104174793 104184139 104183471 104170370 104163444
3979.2 104163444 104165077 104163611 104154265 104131508 104104722 104090393 104086685 104090869 104108620 104130602 104141998 104139483 104125369
3992.4 104125369 104112136 104105067 104096544 104086483 104074788 104056370
3998.5 104056370
$$ packed form
3939.4A04156291K3759L9840O1905K4664n5098n8556P558M7922K1422j7857l3737m0972
3951.6A04177141k6965q619j979Q929J2863k408j6308m149K1697K5403j240j6570j311
3964.9A04166484L743l600M804J2028M137j395J454l516r728L82R346o68j3101o926
3979.2A04163444J633j466r346k2757k6786j4329l708M184J7751K1982J1396k515j4114
3992.4A04125369j3233p069q523j0061j1695j8418
3998.5A04056370
##END=$$ End of the data block
