##TITLE=MV - 90F 92 - Filme sobre cela de ZnSe $$ Begin of the data block
##JCAMP-DX=5.00 $$ ACD/SpecManager v 10.08
##SPECTROMETER/DATA SYSTEM=Alpha
##DATE=09 Oct 2013 09:47:52
##DATA TYPE=INFRARED SPECTRUM
##DATA CLASS=XYDATA
##ORIGIN=
##OWNER=
##NPOINTS=3334
##FIRSTX=599.63525391
##LASTX=3998.58886719
##MAXX=3998.58886719
##MINX=599.63525391
##MAXY=1.12311685
##MINY=0.05155439
##XFACTOR=1.0000000000
##YFACTOR=0.000000010000000
##FIRSTY=0.81046081
##DELTAX=1.01978803
##XUNITS=1/CM
##YUNITS=ARBITRARY UNITS
##XYDATA=(X++(Y..Y))
599.6H1046081M57549M21321M16893M14413L83669L32815L16321L29942L09336K80512
$$ 81046081 81503630 81924951 82341844 82756257 83139926 83472741 83789062 84119004 84428340 84708852
609.8H4708852K72715K67589K52563K20990J89352J81377J82676J52886J00809P4160
$$ 84708852 84981567 85249156 85501719 85722709 85912061 86093438 86276114 86429000 86529809 86603969
620H6603969Q3781P6061L7634K4766J9825k194P8J8269J9091J6212K9284N1308N4848
$$ 86603969 86687750 86763811 86801445 86826211 86846036 86843842 86843920 86862189 86881280 86897492 86926776 86978084 87032932
633.3H7032932L3498P528P158L6073N5951N8937N1582M0591N2291O4605N2852N8275
$$ 87032932 87066430 87073958 87081116 87117189 87173140 87232077 87283659 87324250 87376541 87441146 87493998 87552273
645.5H7552273R2668J18547J08415Q2398Q1128R5242J16461J42521J46323J25748J07867
$$ 87552273 87644941 87763488 87871903 87954301 88035429 88130671 88247132 88389653 88535976 88661724 88769591
656.7H8769591R7179Q4442R2226J11980J10030J05733J08081J04022R4121P6503M3189
$$ 88769591 88866770 88951212 89043438 89155418 89265448 89371181 89479262 89583284 89677405 89753908 89797097
668H9797097J2339k2000o6752q8018j15681j47539j40387j49554j86133j79750j58334
$$ 89797097 89809436 89787436 89720684 89632666 89516985 89369446 89229059 89079505 88893372 88713622 88555288
679.2H8555288j45781j14977j07747j13011p8493o2382j17207k00540k95222m15641
$$ 88555288 88409507 88294530 88186783 88073772 87995279 87932897 87815690 87615150 87319928 86904287
689.4H6904287n36525o24424o58357o47331o09403n06711l22140j12253Q6093K88182
$$ 86904287 86367762 85743338 85084981 84437650 83828247 83321536 82999396 82887143 82973236 83261418
699.6H3261418N02074O80161P79658Q17239Q33059Q32665Q07017P57503O96773O41697
$$ 83261418 83763492 84443653 85223311 86040550 86873609 87706274 88513291 89270794 89967567 90609264
709.8I0609264N84561N20188M58622L75616K69795J80673R0063l1942j52058k59703
$$ 90609264 91193825 91714013 92172635 92548251 92818046 92998719 93088782 93056840 92904782 92645079
720I2645079l98845n70905p26652q21519q53991q09479o27220l07780O2149M02171
$$ 92645079 92246234 91675329 90948677 90127158 89273167 88463688 87836468 87528688 87590837 87993008
730.2H7993008O58840P82662P64895O46526M98318L72374K77299K11108J72627J55466
$$ 87993008 88651848 89434510 90199405 90845931 91344249 91716623 91993922 92205030 92377657 92533123
740.4I2533123J42950J31589J11628N5200j7721n8376o1179l2514L4881J26695K24621
$$ 92533123 92676073 92807662 92919290 92974490 92956769 92898393 92837214 92804700 92839581 92966276 93190897
751.6I3190897L19713L99887M61930N11384N31638N06038M68814M32777L58195K41220
$$ 93190897 93510610 93910497 94372427 94883811 95415449 95921487 96390301 96823078 97181273 97422493
761.8I7422493J22505K4939n8169j07115j01435o8498j3465O8569J31029J81538K51526
$$ 97422493 97544998 97569937 97511768 97404653 97303218 97234720 97221255 97289824 97420853 97602391 97853917
773I7853917K85238K71392K50983K21795J68544R8270M1413J4365J9074N3960J19644
$$ 97853917 98139155 98410547 98661530 98883325 99051869 99150139 99191552 99205917 99224991 99278951 99398595
784.2I9398595K02638K59769K88939L07143K98178K74206K54702K25103J70207J02162
$$ 99398595 99601233 99861002 100149941 100457084 100755262 101029468 101284170 101509273 101679480 101781642
794.4A01781642N8067L7086P284l1734n9998p2813p2038n1880j8835N138L219L660
$$ 101781642 101839709 101876795 101884079 101852345 101792347 101719534 101647496 101595616 101576781 101581919 101585138 101588798
806.6A01588798K5141K7036K1673K9003K4581L8231O7925P4661O7580M8792J5605q405
$$ 101588798 101613939 101640975 101662648 101691651 101716232 101754463 101822388 101897049 101964629 102013421 102029026 102020621
818.9A02020621j4722n2893j49513k55882l35098l96204m54878n01150n20194n15485
$$ 102020621 102005899 101953006 101803493 101547611 101212513 100816309 100361431 99860281 99340087 98824602
829.1I8824602m85152m13137l05939k07847j43969j15347j42956k29484l38471m44561
$$ 98824602 98339450 97926313 97620374 97412527 97268558 97153211 97010255 96780771 96442300 95997739
839.3I5997739n40954n98562n76329m85820l67373k49058j72156j78033k84100m86582
$$ 95997739 95456785 94858223 94281894 93796074 93428701 93179643 93007487 92829454 92545354 92058772
849.5I2058772p51484j017433j216018j294357j237702j045561p19404k91181J70589
$$ 92058772 91307288 90289855 89073837 87779480 86541778 85496217 84776813 84485632 84656221
858.7H4656221N92589R40812J190519J306182J281172J132632Q97622O23458L51769
$$ 84656221 85248810 86189622 87380141 88686323 89967495 91100127 91997749 92621207 92972976
867.8I2972976J30331j3154r2298j32203j30022q0311l1889j7094K390M0960Q9228
$$ 92972976 93103307 93090153 92997855 92865652 92735630 92655319 92623430 92606336 92608726 92649686 92738914
879.1I2738914J68205K72590L71766M63778N49453O12462O53720O81442O89154O73503
$$ 92738914 92907119 93179709 93551475 94015253 94564706 95177168 95830888 96512330 97201484 97874987
889.3I7874987O31791N64492M94892M36282L70455K93636K05231J06537J5473p0297
$$ 97874987 98506778 99071270 99566162 100002444 100372899 100666535 100871766 100978303 100993776 100923479
899.4A00923479j45317j89018j97863j91903j89841j89275k01922k53755l77006o06155
$$ 100923479 100778162 100589144 100391281 100199378 100009537 99820262 99618340 99364585 98987579 98381424
909.6I8381424r33981j255906j398295j223671p03728J5670O62595J030075J081676
$$ 98381424 97447443 96191537 94793242 93569571 92865843 92881513 93544108 94574183 95655859
918.8I5655859Q93771N84632K70683L2496r1016r8598j6242J13326K53236L58016L90929
$$ 95655859 96549630 97134262 97404945 97437441 97346425 97247827 97231585 97344911 97598147 97956163 98347092
930I8347092L48174K29508M7970j83684m60231p56586j029396j231718j320428j258087
$$ 98347092 98695266 98924774 98972744 98789060 98328829 97572243 96542847 95311129 93990701 92732614
940.2I2732614j026547o68329l00723m0740N6631j7035k25509m90707p20167q19766
$$ 92732614 91706067 91037738 90737015 90696275 90752906 90735871 90510362 90019655 89299488 88479722
950.4H8479722p34038m74339j10060K37268M58479N26023M65476L29954K12317J81598
$$ 88479722 87745684 87271345 87161285 87398553 87857032 88383055 88848531 89178485 89390802 89572400
960.6H9572400K33072L19153L87335L93206L00151J05643j73861n02926q10754j026291
$$ 89572400 89805472 90124625 90511960 90905166 91205317 91310960 91137099 90634173 89823419 88797128
970.8H8797128j072037q99577n24789l267N49996R99457J273978J362657J284921J097733
$$ 88797128 87725091 86825514 86300725 86297458 86847454 87846911 89120889 90483546 91768467 92866200
981I2866200Q78018O82211N27698M14509L33702K49720J40971K2107r5737k28518l95405
$$ 92866200 93744218 94426429 94954127 95368636 95702338 95952058 96093029 96115136 96019399 95790881 95395476
992.2I5395476n93919q11154j037925j261342j475680j680189j845449j945400j968634
$$ 95395476 94801557 93990403 92952478 91691136 90215456 88535267 86689818 84744418 82775784
1001.4H2775784j915694j808107j651603j437538j179916r19056p13563o29568o98936
$$ 82775784 80860090 79051983 77400380 75962842 74782926 73863870 73150307 72520739 71821803
1010.6G1821803r23306j265991j628220j911181k062416k075219j966727j765960j513207
$$ 71821803 70898497 69632506 68004286 66093105 64030689 61955470 59988743 58222783 56709576
1019.8E6709576j245493r92221p74467o09892n10490m80569n27507o46347q10474r77707
$$ 56709576 55464083 54471862 53697395 53087503 52577013 52096444 51568937 50922590 50112116 49134409
1030D9134409j069054j007527p77989m06146O0901N45439R62594J234329J307857J226336
$$ 49134409 48065355 47057828 46279839 45873693 45934594 46480033 47442627 48676956 49984813 51211149
1040.2E1211149J111304J094365J282180J696002K253068K811992L205407L286600
$$ 51211149 52322453 53416818 54698998 56395000 58648068 61460060 64665467 67952067
1048.3F7952067K980005K290929J324183K41976q11916j725119k416504k823692k917767
$$ 67952067 70932072 73223001 74547184 74789160 73977244 72252125 69835621 67011929 64094162
1057.5F4094162k732551k347273j855415j330894q18622l44145R9211N45651J011312
$$ 64094162 61361611 59014338 57158923 55828029 55009407 54665262 54764473 55310124 56321436
1066.7E6321436J487500J956719K372289K686429K891349K984709K951085K805156
$$ 56321436 57808936 59765655 62137944 64824373 67715722 70700431 73651516 76456672
1074.9G6456672K586365K314067K010578J709520J424802J157641R04691O62279M34846
$$ 76456672 79043037 81357104 83367682 85077202 86502004 87659645 88564336 89226615 89661461
1084H9661461K12795k0904k75683n58800q52036j106125j268059j293755j159286q67802
$$ 89661461 89874256 89853352 89577669 89018869 88166833 87060708 85792649 84498894 83339608 82471806
1094.2H2471806m56339n162L93855O73479Q08400P95692O44380L89159P0375k86132
$$ 82471806 82015467 82010305 82404160 83077639 83886039 84681731 85326111 85715270 85785645 85499513
1104.4H5499513o76352j089894j481027j795953j994068k018654j812869j390350q22443
$$ 85499513 84823161 83733267 82252240 80456287 78462219 76443565 74630696 73240346 72417903
1113.6G2417903j91665L98755Q43358J050938R47397N37384p4643p50881j383692j910210
$$ 72417903 72226238 72624993 73468351 74519289 75466686 76004070 75929427 75178546 73794854 71884644
1123.8G1884644k298766k538658k640831k633220k528006k325964k058893j773232
$$ 71884644 69585878 67047220 64406389 61773169 59245163 56919199 54860306 53087074
1132E3087074j491422j222527j002604q75082q52427r34887j112104j350367j603725
$$ 53087074 51595652 50373125 49370521 48495439 47643012 46708125 45596021 44245654 42641929
1141.1D2641929j824844j968792j986680j849535j568907j172519o92376j61672L90401
$$ 42641929 40817085 38848293 36861613 35012078 33443171 32270652 31578276 31416604 31807005
1150.3C1807005R35010J441034J878667K217954K442676K540043K500308K356636K146909
$$ 31807005 32742015 34183049 36061716 38279670 40722346 43262389 45762697 48119333 50266242
1159.5E0266242J895654J634199J377129J125640Q75199O16157L48967P5543k02596
$$ 50266242 52161896 53796095 55173224 56298864 57174063 57790220 58139187 58214730 58012134
1168.7E8012134m78292p49296j023358j289868j505137j604819j502496j132426n06588
$$ 58012134 57533842 56784546 55761188 54471320 52966183 51361364 49858868 48726442 48219854
1177.8D8219854K89061J136869J898692K432227K655595K562058K200401J659185J041579
$$ 48219854 48508915 49645784 51544476 53976703 56632298 59194356 61394757 63053942 64095521
1187F4095521M45914n6201m23098o22987o36065m70507j53035K91174Q18724J356774
$$ 64095521 64541435 64485234 64062136 63439149 62803084 62332577 62179542 62470716 63289440 64646214
1197.2F4646214J831258K179563K350330K330303K150488J853573J489526J114494
$$ 64646214 66477472 68657035 71007365 73337668 75488156 77341729 78831255 79945749
1205.4G9945749P62796M36485J39946j27685l86608o52897r31698j226205j537215
$$ 79945749 80708545 81145030 81284976 81157291 80770683 80117786 79186088 77959883 76422668
1214.6G6422668j861066k197987k541339k868170l135550l300452l332496l203827
$$ 76422668 74561602 72363615 69822276 66954106 63818556 60518104 57185608 53981781
1222.7E3981781k920175k525037k059710j571316j115206p28839m29067k16666q4567
$$ 53981781 51061606 48536569 46476859 44905543 43790337 43061498 42632431 42415765 42331198
1231.9D2331198j8188P835K0474M0090Q2916J55347K44907L48401M64863N77363O68764
$$ 42331198 42313010 42320845 42341319 42381409 42464325 42619672 42864579 43212980 43677843 44255206 44923970
1243.1D4923970P31084P53948P23302O38983N13056L56102J80957J8760j16554k40069
$$ 44923970 45655054 46409002 47132304 47771287 48284343 48640445 48821402 48840162 48723608 48483539
1253.3D8483539l73307n37896p40606r69958j202822j407605j546210j579446j496860
$$ 48483539 48110232 47572336 46831730 45861772 44658950 43251345 41705135 40125689 38628829
1262.5C8628829j316396j051167p24709l76853n7828J82083L02586K76500J16932j30597
$$ 38628829 37312433 36261266 35536557 35159704 35101876 35283959 35586545 35863045 35979977 35849380
1272.7C5849380m01893o44004q13258q80235q37508o91116m68281j85501J41197M82941
$$ 35849380 35447487 34803483 33990225 33109990 32272482 31581366 31113085 30927584 31068781 31551722
1282.9C1551722Q25441J167705J474428J716546J876241J907435J792976J549035J200578
$$ 31551722 32377163 33544868 35019296 36735842 38612083 40519518 42312494 43861529 45062107
1292.1D5062107Q36506O05369N95936P80624R97374J046288Q62327N12731J33753j18375
$$ 45062107 45898613 46503982 47099918 47880542 48877916 49924204 50786531 51299262 51433015 51314640
1302.3E1314640j65141j5026L15088P69973J259524J724982K114785K372926K494144
$$ 51314640 51149499 51134473 51449561 52219534 53479058 55204040 57318825 59691751 62185895
1311.4F2185895K497668K389419K225542K063810J902122J736551J565987J366562
$$ 62185895 64683563 67072982 69298524 71362334 73264456 75001007 76566994 77933556
1319.6G7933556J142078R36711P39074N31054L11797Q0556j54531l95316o37609q69464
$$ 77933556 79075634 80012345 80751419 81282473 81594270 81674826 81520295 81124979 80487370 79617906
1329.8G9617906j062632j209164j299601j313830j231867j089561r25660p77179p58070
$$ 79617906 78555274 77346110 76046509 74732679 73500812 72411251 71485591 70708412 69950342
1339F9950342r24605j117057j117080q77303l81839L45027J152861J873988K382881
$$ 69950342 69025737 67908680 66791600 65914297 65532458 65877485 67030346 68904334 71287215
1348.2G1287215K596849K504402K200318J797348J357371R21565N10466J29515k21723
$$ 71287215 73884064 76388466 78588784 80386132 81743503 82665068 83175534 83305049 83083326
1357.3H3083326n85848r67718j430058k000004k694941l489893l836918l729904l365409
$$ 83083326 82497478 81529760 80099702 78099698 75404757 71914864 68077946 64348042 60982633
1366.5F0982633k557004j428223j62762J024091J914466K470296K757121K650535K231019
$$ 60982633 58425629 56997406 56834644 57858735 59773201 62243497 65000618 67651153 69882172
1375.7F9882172J835525J511354J151400P81578M50284J52427j16987l55047n32746
$$ 69882172 71717697 73229051 74380451 75162029 75612313 75764740 75647753 75292706 74759960
1384.9G4759960o48200q33083j079666j047617q74859p45780n74064l34853j62595
$$ 74759960 74111760 73278677 72199011 71151394 70276535 69530755 68956691 68621838 68459243
1394F8459243j15532l219K19292M15075M31996L24661K73758K61104K00552O4432j95056
$$ 68459243 68343711 68340492 68559784 68974859 69406855 69731516 70005274 70266378 70466930 70531362 70336306
1405.3G0336306m33153n48786o65897p97546r36663j072770j221061j333749j420594
$$ 70336306 69903153 69354367 68688470 67890924 66954261 65881491 64660430 63326681 61906087
1414.4F1906087j490736j563334j568770j780767k481663k458864k002576k039460
$$ 61906087 60415351 58852017 57283247 55502480 53020817 50561953 48559377 46519917
1422.6D6519917k328342k465904k330076k216036k146717k057305k066338j959178
$$ 46519917 44191575 41725671 39395595 37179559 35032842 32975537 30909199 28950021
1430.8B8950021j628793j404747j197493q85938p59387r29098p48543m29884m10499
$$ 28950021 27321228 25916481 24718988 23833050 23073663 22144565 21396022 20966138 20555639
1439.9B0555639m38601m42267m02965l38107k34479j06469Q622Q4248J96962L68522
$$ 20555639 20117038 19674771 19271806 18933699 18699220 18592751 18601373 18685621 18882583 19251105
1450.1A9251105N31227P26749R33891J175727J406129J808695K196527J882958J418457
$$ 19251105 19782332 20509081 21442972 22618699 24024828 25833523 28030050 29913008 31331465
1459.3C1331465J041552O61883L24651J03841p4721j39370P4547L82653O37183Q74576
$$ 31331465 32373017 33034900 33359551 33463392 33388671 33249301 33323848 33706501 34343684 35218260
1469.5C5218260J106310J391917J685783J774225J795521K041033K390376K395788
$$ 35218260 36324570 37716487 39402270 41176495 42972016 45013049 47403425 49799213
1477.7D9799213K426788K592987K664155K571314K327407K146780K097213K188385
$$ 49799213 52226001 54818988 57483143 60054457 62381864 64528644 66625857 68814242
1485.8F8814242K421319K550704K510684K628082K422560J869303J634019J580376
$$ 68814242 71235561 73786265 76296949 78925031 81347591 83216894 84850913 86431289
1494H6431289J540255J496399J179850Q74966P75576N88006N38587N77229N87363P24828
$$ 86431289 87971544 89467943 90647793 91522759 92298335 92886341 93424928 94002157 94589520 95314348
1504.2I5314348R98831J024442L29841j28699q4990N9110J98334K32745J64753K31725
$$ 95314348 96313179 97337621 97667462 97538763 97453773 97512883 97711217 97943962 98108715 98340440
1514.4I8340440L94255M24337J71954p588K51752M86887K23839j92356j51450N9039
$$ 98340440 98734695 99159032 99330986 99323398 99575150 100062037 100285876 100093520 99942070 100001109
1524.6A00001109Q2326j9205l1447o5691q1682N4139K32291L11721M5037k89035k00665
$$ 100001109 100083435 100064230 100032783 99967092 99885410 99939549 100171840 100483561 100528598 100239563 100038898
1535.8A00038898J02687M47512O09576J63603k81310k98822l11983j92439j77968l19826
$$ 100038898 100141585 100589097 101198673 101362276 101080966 100782144 100470161 100277722 100099754 99779928
1546I9779928k61212n6618O5327n3072k21104j25134Q2284N490k07800K9952M62508
$$ 99779928 99518716 99462098 99527425 99474353 99253249 99128115 99210399 99215889 99008089 99038041 99500549
1557.2I9500549M82935l61532j177925r88335n04332k79916k84135m57746m97824l20512
$$ 99500549 99983484 99621952 98444027 97455692 96951360 96671444 96387309 95929563 95431739 95111227
1567.4I5111227j76740m32539q59886p86597o09785m93479l11458l90464r97174j069402
$$ 95111227 94934487 94501948 93642062 92855465 92245680 91752201 91440743 91050279 90053105 88983703
1577.6H8983703p88904p47585p83157q38560r18359j036054j160723j325440j515341
$$ 88983703 88194799 87447214 86664057 85825497 84907138 83871084 82710361 81384921 79869580
1586.8G9869580j745540j986426k257180k520281k748328k947128l151357l362209
$$ 79869580 78124040 76137614 73880434 71360153 68611825 65664697 62513340 59151131
1594.9E9151131l446996l484953l480443l457639l399712l341218l261406l186434
$$ 59151131 55704135 52219182 48738739 45281100 41881388 38540170 35278764 32092330
1603.1C2092330l077495k902779k783491k669665k492038k294436k097709j808643
$$ 32092330 29014835 26112056 23328565 20658900 18166862 15872426 13774717 11966074
1611.3A1966074j559990j318902j036009q06133q23680p35118l24492j42702o3609
$$ 11966074 10406084 9087182 8051173 7245040 6421360 5686242 5361750 5219048 5155439
1620.4E155439L9552J63001K87164M45390N56485O66976Q10355R24126R62581R90250
$$ 5155439 5194991 5357992 5645156 6090546 6647031 7314007 8124362 9048488 10011069 11001319
1630.6A1001319J021267J012331R94300J026195J139930J081112J058261J147199J277460
$$ 11001319 12022586 13034917 14029217 15055412 16195342 17276454 18334715 19481914 20759374
1639.8B0759374J458511J659666J878385K062425K357879K957413L344565L296316
$$ 20759374 22217885 23877551 25755936 27818361 30176240 33133653 36478218 39774534
1648C9774534L253827L127554L075242L641471N029929M140865K607745K434522K550453
$$ 39774534 43028361 46155915 49231157 52872628 57902557 62043422 64651167 67085689 69636142
1657.1F9636142K538008K345228K137065J961082J846463J534903J118117R60624R51064
$$ 69636142 72174150 74519378 76656443 78617525 80463988 81998891 83117008 84077632 85028696
1666.3H5028696R50062R37909O97369L36128J97190J51843K56973L48539L3128k87891
$$ 85028696 85978758 86916667 87614036 87950164 88147354 88299197 88556170 88904709 88937837 88649946
1676.5H8649946j54048n78J8466m8167K5898K77549K20812o32853j017212o23078n32215
$$ 88649946 88495898 88495320 88513786 88465619 88491517 88769066 88989878 88357025 87339813 86716735 86184520
1687.7H6184520p24960r60934j171279j292586j319278j188445j338446k433222k687759
$$ 86184520 85459560 84498626 83327347 82034761 80715483 79527038 78188592 75755370 73067611
1696.9G3067611j721406j407587k660924m080683k738387k139383k624738l115839
$$ 73067611 71346205 69938618 67277694 63197011 60458624 58319241 55694503 52578664
1705.1E2578664l441456l669989l538817l550372l853375l856632l548181l250243
$$ 52578664 49137208 45467219 41928402 38378030 34524655 30668023 27119842 23869599
1713.2B3869599l185343k942956k303320k063492k011483j282213p15922m85090k68564
$$ 23869599 20684256 17741300 15437980 13374488 11363005 10080792 9364870 8879780 8611216
1722.4H611216k6915K56087N35876Q72009J225016J646669K217144K816700L140395
$$ 8611216 8584301 8840388 9376264 10248273 11473289 13119958 15337102 18153802 21294197
1731.6B1294197L655574N206567O620804N756491N149081N434424N672568N903495
$$ 21294197 24949771 30156338 36777142 42533633 47682714 53117138 58789706 64693201
1739.7F4693201N206447M038132L665310L348666K721393K280683K040410J787102
$$ 64693201 69899648 73937780 77603090 80951756 83673149 85953832 87994242 89781344
1747.9H9781344J500857J253956J113743Q40419O05506O34611P27868P51352O02806
$$ 89781344 91282201 92536157 93649900 94490319 95095825 95730436 96458304 97209656 97812462
1757.1I7812462M07898L95865N13643N54674L49313J33574J66047K48444L15190L67593
$$ 97812462 98220360 98616225 99129868 99684542 100033855 100167429 100333476 100581920 100897110 101264703
1767.3A01264703K62928J57893K93183M23622J87409j44946q8418N6088N4693N6005
$$ 101264703 101527631 101685524 101978707 102402329 102589738 102444792 102356374 102412462 102467155 102523160
1777.5A02523160J31035J86515J35624K6953M1354J42324J54722M6956M959O1179J29664
$$ 102523160 102654195 102840710 102976334 103003287 103044641 103186965 103341687 103388643 103393602 103454781 103584445
1788.7A03584445K09510K77066K40052J3423j48940m2045O9546O5565J02854J75739
$$ 103584445 103793955 104071021 104311073 104324496 104175556 104133511 104203057 104268622 104371476 104547215
1798.9A04547215J41084O3002L5107J931M375N3501Q5283R0539P8738R9182J17934
$$ 104547215 104688299 104751301 104786408 104788339 104792714 104846215 104931498 105022037 105100775 105199957 105317891
1810.1A05317891N2595j5235L218M2773O2036O8999N4478K9278K5559M0972N2357P5650
$$ 105317891 105370486 105355251 105358469 105401242 105463278 105532277 105586755 105616033 105641592 105682564 105734921 105810571
1822.3A05810571J37627J81556N8806q7762K992J91510J94251n6541j79469q0216j681
$$ 105810571 105948198 106129754 106188560 106100798 106103790 106295300 106489551 106433010 106253541 106173325 106171644
1833.6A06171644J9645M8602N5337J6272r465O235M1198J01280K08652K18118n1844
$$ 106171644 106191289 106239891 106295228 106311500 106302035 106308270 106349468 106450748 106659400 106877518 106825674
1844.8A06825674k06316p8130r53k9111l4857j0502J728L016L696R167K0420K1303
$$ 106825674 106619358 106541228 106540275 106511164 106476307 106465805 106467533 106470549 106474245 106483412 106503832 106525135
1857A06525135J4281R644J0431R358K217R66J7631N5528J00290J28079J08480j1575
$$ 106525135 106539416 106549060 106559491 106568849 106571066 106572032 106589663 106645191 106745481 106873560 106982040 106970465
1869.3A06970465j46735j36494n6482r453O533J0538J4114J8180J4829Q262R417J4103
$$ 106970465 106823730 106687236 106630754 106621301 106627834 106638372 106652486 106670666 106685495 106693757 106703174 106717277
1881.5A06717277J9800K3329J6404P021J8358O2406J02365M5026o2680o3181P03M2093
$$ 106717277 106737077 106760406 106776810 106783831 106802189 106864595 106966960 107011986 106949306 106886125 106886828 106928921
1893.7A06928921M2116K969j7596k276J0359J4591J5712J6999J9813J8727J3459J6606
$$ 106928921 106971037 106974006 106956410 106954134 106964493 106979084 106994796 107011795 107031608 107050335 107063794 107080400
1906A07080400L1793L6264K5367l135l4952k7549l159M089J3887O0308J09887L3129
$$ 107080400 107112193 107148457 107173824 107170689 107135737 107108188 107105029 107109118 107123005 107183313 107293200 107326329
1918.2A07326329r3115o2501L8254O6042N055n4419m1688l850J8751K7371K3460J7583
$$ 107326329 107233214 107170713 107208967 107275009 107280064 107225645 107183957 107180107 107198858 107226229 107249689 107267272
1930.4A07267272J9634K4569K4557K7121L1781K8097K0230K0564L9446P9918J09303
$$ 107267272 107286906 107311475 107336032 107363153 107394934 107423031 107443261 107463825 107503271 107583189 107692492
1941.7A07692492M6647n5635n0486L624J0539Q10M447R274J1528J1229J1277J4568
$$ 107692492 107739139 107683504 107633018 107636642 107647181 107647991 107652438 107661712 107673240 107684469 107695746 107710314
1953.9A07710314J0073K897K110l994q833j31K014o830m042J1003K4426L3164J4043
$$ 107710314 107720387 107723284 107725394 107721400 107712567 107712436 107714450 107707620 107703578 107714581 107739007 107772171 107786214
1967.2A07786214l3831m6098j6821L93l266n591j859J394p27l910N13M339N12l325
$$ 107786214 107752383 107706285 107689464 107689857 107686591 107681000 107679141 107680535 107679808 107675898 107676411 107680750 107681262 107677937
1981.4A07677937k420Q82R77k348M411J7678J5283J2565L4117L8183j0133m8101l3545
$$ 107677937 107675517 107676399 107677376 107675028 107679439 107697117 107712400 107724965 107759082 107797265 107787132 107739031 107705486
1994.7A07705486o449O651J2196P224q4M494O092J025J168j907r358r012k754L147
$$ 107705486 107699037 107705688 107717884 107725108 107725024 107729518 107735610 107736635 107737803 107735896 107726538 107717526 107714772 107717919
2009A07717919O187M542j705o008k014R787J6749j669k7061l0970k3091j3936o604
$$ 107717919 107724106 107728648 107726943 107720935 107718921 107728708 107745457 107743788 107716727 107685757 107662666 107648730 107642126
2022.2A07642126o199p021l553k980j1778j6963j1659j2731j7560j6594j5807j3149
$$ 107642126 107635927 107628906 107625353 107622373 107610595 107593632 107581973 107569242 107551682 107535088 107519281 107506132
2034.5A07506132r215q368q035q595j0264r107n627m220o652q941n960l505p427r453
$$ 107506132 107496917 107488549 107480514 107471919 107461655 107452548 107446921 107442701 107436049 107427108 107421148 107417643 107410216 107400763
2048.7A07400763n794p462j2791r740n209m125m232r942r298N364Q989k444m816M041
$$ 107400763 107394969 107387507 107374716 107364976 107359767 107355642 107351410 107341468 107332170 107337534 107346523 107344079 107339263 107343304
2063A07343304J1230L111j3244j2624J442O807K384J597M960O139R739J8907K2638
$$ 107343304 107354534 107357645 107344401 107331777 107333219 107340026 107342410 107344007 107348967 107355106 107364845 107383752 107406390
2076.3A07406390J6534J0550J0455J3518J3089Q667Q297J2409J4913J2303Q511Q798
$$ 107406390 107422924 107433474 107443929 107457447 107470536 107479203 107487500 107499909 107514822 107527125 107535636 107544434
2088.5A07544434P987L016j061j430j097r5j991q393q189m65O437O688J43m781m231
$$ 107544434 107552421 107555437 107554376 107552946 107551849 107551754 107549763 107541370 107533181 107532716 107539153 107545841 107545984 107541203 107536972
2103.8A07536972K396J2755J4401J0168P987L648K944P534P737K599L099O485K444
$$ 107536972 107539368 107552123 107566524 107576692 107584679 107588327 107591271 107598805 107606542 107609141 107612240 107618725 107621169
2117.1A07621169k718l242Q22M995J991m208n389l159l552q786r846o175k420O437
$$ 107621169 107618451 107615209 107616031 107621026 107623017 107618809 107613420 107610261 107606709 107597923 107588077 107581902 107579482 107585919
2131.3A07585919J0323K885J347J1707J2695K289L779J3745J7357J8036J9837K5999
$$ 107585919 107596242 107599127 107600474 107612181 107624876 107627165 107630944 107644689 107662046 107680082 107699919 107725918
2143.6A07725918L5727L1221J7882J8584K4999K9456L2783L1197K7036K1303K2984
$$ 107725918 107761645 107792866 107810748 107829332 107854331 107883787 107916570 107947767 107974803 107996106 108019090
2154.8A08019090K9182K1577R835J2254K1959K4426J6403Q297P761N602L362Q810J3983
$$ 108019090 108048272 108069849 108079684 108091938 108113897 108138323 108154726 108163023 108170784 108176386 108179748 108188558 108202541
2168A08202541J5426J5258Q905j180j19J0586J6558J4496P879K611L064O962Q523N925
$$ 108202541 108217967 108233225 108242130 108240950 108240831 108251417 108267975 108282471 108290350 108292961 108296025 108302987 108311510 108317435
2182.3A08317435J943j752j574O080R000L505J895K086N603R751L934j549m971j0336
$$ 108317435 108319378 108317626 108316052 108322132 108331132 108334637 108336532 108338618 108344221 108353972 108357906 108356357 108351386 108341050
2196.6A08341050o902j311l875j1003j8847k2924k4700k8205l1829l2293k6668j3041
$$ 108341050 108334148 108332837 108328962 108317959 108299112 108276188 108251488 108223283 108191454 108159161 108132493 108119452
2208.8A08119452M172J9670L2997L9685M4954N2833N4884N3787M8280L8791L9160M1211
$$ 108119452 108123624 108143294 108176291 108215976 108260930 108313763 108368647 108422434 108470714 108509505 108548665 108589876
2221.1A08589876L5226L1078K9945K8086L0947L5763L2699K8479K9468K4593K0015
$$ 108589876 108625102 108656180 108686125 108714211 108745158 108780921 108813620 108842099 108871567 108896160 108916175
2232.3A08916175K5690K6202K1208K1696K1040J6320J7190K0480J5104J1599J4126
$$ 108916175 108941865 108968067 108989275 109010971 109032011 109048331 109065521 109086001 109101105 109112704 109126830
2243.5A09126830J1110M018J478R763J8442J5235P486J514K146R143Q929K933K324
$$ 109126830 109137940 109141958 109143436 109153199 109171641 109186876 109194362 109195876 109198022 109207165 109216094 109219027 109221351
2256.8A09221351J204m494n472j275k39n054j2458j1909l099k003l922R6K253N913
$$ 109221351 109222555 109218061 109212589 109211314 109211075 109206021 109193563 109181654 109178555 109176552 109172630 109172726 109174979 109180892
2271A09180892J3351K0194K5070K6297K4569J9253J4889J5247J9490J8859R561P236
$$ 109180892 109194243 109214437 109239507 109265804 109290373 109309626 109324515 109339762 109359252 109378111 109387672 109394908
2283.3A09394908J2374J0955L469J931Q738J0562j573j0145K802J9145K2816J6952
$$ 109394908 109407282 109418237 109421706 109423637 109432375 109442937 109441364 109431219 109434021 109453166 109475982 109492934
2295.5A09492934J0895J0169J1373Q976j037k301Q166J1814O878l81p165j2374j5116
$$ 109492934 109503829 109513998 109525371 109534347 109533310 109531009 109539175 109550989 109557867 109557486 109550321 109537947 109522831
2308.8A09522831n817R489Q011l70n865l111J5259K7644K8360K4915J7011J5080J9145
$$ 109522831 109517014 109526503 109534514 109534144 109528279 109525168 109540427 109568071 109596431 109621346 109638357 109653437 109672582
2322A09672582J6415J4341J6761K4009M1163M9972L7015J1229K4J2422K2018K2280
$$ 109672582 109688997 109703338 109720099 109744108 109785271 109835243 109872258 109883487 109883511 109895933 109917951 109940231
2334.3A09940231J9049J2017J2767K6739K7168L278k349J1540l6l8445q1372j13058
$$ 109940231 109959280 109971297 109984064 110010803 110037971 110041249 110038900 110050440 110050404 110011959 109930587 109817529
2346.5A09817529r9266j8656P7724J30165J33431J26600J26457J21236J01316P5996
$$ 109817529 109718263 109699607 109777331 109907496 110040927 110167527 110293984 110415220 110516536 110592532
2356.7A10592532O4492N2190J2076m2558p3015p4458p1931p9668q3256p4911q5556
$$ 110592532 110657024 110709214 110721290 110678732 110605717 110531259 110459328 110379660 110296404 110221493 110135937
2367.9A10135937j13499j05310p0035m9651l4881k9170m0364m7553m0484k6249j5843
$$ 110135937 110022438 109917128 109847093 109797442 109762561 109733391 109693027 109645474 109604990 109578741 109562898
2379.1A09562898r358k837o0J121L242M864L540L58Q46M41o43k063o795p856q249r596
$$ 109562898 109553540 109550703 109550643 109551764 109555006 109559870 109563410 109563768 109564614 109565055 109564412 109562349 109555554 109547698 109539449 109529853
2395.5A09529853p391o545j2612j8847j2064j621n460j2839j3685j3340j3768j2672
$$ 109529853 109522462 109515917 109503305 109484458 109472394 109470773 109465313 109452474 109438789 109425449 109411681 109399009
2407.7A09399009m792j348o914q154p331r596p880k193J549N388L577k265J871O950
$$ 109399009 109394217 109392869 109385955 109377801 109370470 109360874 109352994 109350801 109352350 109357738 109361315 109359050 109360921 109367871
2422A09367871L10j1277j5080m518J0204J2875O056P260J3852J0121P736J2267J1647
$$ 109367871 109368181 109356904 109341824 109337306 109347510 109360385 109366441 109373701 109387553 109397674 109405410 109417677 109429324
2435.2A09429324P724L732J084K385P033R167P498J2875J4830N114N019J1217N603
$$ 109429324 109437048 109440780 109441864 109444249 109451282 109460449 109467947 109480822 109495652 109500766 109505785 109517002 109522605
2448.5A09522605l362o91N448q11p927p046p796o115m18J491j848o211L93J3173J2958
$$ 109522605 109519243 109518552 109524000 109523189 109515262 109508216 109500420 109494305 109493887 109495378 109493530 109487319 109487712 109500885 109513843
2463.8A09513843O211K420k337k992J896O818Q583L279r668k1434j8251n364k027o795
$$ 109513843 109520054 109522474 109520137 109517145 109519041 109525859 109534442 109537721 109528053 109506619 109488368 109483004 109480977 109474182
2478.1A09474182r775j0455p939n436k527K515l636j1122p105n078l267j275p546j3196
$$ 109474182 109464407 109453952 109446013 109440577 109438050 109440565 109436929 109425807 109418702 109413624 109410357 109409082 109401536 109388340
2492.3A09388340j1099r310j1873j1742n794l58k408l731K503L291l148m088L337J1600
$$ 109388340 109377241 109367931 109356058 109344316 109338522 109338164 109335756 109332025 109334528 109337819 109334671 109330583 109333920 109345520
2506.6A09345520J1014P010O676J692k098K754N007P069R668M113k969m899n01N353
$$ 109345520 109356534 109363544 109370220 109371912 109369814 109372568 109377575 109384644 109394312 109398425 109395456 109390557 109390056 109395409
2520.9A09395409M983K336K647M017R06q750j4138j0002q392j0240r001j0419j2385
$$ 109395409 109400392 109402728 109405375 109409392 109410298 109401548 109387410 109377408 109369016 109358776 109349775 109339356 109326971
2534.1A09326971j1290j5771j6415j1611j7965j9193p128p057j9527k2435j5259j3363
$$ 109326971 109315681 109299910 109283495 109271884 109253919 109234726 109227598 109220541 109201014 109178579 109163320 109149957
2546.4A09149957j5068q858o425j5962k0027j8871j6117j1516j2386j3923j7286k2041
$$ 109149957 109134889 109126031 109119606 109103644 109083617 109064746 109048629 109037113 109024727 109010804 108993518 108971477
2558.6A08971477k0051j5390j2720j2374j5330j4758o783l910o092n484o950r405q488
$$ 108971477 108951426 108936036 108923316 108910942 108895612 108880854 108874071 108870161 108864069 108858585 108851635 108842230 108833742
2571.9A08833742n889n936j2839j4544r310j8072k8980k3127j6140k1291k8897k5272
$$ 108833742 108827853 108821917 108809078 108794534 108785224 108767152 108738172 108715045 108698905 108677614 108648717 108623445
2584.1A08623445k2161k5403k0671j3447j1718j3292j6988k2363k5296j8251j1206
$$ 108623445 108601284 108575881 108555210 108541763 108530045 108516753 108499765 108477402 108452106 108433855 108422649
2595.3A08422649j4711j8513k0754k4331k0194j2171j0395j2600j4568j3935j0896
$$ 108422649 108407938 108389425 108368671 108344340 108324146 108311975 108301580 108288980 108274412 108260477 108249581
2606.6A08249581p272k444n12m602o640l600n758j2195j4639j9562k6762k6608k5093
$$ 108249581 108242309 108239865 108239353 108234751 108228111 108224511 108218753 108206558 108191919 108172357 108145595 108118987 108093894
2619.8A08093894k4748k1339k2292l1865l8158l4118k6930j9383j8632k2042k0647
$$ 108093894 108069146 108047807 108025515 107993650 107955492 107921374 107894444 107875061 107856429 107834387 107813740
2631A07813740k5988l5453l3545k1732j8394k6011j6475N471Q357R54J31j753r238
$$ 107813740 107787752 107752299 107718754 107697022 107678628 107652617 107636142 107641613 107649970 107650924 107651055 107649302 107640064
2644.3A07640064j9288k3330k3627k8646k8348k2828k8098l7193l4416l4249m0758
$$ 107640064 107620776 107597446 107573819 107545173 107516825 107493997 107465899 107428706 107394290 107360041 107319283
2655.5A07319283l5631k4319k5654l9565m2773l2496k6321k4820k0182r096J91j287
$$ 107319283 107283652 107259333 107233679 107194114 107151341 107118845 107092524 107067704 107047522 107038426 107038617 107037330
2667.7A07037330m030O712J7130P665j716J5092L3056K2734J5223L5119M9448M0054
$$ 107037330 107033300 107040012 107057142 107064807 107063091 107078183 107111239 107133973 107149196 107184315 107233763 107273817
2680A07273817M2534O3693O3563M3988L2318K6691K2554K0945J2744N257R966O985
$$ 107273817 107316351 107380044 107443607 107487595 107519913 107546604 107569158 107590103 107602847 107608104 107618070 107625055
2692.2A07625055o997r430n161p415j5855k3914k0456j5628j8251k2388l1685l5167
$$ 107625055 107618058 107608628 107603467 107596052 107580197 107556283 107535827 107520199 107501948 107479560 107447875 107412708
2704.5A07412708k6667k9672m1031m0353l8278l5023k3425k1470k8979k9207k8169
$$ 107412708 107386041 107356369 107315338 107274985 107236707 107201684 107178259 107156789 107127810 107098603 107070434
2715.7A07070434l0661k8288k6250l4189n1010n3847k3019L6k5165n0914k0278L1853
$$ 107070434 107039773 107011485 106985235 106951046 106900036 106846189 106823170 106823206 106798041 106747127 106726849 106758702
2727.9A06758702M3738K6107J0693j061o485n234l731j6606l1626j8334M267R585R42
$$ 106758702 106802440 106828547 106839240 106838179 106831694 106826460 106822729 106806123 106774497 106756163 106760430 106770015 106770957
2741.2A06770957j4556k2876j7142j8728m3643n9223l0184j979q82J2183J8406j454
$$ 106770957 106756401 106733525 106716383 106697655 106654012 106594789 106564605 106562626 106561744 106573927 106592333 106590879
2753.4A06590879k5237m2581m0651k6381k9957m6790m9722m1508l6753m2748n2154
$$ 106590879 106565642 106523061 106482410 106456029 106426072 106379282 106329560 106288052 106251299 106208551 106156397
2764.6A06156397n0461m3238m0578m0091l8516l8159m5753n9175p1979o7997j7011
$$ 106156397 106105936 106062698 106022120 105982029 105943513 105905354 105859601 105800426 105728447 105660450 105643439
2775.8A05643439K9910J1182k2841l0589k7931k8598k8503k3043k2674l5584o4039
$$ 105643439 105673349 105684531 105661690 105631101 105603170 105574572 105546069 105523026 105500352 105464768 105400729
2787.1A05400729j00171r4986m2379k2865l5870m0245n8818q2826r2375j17600j34266
$$ 105400729 105300558 105205572 105163193 105140328 105104458 105064213 105005395 104922569 104830194 104712594 104578328
2798.3A04578328q6987m9519q0061j20247j35171j33610j36578j51694j63627j78849
$$ 104578328 104491341 104441822 104361761 104241514 104106343 103972733 103836155 103684461 103520834 103341985
2808.5A03341985k00880j86336j49298j51848j80984k00641k08581k15518k28107k39503
$$ 103341985 103141105 102954769 102805471 102653623 102472639 102271998 102063417 101847899 101619792 101380289
2818.7A01380289k41042k39873k45952k55859k57349k52837k60192k70367k68483k63876
$$ 101380289 101139247 100899374 100653422 100397563 100140214 99887377 99627185 99356818 99088335 98824459
2828.9I8824459k69890k84415k90185k85524k90561k94578k87718l27319l93033l53437
$$ 98824459 98554569 98270154 97979969 97694445 97403884 97109306 96821588 96494269 96101236 95747799
2839.1I5747799k38675k14958k94173l74532m18067m55856n20033n74857n60760n16981
$$ 95747799 95509124 95294166 94999993 94625461 94207394 93751538 93231505 92656648 92095888 91578907
2849.3I1578907n30464n94306o60401p13951p55643q08198q86172r69678j065153j177960
$$ 91578907 91048443 90454137 89793736 89079785 88324142 87515944 86629772 85660094 84594941 83416981
2859.5H3416981j245493j288760j401621j554430j681315j780826j843971j867456
$$ 83416981 82171488 80882728 79481107 77926677 76245362 74464536 72620565 70753109
2867.6G0753109j869493j839680j766270j657695j497322j225424q73351n88775l92830
$$ 70753109 68883616 67043936 65277666 63619971 62122649 60897225 60023874 59435099 59042269
2876.8E9042269j93840J6325K05541L77816N42808O90561Q17865R22960J003582J071947
$$ 59042269 58848429 58864754 59070295 59448111 59990919 60681480 61499345 62422305 63425887 64497834
2887F4497834J124198J153183J162517J145059J103532J049405R71711Q65525P89851
$$ 64497834 65622032 66775215 67937732 69082791 70186323 71235728 72207439 73072964 73862815
2896.2G3862815P72494P18385N88590M57805L58278K72846J92189J43308J44136J43230
$$ 73862815 74635309 75353694 75942284 76400089 76758367 77031213 77223402 77366710 77510846 77654076
2906.4G7654076J11603P7147M2790M291m2581j28764j91379j50990j34373k11990k64239
$$ 77654076 77765679 77842826 77885616 77889907 77847326 77718562 77527183 77376193 77241820 77029830 76765591
2917.6G6765591k72185k86495l20352l67242m00757m21209m35286m44842m60565m89920
$$ 76765591 76493406 76206911 75886559 75519317 75118560 74697351 74262065 73817223 73356658 72866738
2927.8G2866738n22912m90719l73828k99043l17156l34954l13634k81948k61968k48069
$$ 72866738 72343826 71853107 71479279 71180236 70863080 70528126 70214492 69932544 69670576 69422507
2938F9422507k29245k15697k13534k38687l03793l43263l40325l98582m85819n00065
$$ 69422507 69193262 68977565 68764031 68525344 68221551 67878288 67537963 67139381 66653562 66153497
2948.2F6153497n03910n38391n53095n11039l94415k62452j84106j30618q0109o5070
$$ 66153497 65649587 65111196 64558101 64047062 63652647 63390195 63206089 63075471 62995362 62930292
2958.4F2930292q1211j17952j90735k79212l64208m69607n89860o89977p74378q42565
$$ 62930292 62849081 62731129 62540394 62261182 61896974 61427367 60837507 60147530 59373152 58530587
2968.6E8530587q74704q72624q40473p78932o88576n66680m12720k30426k8997J91080
$$ 58530587 57655883 56783259 55942786 55163854 54475278 53908598 53495878 53265452 53236455 53427535
2978.8E3427535M21804O42026Q56376J068735J259994J418668J548910J652128J719260
$$ 53427535 53849339 54491365 55347741 56416476 57676470 59095138 60644048 62296176 64015436
2987.9F4015436J751298J757252J739580J687419J609844J537150J458860J368981
$$ 64015436 65766734 67523986 69263566 70950985 72560829 74097979 75556839 76925820
2996.1G6925820J288587J225221J178086J126748J058281R91136R34207Q89134Q62104
$$ 76925820 78214407 79439628 80617714 81744462 82802743 83793879 84728086 85617220 86479324
3005.3H6479324Q39502Q12745P86304P52360P13986O99765P00110O67917O31613O11496
$$ 86479324 87318826 88131571 88917875 89670235 90384221 91083986 91784096 92452013 93083626 93695122
3015.5I3695122N57572M93562M55320M21476L96299L84182L67457L37845L31438L70091
$$ 93695122 94252694 94746256 95201576 95623052 96019351 96403533 96770990 97108835 97440273 97810364
3025.7I7810364L86619L54505L20285L03978L02011K86424K49535K34902K56359K80345
$$ 97810364 98196983 98551488 98871773 99175751 99477762 99764186 100013721 100248623 100504982 100785327
3035.9A00785327K75993K38264J84464J43695J37758J43350J44612J45984J28520J21855
$$ 100785327 101061320 101299584 101484048 101627743 101765501 101908851 102053463 102199447 102327967 102449822
3046.1A02449822J31512J04189M7576j66r6M5479N7840K1529J180o163j8334k754J4424
$$ 102449822 102581334 102685523 102733099 102732933 102732837 102778316 102836156 102857685 102858865 102852702 102834368 102831614 102846038
3059.3A02846038q881l6704m2916m2808m3058o2966r4438q4341l3521j4889n3835q6642
$$ 102846038 102837157 102800453 102757537 102714729 102671671 102608705 102514267 102429926 102396405 102381516 102327681 102241039
3071.6A02241039r5892j12533j29962j48773j80340j98126j70982j27435j04344r0789
$$ 102241039 102145147 102032614 101902652 101753879 101573539 101375413 101204431 101076996 100972652 100881863
3081.8A00881863r8253j23441r7346l9602k3198j5568M76M42K3186P4434R3055P7045
$$ 100881863 100783610 100660169 100562823 100523221 100500023 100484455 100484931 100485373 100508559 100582993 100676048 100753093
3094A00753093P4839Q0812O9309N5098N8186P9847J05106J07611Q3613N8937M7362
$$ 100753093 100827932 100908744 100978053 101033151 101091337 101171184 101276290 101383901 101467514 101526451 101573813
3105.2A01573813L8636J4138j6522J90N1761N8412K5511j1587n3275p0095n3596l0577
$$ 101573813 101612449 101626587 101610065 101610255 101662016 101720428 101745939 101734352 101681077 101610982 101557386 101526809
3117.5A01526809k8324m3404k2352K5010L0815k574k7347l4106m6217p2718r4676q6057
$$ 101526809 101498485 101455081 101432729 101457739 101488554 101485980 101458633 101424527 101378310 101305592 101210916 101124859
3129.7A01124859n0998k6882l2424n3406p3314q8286j03486j27280j42586j04606l8278
$$ 101124859 101073861 101046979 101014555 100961149 100887835 100799549 100696063 100568783 100426197 100321591 100283313
3140.9A00283313k2316n0032p4041q7083r6482j01459r4032r5165j22982j62345j69534
$$ 100283313 100260997 100210965 100136924 100049841 99953359 99851900 99757868 99662703 99539721 99377376 99207842
3152.1I9207842j05959l8671l9924o8634q7387j01751j11389j15090j14143j12790
$$ 99207842 99101883 99063212 99023288 98954654 98867267 98765516 98654127 98539037 98424894 98312104
3162.3I8312104j11842j14024j16372j12707j17170j26797j27823j27494j31333j36363
$$ 98312104 98200262 98086238 97969866 97857159 97739989 97613192 97485369 97357875 97226542 97090179
3172.5I7090179j34164j23233j19668j28746j38080j48535j54382j39690j26558j38009
$$ 97090179 96956015 96832782 96713114 96584368 96446288 96297753 96143371 96003681 95877123 95739114
3182.7I5739114j49303j46383j46360j55735j71291j75441j58447j44464j47110j52224
$$ 95739114 95589811 95443428 95297068 95141333 94970042 94794601 94636154 94491690 94344580 94192356
3192.9I4192356j49775j47837j55383j63687j65850j73986j85859j89340j78718j62173
$$ 94192356 94042581 93894744 93739361 93575674 93409824 93235838 93049979 92860639 92681921 92519748
3203.1I2519748j63382j79249j88548j77502j60802j65164j76454j77961j78898j90746
$$ 92519748 92356366 92177117 91988569 91811067 91650265 91485101 91308647 91130686 90951788 90761042
3213.3I0761042j98466j77985j61195j86521k14106j88428j41251j34009j52457j64241
$$ 90761042 90562576 90384591 90223396 90036875 89822769 89634341 89493090 89359081 89206624 89042383
3223.5H9042383j65474j57791j56689j63275j62602j67906k01958k79659l62528k82907
$$ 89042383 88876909 88719118 88562429 88399154 88236552 88068646 87866688 87587029 87224501 86941594
3233.7H6941594l7402Q6951R197r1904j41305j60688j65021j60331j59091j85746k38198
$$ 86941594 86904192 86991143 87000340 86908436 86767131 86606443 86441422 86281091 86122000 85936254 85698056
3244.9H5698056k90030k76047j36262q571m3613j32310j61398j74266k23142k70414
$$ 85698056 85408026 85131979 84995717 84987146 84943533 84811223 84649825 84475559 84252417 83982003
3255.1H3982003k16806j06418q9687j36358j54579j63066j71906j68425j64610j79207
$$ 83982003 83765197 83658779 83569092 83432734 83278155 83115089 82943183 82774758 82610148 82430941
3265.3H2430941j97458k05207k45065l26854l51459k24161l6639L690j06448j56319
$$ 82430941 82233483 82028276 81783211 81456357 81104898 80880737 80844098 80847788 80741340 80585021
3275.5H0585021j07110j01864j40429j59841j70887j67090j61337j69987j80519j87242
$$ 80585021 80477911 80376047 80235618 80075777 79904890 79737800 79576463 79406476 79225957 79038715
3285.7G9038715j84899j80787j89608k27958k98638l15976k12353j33425j70374j93709
$$ 79038715 78853816 78673029 78483421 78255463 77956825 77640849 77428496 77295071 77124697 76930988
3295.9G6930988j58662j30105j41865j81001k14458k44981k86156l17037l02774k42430
$$ 76930988 76772326 76642221 76500356 76319355 76104897 75859916 75573760 75256723 74953949 74711519
3306.1G4711519j83123j69343j78885j67286j70279k12687k36094k27475k22630k35802
$$ 74711519 74528396 74359053 74180168 74012882 73842603 73629916 73393822 73166347 72943717 72707915
3316.3G2707915k46721k40046k35736k39778k51919k68424k70992k68096k66772k48409
$$ 72707915 72461194 72221148 71985412 71745634 71493715 71225291 70954299 70686203 70419431 70171022
3326.5G0171022k38216k53444k56485k53874k61313k53981k42496k55215k71958k68978
$$ 70171022 69932806 69679362 69422877 69169003 68907690 68653709 68411213 68155998 67884040 67615062
3336.7F7615062k58845k55990k60770k68114k67154k60866k60728k58679k55340k61026
$$ 67615062 67356217 67100227 66839457 66571343 66304189 66043323 65782595 65523916 65268576 65007550
3346.9F5007550k70141k58624k31546k29681k46513k53635k59036k61879k49297k36892
$$ 65007550 64737409 64478785 64247239 64017558 63771045 63517410 63258374 62996495 62747198 62510306
3357.1F2510306k34634k31648k18826k05219k17080k36344k23840j98263j93977j98936
$$ 62510306 62275672 62044024 61825198 61619979 61402899 61166555 60942715 60744452 60550475 60351539
3367.3F0351539j87016j78546j95777k08151j97459j82253j71315j60665j56194j56891
$$ 60351539 60164523 59985977 59790200 59582049 59384590 59202337 59031022 58870357 58714163 58557272
3377.5E8557272j48833j35726j26308j22744j19447j07324j02365j06532r9426r2984
$$ 58557272 58408439 58272713 58146405 58023661 57904214 57796890 57694525 57587993 57488567 57395583
3387.7E7395583q8572o8772m6438m3350n1678m8220l8689l4541l3128l1346l1627k7722
$$ 57395583 57307011 57238239 57191801 57148451 57096773 57048553 57009864 56975323 56942195 56910849 56879222 56851500
3399.9E6851500n150K2388L9822M7362M3505L4636K8354K5195L5727O1500O8373N3525
$$ 56851500 56846350 56868738 56908560 56955922 56999427 57034063 57062417 57087612 57123339 57184839 57253212 57306737
3412.2E7306737O6203J10298J39475J41817J32388J26588J29843J30236J40810J63937
$$ 57306737 57372940 57483238 57622713 57764530 57896918 58023506 58153349 58283585 58424395 58588332
3422.4E8588332J74189J72323J64723J59180J56677J54501J57577J86604K55335K69842
$$ 58588332 58762521 58934844 59099567 59258747 59415424 59569925 59727502 59914106 60169441 60439283
3432.6F0439283J78510J16610J82980K74551L18563L72589L93528L48317L03275K78693
$$ 60439283 60617793 60734403 60917383 61191934 61510497 61883086 62276614 62624931 62928206 63206899
3442.8F3206899K71070K79153K86686K76810K78008L00538L00980K77787K73181K90894
$$ 63206899 63477969 63757122 64043808 64320618 64598626 64899164 65200144 65477931 65751112 66042006
3453F6042006K96134K91592K89827K75499K45774K19118K37513L11082L45374K94882
$$ 66042006 66338140 66629732 66919559 67195058 67440832 67659950 67897463 68208545 68553919 68848801
3463.2F8848801K45434K11072J55848J57636K29991K88790L50184L93343L56483K96020
$$ 68848801 69094235 69305307 69461155 69618791 69848782 70137572 70487756 70881099 71237582 71533602
3473.4G1533602K68335K60412K57737K57617K41315K34706K86495L32374L05825K67351
$$ 71533602 71801937 72062349 72320086 72577703 72819018 73053724 73340219 73672593 73978418 74245769
3483.6G4245769K56198K51204K59078K82484K98107K91151K72107K67094K87169K97344
$$ 74245769 74501967 74753171 75012249 75294733 75592840 75883991 76156098 76423192 76710361 77007705
3493.8G7007705K82848K78818K91521K88868K72292K83205L05605K95353K65521K45756
$$ 77007705 77290553 77569371 77860892 78149760 78422052 78705257 79010862 79306215 79571736 79817492
3504G9817492K38919K48659K80475K98769K76601K37602K17277K25687K39795K42281
$$ 79817492 80056411 80305070 80585545 80884314 81160915 81398517 81615794 81841481 82081276 82323557
3514.2H2323557K37578K33084K32572K31301K32763K47305K59531K48021K17437J96284
$$ 82323557 82561135 82794219 83026791 83258092 83490855 83738160 83997691 84245712 84463149 84659433
3524.4H4659433J98043K10184K23666K20108J87892J57279J57529J85203K11901K13319
$$ 84659433 84857476 85067660 85291326 85511434 85699326 85856605 86014134 86199337 86411238 86624557
3534.5H6624557K01058J94115J96266J96415J90568J95372K09504K23965K39408K37691
$$ 86624557 86825615 87019730 87215996 87412411 87602979 87798351 88007855 88231820 88471228 88708919
3544.7H8708919K07401J81418J77837J88899K16424K45220K45529K13313J86193J88840
$$ 88708919 88916320 89097738 89275575 89464474 89680898 89926118 90171647 90384960 90571153 90759993
3554.9I0759993K14535K37524K34246K32554K37316K23630K26069K70766L32659L80212
$$ 90759993 90974528 91212052 91446298 91678852 91916168 92139798 92365867 92636633 92969292 93349504
3565.1I3349504L59631K41977J13124O3824R9504J67543K14535K27243K23821K30259
$$ 93349504 93709135 93951112 94064236 94128060 94227564 94395107 94609642 94836885 95060706 95290965
3575.3I5290965K31206K09391J93233J99818J99122J81919J95461K39265K67548K91925
$$ 95290965 95522171 95731562 95924795 96124613 96323735 96505654 96701115 96940380 97207928 97499853
3585.5I7499853L09289K34973Q5432J0043O3229J57791K18320K24829J93834J50323
$$ 97499853 97809142 98044115 98129547 98139590 98202819 98360610 98578930 98803759 98997593 99147916
3595.7I9147916J13207J31279J72126J74922J52570J26803J29569J65903K06971K49529
$$ 99147916 99261123 99392402 99564528 99739450 99892020 100018823 100148392 100314295 100521266 100770795
3605.9A00770795K68412K20835J56188J26624J53911K07317J80114J03056R4783J64557
$$ 100770795 101039207 101260042 101416230 101542854 101696765 101904082 102084196 102187252 102282035 102446592
3616.1A02446592K58982K75552J67346K9469k2686M0019J44815K22898K81107L49808
$$ 102446592 102705574 102981126 103148472 103177941 103155255 103195274 103340089 103562987 103844094 104193902
3626.3A04193902M21369L75939Q7964j51718p2085R3829J54054J12832R1481J35505
$$ 104193902 104615271 104991210 105079174 104927456 104855371 104949200 105103254 105216086 105307567 105443072
3636.5A05443072J68383J56117J37830J41048J57511J74427J97208K65968L83580M53806
$$ 105443072 105611455 105767572 105905402 106046450 106203961 106378388 106575596 106841564 107225144 107678950
3646.7A07678950L71408J87970K0873j20175j68443o8450J04797K20251J96565L4999
$$ 107678950 108050358 108238328 108259201 108139026 107970583 107902133 108006930 108227181 108423746 108458745
3656.9A08458745q7094l2854O0392J00421J13213J11497J13380J38438J84166K60997
$$ 108458745 108371651 108338797 108399189 108499610 108612823 108724320 108837700 108976138 109160304 109421301
3667.1A09421301L40283K98452R6595p7271k7239J91557L62730K33066j64163k94709
$$ 109421301 109761584 110060036 110156631 110079360 110052121 110243678 110606408 110839474 110675311 110380602
3677.3A10380602j44529l7182l8218k4057L6788O8844R0420J65903K57075K53320J25182
$$ 110380602 110236073 110198891 110160673 110136616 110173404 110242248 110332668 110498571 110755646 111008966 111134148
3688.5A11134148K7001K2614m5336j28197r3186j5545K3567K8468L0207O4791J27911
$$ 111134148 111161149 111183763 111138427 111010230 110917044 110901499 110925066 110953534 110983741 111048532 111176443
3699.8A11176443J50967O7293p4410j22416o4123J7226J03712J87409K21872J70338
$$ 111176443 111327410 111394703 111320293 111197877 111133754 111150980 111254692 111442101 111663973 111834311
3710A11834311O7914o7806k30706k39599j16861k6941K0397L9553K5356L1364P7451
$$ 111834311 111902225 111834419 111603713 111364114 111247253 111220312 111240709 111280262 111305618 111336982 111414433
3721.2A11414433P4005n234l0243J514k6441q8346p0595M4798J70792K09379J43242
$$ 111414433 111488438 111483204 111452961 111454475 111428034 111339688 111269093 111313891 111484683 111694062 111837304
3732.4A11837304Q7273R5725p248k11859k66838j87349n5230Q6355J90664L18980L80790
$$ 111837304 111924577 112020302 112013054 111801195 111534357 111347008 111291778 111378133 111568797 111887777 112268567
3743.6A12268567M3118l91185k21718J20569K38788J14274l0971j30737k89309k95245
$$ 112268567 112311685 111920500 111698782 111819351 112058139 112172413 112141442 112010705 111721396 111426151
3753.8A11426151j16503R810M0806M3857K6452o1714j44351j07121p010P8786Q7964
$$ 111426151 111309648 111319458 111360264 111404121 111430573 111368859 111224508 111117387 111110377 111189163 111277127
3765A11277127P701k6536N8472J00875l3796j86908j59788n8544j7297j3506K6142
$$ 111277127 111284828 111258292 111316764 111417639 111383843 111196935 111037147 110978603 110961306 110947800 110973942
3776.2A10973942R6631J08004J6606r1827r7346j5724M3177K7180l1078o0999m6885
$$ 110973942 111070573 111178577 111195183 111103356 111006010 110990286 111033463 111060643 111029565 110968566 110921681
3787.5A10921681l2663l3093k6357N281M5979Q3244J16753J07599L0481k2578N8854
$$ 110921681 110889018 110855925 110829568 110834849 110880828 110964072 111080825 111188424 111218905 111196327 111255181
3798.7A11255181K01440J95419n8627k61509j74785K3353J36412K8562j72603j88255
$$ 111255181 111456621 111652040 111593413 111331904 111157119 111180472 111316884 111345446 111172843 110984588
3808.9A10984588r0814k8062J6880J01149K10893K27929M1890j65260p7772J62124
$$ 110984588 110893774 110865712 110882592 110983741 111194634 111422563 111464453 111299193 111221421 111383545
3819.1A11383545K54870L2699k76244k80535j09363J3769L8576k4056o6889M328R8538
$$ 111383545 111638415 111671114 111394870 111114335 111004972 111018741 111057317 111033261 110966372 110970700 111069238
3830.3A11069238Q7369J6200J0789N0294Q0168J15598R1409m1294r9540o7591q3983
$$ 111069238 111156607 111172807 111183596 111233890 111314058 111429656 111521065 111479771 111380231 111312640 111228657
3841.5A11228657p9072o5171j24264j40310m7731M8196J13654K01512L16179M13811
$$ 111228657 111149585 111084414 110960150 110819840 110772109 110820305 110933959 111135471 111451650 111865461
3851.7A11865461L38840r1028m94897m01271j75869r6786m8542N1343J32335J23822
$$ 111865461 112204301 112113273 111618376 111217105 111041236 110944450 110895908 110947251 111079586 111203408
3861.9A11203408Q4865O7211k1768j27137l4165J65546K20406J5402j98496j38390
$$ 111203408 111288273 111355484 111333716 111206579 111172414 111337960 111558366 111573768 111375272 111236882
3872.1A11236882N210Q94j16492j22523L886J28234J70195P7998q7690j16777J4424
$$ 111236882 111242092 111242986 111126494 111003971 111007857 111136091 111306286 111384284 111296594 111179817 111194241
3883.3A11194241J16265M2093j35875j72830l7276J11544J51014K4712j30331j35279
$$ 111194241 111310506 111352599 111216724 111043894 111006618 111118162 111269176 111293888 111163557 111028278
3893.5A11028278n1916N138N4002J43838J88744J08373J4782J6511J5723n4657j29760
$$ 111028278 110976362 110981500 111035502 111179340 111368084 111476457 111491239 111507750 111523473 111468816 111339056
3904.7A11339056j73294j65749j02627l2210p177q690P51K1923N5182Q6367Q2326L4165
$$ 111339056 111165762 111000013 110897386 110865176 110857999 110849309 110850060 110871983 110927165 111013532 111095858 111130023
3917A11130023j6737k2745j8954l0935j943N2631N2869p99m9460l6013K3139M8399
$$ 111130023 111113286 111090541 111071587 111040652 111038709 111091340 111144209 111143410 111093950 111057937 111081076 111129475
3929.2A11129475M3225L7086k337n2261n6159l2652j2600J0144L1817M3011M7135M1819
$$ 111129475 111172700 111209786 111207449 111155188 111099029 111066377 111053777 111063921 111095738 111138749 111185884 111227703
3941.4A11227703J3924l2163m8304j4686L3343N3787K2578k9337n7316n3465k4367
$$ 111227703 111241627 111209464 111161160 111146474 111179817 111233604 111256182 111226845 111169529 111116064 111091697
3952.7A11091697L386J0144Q739M589r608k1386j610L0911K3604j3984k4640J633J2243
$$ 111091697 111095083 111105227 111113966 111118555 111108947 111087561 111085951 111116862 111140466 111126482 111101842 111103475 111115718
3965.9A11115718N722J3900J1325J680O605K420j0622j4472o211O283K861l231J1313
$$ 111115718 111121440 111135340 111146665 111148345 111154950 111157370 111146748 111132276 111126065 111132348 111135209 111131978 111143291
3979.2A11143291J6332o497j8394j7154k3997j4222P224J1277Q798J5008J8824O008
$$ 111143291 111159623 111153126 111134732 111117578 111093581 111079359 111086583 111097860 111106658 111121666 111140490 111146498
3991.4A11146498p522j3280k0659j9038j3936j4257j609
$$ 111146498 111138976 111125696 111105037 111085999 111072063 111057806 111056197
3998.5A11056197
$$ 111056197
##END=$$ End of the data block
