##TITLE=MS-16 $$ Begin of the data block
##JCAMP-DX=5.00 $$ ACD/SpecManager v 10.08
##SPECTROMETER/DATA SYSTEM=Alpha
##DATE=06 Jul 2015 14:51:08
##DATA TYPE=INFRARED SPECTRUM
##DATA CLASS=XYDATA
##ORIGIN=
##OWNER=
##NPOINTS=1765
##FIRSTX=399.76416016
##LASTX=3997.64306641
##MAXX=3997.64306641
##MINX=399.76416016
##MAXY=0.89212537
##MINY=0.50457323
##XFACTOR=1.0000000000
##YFACTOR=1.000000000000000e-9
##FIRSTY=0.82604390
##DELTAX=2.03961396
##XUNITS=1/CM
##YUNITS=ARBITRARY UNITS
##XYDATA=(X++(Y..Y))
$$ plain form
399.8 826043904 825891197 827675819 827869952 826366305 826584816 826087594 824794888 825618088 825615108 824216545
420.2 824216545 825067163 824976802 823041022 822388709 821007907 818077147 816911459 815894485 813804686
438.5 813804686 813721120 814223230 813437045 813907206 814519405 813510418 813526511 813936174 812583089 812298238
458.9 812298238 813151300 812705696 813120306 814795196 815314591 816385329 818945110 820122898 820943952
477.3 820943952 822691321 822851300 822283626 823052108 822941422 821976483 822193682 821838140 820492983
495.6 820492983 820168078 819506168 817761362 817011535 816228211 814273655 813365340 813185573 812125444
514 812125444 811735451 812155366 811620533 811276793 811795115 811506808 811035454 811414480 811111689 810330153
534.4 810330153 810496449 810440898 809930682 810425878 811016679 810935259 811481476 812107980 811697006 811619163
$$ packed form
399.8H26043904j52707J784622J94133j503647K18511m97222j292706Q23200k980j398563
420.2H24216545Q50618r0361j935780o52313j380802k930760j165688j016974k089799
438.5H13804686q3566N02110p86185M70161O12199j008987J6093M09663j353085k84851
458.9H12298238Q53062m45604M14610J674890N19395J070738K559781J177788Q21054
477.3H20943952J747369J59979n67674P68482j10686r64939K17199l55542j345157
495.6H20492983l24905o61910j744806p49827p83324j954556r08315j79767j060129
514H12125444l89993M19915n34833l43740N18322k88307m71354L79026l02791p81536
534.4H10330153J66296n5551n10216M95196N90801q1420N46217O26504m10974p7843
$$ plain form
554.8 811619163 812020421 811536252 811196268 811611176 811346829 811014354 811565101 811543763 811166525 811719298
575.2 811719298 811904192 811462760 811833262 811992764 811325669 811439693 811615884 810770512 810529470 810558558
595.6 810558558 809408665 808676243 808730066 807895839 807280302 807666540 807434380 807386518 808492005 808816552
616 808816552 808808506 810229123 811297417 811501503 812638402 813615859 813808918 815195203 816958249 817759633
636.4 817759633 819186687 820580482 820100725 819507539 819411457 818093061 816853106 816799045 816215396
654.7 816215396 815771222 816610396 816835940 816554904 817401111 817878544 816784501 816838741 817160845 816810071
675.1 816810071 817474186 818633437 818839371 819291830 819361210 816883266 812724888 807310998 799568117
693.5 799568117 791844547 787296832 786374629 790125489 798651874 808281243 816731930 824295878 829738677
$$ packed form
554.8H11619163M01258m84169l39984M14908k64347l32475N50747k1338l77238N52773
575.2H11719298J84894m41432L70502J59502o67095J14024J76191q45372k41042K9088
595.6H10558558j149893p32422N3823q34227o15537L86238k32160m7862J105487L24547
616H08816552q046J420617J068294K04086J136899R77457J93059J386285J763046Q01384
636.4H17759633J427054J393795m79757n93186r6082j318396j239955n4061n83649
654.7H16215396m44174Q39174K25544k81036Q46207M77433j094043N4240L22104l50774
675.1H16810071O64115J159251K05934M52459O9380k477944m158378n413890p742881
693.5G99568117p723570m547715r22203L750860Q526385R629369Q450687P563948N442799
$$ plain form
711.8 829738677 832843065 835602403 837779641 838633597 839742064 841064036 841372192 841780305 842627525
730.2 842627525 842604697 842537224 843170106 843053281 842237353 841263950 838452160 833268821 826773584 818816125
750.6 818816125 810299158 803861260 800106943 798228681 798180938 798790216 798413277 797665894 797401726
768.9 797401726 797272682 797799826 799316108 800634325 801594138 803017139 804375648 805404723 807137489
787.3 807137489 809498787 812005222 815335691 819181383 822326541 824949026 827318251 829031825
803.6 829031825 830956757 833960116 837256372 840652108 844642162 848400474 851370335 854191482
819.9 854191482 856546879 857994735 859410763 860806227 861447453 861996770 862816453 863148153 863500357
838.3 863500357 864532650 865365148 865864277 866575837 866714597 866014063 865477085 864985287 864332080 864531040
$$ packed form
711.8H29738677L104388K759338K177238Q53956J108467J321972L08156M08113Q47220
730.2H42627525k2828o7473O32882j16825q15928r73403k811790n183339o495237p957459
750.6H18816125q516967o437898l754317j878262m7743O09278l76939p47383k64168
768.9G97401726j29044N27144J516282J318217R59813J423001J358509J029075J732766
787.3H07137489K361298K506435L330469L845692L145158K622485K369225J713574
803.6H29031825J924932L003359L296256L395736L990054L758312K969861K821147
819.9H54191482K355397J447856J416028J395464O41226N49317Q19683L31700L52204
838.3H63500357J032293Q32498M99129P11560J38760p00534n36978m91798o53207J98960
$$ plain form
858.7 864531040 865359187 865797281 866272151 866686583 866084576 865180969 864704192 864080489 863915861 865050972
879.1 865050972 866489589 867851019 869773805 871416867 872244358 873300910 874367476 874776304 875461340
897.4 875461340 876461744 876902521 877488852 878469586 878783941 878940165 879667521 880012393 880093575 880762458
917.8 880762458 881157875 881062567 881479859 881778836 881395459 881399751 881491542 880775511 880189121 879856288
938.2 879856288 878811181 877757013 877070725 875759959 874364018 873613358 872504532 871127665 870391786
956.6 870391786 869487345 868181169 867532611 867049396 866177022 865887165 865937471 865449727 865189552 865247726
977 865247726 864619136 863859057 863442719 862453580 861128747 859739780 856425166 850454748 844719946
995.3 844719946 842576802 844043672 846159995 846166313 844145596 842105508 840421796 838356972 836622596
$$ packed form
858.7H64531040Q28147M38094M74870M14432o02007r03607m76777o23703j64628J135111
879.1H65050972J438617J361430J922786J643062Q27491J056552J066566M08828O85036
897.4H75461340J000404M40777N86331R80734L14355J56224P27356L44872Q1182O68883
917.8H80762458L95417r5308M17292K98977l83377M292R1791p16031n86390l32833
938.2H79856288j045107j054168o86288j310766j395941p50660j108826j376867p35879
956.6H70391786r04441j306176o48558m83215q72374k89857N0306m87744k60175N8174
977H65247726o28590p60079m16338r89139j324833j388967l314614n970418n734802
995.3H44719946k143144J466870K116323O318k020717k040088j683712k064824j734376
$$ plain form
1013.7 836622596 835569680 834500492 833981752 834569156 835348666 836207449 837477386 838159800 838045061
1032 838045061 838074565 837883294 837107062 836618006 836223900 835213780 834230602 833458662 832275927 831128359
1052.4 831128359 830146015 828362525 825875700 823123991 819437265 814818740 809815764 803739429
1068.8 803739429 796189964 787793159 778311610 767301977 755241215 742174089 728159308 714579999
1085.1 714579999 702595592 692483664 685098529 681526005 682334721 688384533 700161815 716434479
1101.4 716434479 735336721 755018473 772829473 786729276 796871603 804087758 809250772 813895941
1117.7 813895941 818594575 822511017 825431287 827431321 827955067 827294767 826250196 824571848 822314501
1136.1 822314501 820393324 818945408 817881823 817768872 818537533 819611192 821145117 823060155 824651897
$$ packed form
1013.7H36622596j052916j069188n18740N87404P79510Q58783J269937O82414j14739
1032H38045061K9504j91271p76232m89056l94106j010120r83178p71940j182735j147568
1052.4H31128359r82344j783490k486825k751709l686726m618525n002976o076335
1068.8H03739429p549465q396805r481549j1009633j2060762j3067126j4014781j3579309
1085.1G14579999j1984407j0111928p385135l572524Q08716O049812J1777282J6272664
1101.4G16434479J8902242J9681752J7811000J3899803J0142327P216155N163014M645169
1117.7H13895941M698634L916442K920270K000034N23746o60300j044571j678348k257347
1136.1H22314501j921177j447916j063585j12951P68661J073659J533925J915038J591742
$$ plain form
1154.4 824651897 825955570 827053726 827085078 825581670 822733998 818697572 814852059 813594103 815504134
1172.8 815504134 819126427 822889507 825425208 826053500 825603545 824898303 823895276 823092878 823030770
1191.1 823030770 823144257 823121667 823145747 822515249 820624888 817724407 813394010 806895614 798261046
1209.5 798261046 786946058 771940887 753546655 732747793 710746408 690037727 673347592
1223.8 673347592 662004292 656507134 656611681 660582900 666452885 673351526 680860519 689225197
1240.1 689225197 699806988 713123739 727772057 741948605 753822088 761835873 766765833 771014273
1256.4 771014273 775875330 781852841 789071262 796034217 801241338 804890275 807057917 807498574
1272.7 807498574 807112932 806422949 804960251 803164423 801462770 799070239 795965672 792734146 788887560
$$ packed form
1154.4H24651897J303673J098156L1352j503408k847672m036426l845513j257956J910031
1172.8H15504134L622293L763080K535701O28292m49955p05242j003027q02398o2108
1191.1H23030770J13487k2590K4080o30498j890361k900481m330397o498396q634568
1209.5G98261046j1314988j5005171j8394232k0798862k2001385k0708681j6690135
1223.8F73347592j1343300n497158J04547L971219N869985O898641P508993Q364678
1240.1F89225197J0581791J3316751J4648318J4176548J1873483Q013785M929960M248440
1256.4G71014273M861057N977511P218421O962955N207121L648937K167642M40657
1272.7H07498574l85642o89983j462698j795828j701653k392531l104567l231526l846586
$$ plain form
1291.1 788887560 784468412 780510843 776989579 773741126 771562397 770232975 768868685 767796814
1307.4 767796814 767151237 766376674 766041160 766683400 767581880 768821239 771010637 773592710 776443541
1325.8 776443541 780196905 784421384 788937271 794833481 802108943 810045898 818831265 827330291
1342.1 827330291 833670676 838163555 841420054 842897773 842993557 842357755 839887977 834710479 826389313
1360.4 826389313 813730299 799172997 788260043 783600748 785227716 791661441 799488544 804478467
1376.7 804478467 805695593 803938448 800157070 796819270 795480013 795042694 794864058 795368075 795992792
1395.1 795992792 795955598 795400858 794040740 791524827 788568735 785610139 782193542 778678119 775485277
1413.5 775485277 772072494 768362999 765057862 762459934 760392904 759167969 758545280 758100629 758056223
$$ packed form
1291.1G88887560m419148l957569l521264l248453k178729j329422j364290j071871
1307.4G67796814o45577p74563l35514O42240Q98480J239359K189398K582073K850831
1325.8G76443541L753364M224479M515887N896210P275462P936955Q785367Q499026
1342.1H27330291O340385M492879L256499J477719R5784o35802k469778n177498q321166
1360.4H26389313j2659014j4557302j0912954m659295J626968O433725P827103M989923
1376.7H04478467J217126j757145l781378l337800j339257m37319j78636N04017O24717
1395.1G95992792l7194n54740j360118k515913k956092k958596l416597l515423l192842
1413.5G75485277l412783l709495l305137k597928k067030j224935o22689m44651m4406
$$ plain form
1431.8 758056223 757596970 755357862 751770496 748023510 744062483 740787268 738911867 737731397
1448.1 737731397 737010539 736812830 736738980 736949384 738557696 740792394 742684305 744630039 746207654
1466.5 746207654 746636868 746924937 749568939 756334782 766535103 778240085 789468706 799240887
1482.8 799240887 807112455 813118160 817878246 822237670 825738788 828214407 830612600 833114445
1499.1 833114445 835044444 836358905 837235630 838015139 839346111 840807498 841645718 841868579 842238724
1517.5 842238724 842587113 842532158 842791677 843217015 843356371 843562365 843701661 843480349 843457937 843522549
1537.9 843522549 843059480 842846572 843452454 843979359 844060838 844067156 843844354 842934012 841612875 839491189
1558.3 839491189 836864293 835063457 832489789 828303635 823426604 819695771 818244636 818299949 819053590
$$ packed form
1431.8G58056223m59253k239108l587366l746986l961027l275215j875401j180470
1448.1G37731397p20858j97709p3850K10404J608312K234698J891911J945734J577615
1466.5G46207654M29214K88069K644002O765843J0200321J1704982J1228621R772181
1482.8G99240887P871568O005705M760086M359424L501118K475619K398193K501845
1499.1H33114445J929999J314461Q76725P79509J330972J461387Q38220K22861L70145
1517.5H42238724L48389n4955K59519M25338J39356K05994J39296k21312k2412O4612
1537.9H43522549m63069k12908O05882N26905Q1479O318k22802r10342j321137k121686
1558.3H39491189k626896j800836k573668m186154m877031l730833j451135N5313P53641
$$ plain form
1576.6 819053590 818692327 815931022 811044812 804811716 798737407 795019031 794133842 794607162 795143247
1595 795143247 794749975 792567790 789029062 784838974 779760063 773769915 767163694 759749413 751513302
1613.4 751513302 741677999 729574680 718328536 707464933 694360793 680409908 666797757
1627.6 666797757 653609276 642284572 632458687 623354197 617496312 615428090 615746379 617659450
1643.9 617659450 621477664 627068579 631981969 636451304 641761541 644902349 645470977 644280255
1660.3 644280255 641033173 635895133 629693091 621524632 610989332 600576341 589362502 577043355
1676.6 577043355 566200733 556753814 547149062 536701202 528946877 523283184 517725945 512820721
1692.9 512820721 508479655 505188465 504573226 507579327 513202548 521818757 534603417 550344825
$$ packed form
1576.6H19053590l61263k761305m886210o233096o074309l718376q85189M73320N36085
1595G95143247l93272k182185l538728m190088n078911n990148o606221p414281q236111
1613.4G51513302r835303j2103319j1246144j0863603j3104140j3950885j3612151
1627.6F66797757j3188481j1324704r825885r104490n857885k068222L18289J913071
1643.9F17659450L818214N590915M913390M469335N310237L140808N68628j190722
1660.3F44280255l247082n138040o202042q168459j0535300j0412991j1213839j2319147
1676.6E77043355j0842622r446919r604752j0447860p754325n663693n557239m905224
1692.9E12820721m341066l291190o15239L006101N623221Q616209J2784660J5741408
$$ plain form
1709.2 550344825 568490982 589545131 614524782 645142674 675601304 699990988 721585095
1723.5 721585095 741368890 758094132 771865726 783171654 794377029 804812253 812430978
1737.8 812430978 819385707 826157391 831835032 836952388 841587543 845849216 849960208 853485882
1754.1 853485882 856267393 858669221 860846043 862795532 864604831 866173089 867477238 868521392
1770.4 868521392 869777322 871298194 872588515 873699188 874799967 875803351 876768112 877865613
1786.7 877865613 878713846 879260302 880084217 881195128 882103264 882902682 883723140 884500921 885330498
1805.1 885330498 886122525 886676431 887158751 887773752 888231874 888572156 889048159 889410257 889502645 889716506
1825.5 889716506 890006781 890093923 890429616 890939176 891148329 891282141 891530335 891496241 891309321 891519904
$$ packed form
1709.2E50344825J8146157K1054149K4979651L0617892L0458630K4389684K1594107
1723.5G21585095J9783795J6725242J3771594J1305928J1205375J0435224P618725
1737.8H12430978O954729O771684N677641N117356M635155M261673M110992L525674
1754.1H53485882K781511K401828K176822J949489J809299J568258J304149J044154
1770.4H68521392J255930J520872J290321J110673J100779J003384R64761J097501
1786.7H77865613Q48233N46456Q23915J110911R08136P99418Q20458P77781Q29577
1805.1H85330498P92027N53906M82320O15001M58122L40282M76003L62098R2388K13861
1825.5H89716506K90275Q7142L35693N09560K09153J33812K48194l4094j86920K10583
$$ plain form
1845.9 891519904 891781390 891869128 892046571 892125368 891987622 891974330 891984582 891810775 891683757 891516149
1866.3 891516149 891106665 890995383 891235352 891205251 891026616 890981495 890811205 890582919 890621245 890586257
1886.7 890586257 890315831 890299022 890397608 890283763 890344501 890557766 890544116 890547693 890650570 890544116 890436351
1909.1 890436351 890560150 890548050 890372992 890314460 890218019 890008986 889973223 889986634 889808953 889701545
1929.5 889701545 889587700 889250219 889036894 888968408 888660789 888338804 888302565 888226271 888094246 888142526
1949.9 888142526 888125598 888001919 888049603 888072431 887976527 888065577 888175428 888079405 888104618 888242841 888167739
1972.3 888167739 888122439 888256311 888267279 888235271 888325512 888274372 888124704 888118148 888047338 887895584 887935817
1994.8 887935817 887957513 887798369 887740910 887734890 887578905 887474298 887458920 887314320 887172222 887116075 886893868
$$ packed form
1845.9H91519904K61486Q7738J77443P8797j37746j3292J0252j73807j27018j67608
1866.3H91516149m09484j11282K39969l0101j78635m5121j70290k28286L8326l4988
1886.7H90586257k70426j6809R8586j13845O0738K13265j3650L577J02877j06454j07765
1909.1H90436351J23799j2100j75058n8532r6441k09033l5763J3411j77681j07408
1929.5H89701545j13845l37481k13325o8486l07619l21985l6239p6294j32025M8280
1949.9H88142526j6928j23679M7684K2828r5904Q9050J09851r6023K5213J38223p5102
1972.3H88167739m5300J33872J0968l2008R0241n1140j49668o556p0810j51754M0233
1994.8H87935817K1696j59144n7459o020j55985j04607j5378j44600j42098n6147k22207
$$ plain form
2017.2 886893868 886539638 886198580 885599077 884968460 885129273 885791838 886152685 886290014 886345565 886248827
2037.6 886248827 886196613 886249781 886219144 886163712 886161506 886072099 885971606 886005580 886012077 885937750 885944009 885935664
2062.1 885935664 885817945 885787308 885821640 885749936 885703683 885729849 885676205 885642767 885735214 885783076 885768235
2084.5 885768235 885813355 885827124 885787904 885841668 885914564 885894477 885909319 885966361 885937274 885929167 886021972 886075675
2109 886075675 886120498 886236191 886277556 886244833 886301160 886364937 886355340 886410952 886487603 886445284 886393249 886350453
2133.5 886350453 886176586 885927558 885574162 884841919 883646846 882060885 880024493 877760172 875959933
2151.8 875959933 875154197 875548720 877131879 879353940 881478965 883281112 884680986 885525584 886103094
2170.2 886103094 886713982 887138784 887330592 887516797 887606442 887567461 887631476 887733996 887713611 887721121 887761533
$$ packed form
2017.2H86893868l54230l41058n99503o30617J60813O62565L60847J37329N5551r6738
2037.6H86248827n2214N3168l0637n5432k206q9407j00493L3974O497p4327O259q345
2062.1H85935664j17719l0637L4332p1704m6253K6166n3644l3438R2447M7862j4841
2084.5H85768235M5120J3769l9220N3764P2896k0087J4842N7042k9087q107R2805N3703
2109H86075675M4823J15693M1365l2723N6327O3777r597N5612P6651m2319n2035m2796
2133.5H86350453j73867k49028l53396p32243j195073j585961k036392k264321j800239
2151.8H75959933q05736L94523J583159K222061K125025J802147J399874Q44598N77510
2170.2H86103094O10888M24802J91808J86205Q9645l8981O4015J02520k0385P510M0412
$$ plain form
2192.6 887761533 887681127 887639821 887705684 887664676 887593865 887650073 887633920 887525618 887538254 887550771 887450993
2215 887450993 887411237 887361765 887181878 887085378 887089014 887014151 886976302 887010098 886934638 886868238 886939764 886933744
2239.5 886933744 886852682 886885762 886879206 886764348 886764109 886814952 886763036 886746109 886769354 886703789 886697292 886788905
2264 886788905 886767387 886718929 886775374 886761665 886689723 886725068 886732757 886662960 886702359 886751771 886672795 886672199
2288.5 886672199 886773229 886782646 886802256 886886179 886857867 886820316 886929154 887014031 887074053 887255967 887385845
2310.9 887385845 887385368 887483537 887674570 887809038 887956321 888085008 888067722 888023853 888007104 887865424 887646794
2333.3 887646794 887464702 887252271 887099087 887108028 887014270 886701822 886576831 886846006 887347579 887912631
2353.7 887912631 888396442 888622761 888619244 888444722 888060987 887638390 887266040 886774242 886197686 885692120
$$ packed form
2192.6H87761533q0406m1306O5863m1008p0811N6208j6153j08302J2636J2517r9778
2215H87450993l9756m9472j79887r6500L636p4863l7849L3796p5460o6400P1526o020
2239.5H86933744q1062L3080o556j14858k39N0843n1916j6927K3245o5565o497R1613
2264H86788905k1518m8458N6445j3709p1942L5345P689o9797L9399M9412p8976n96
2288.5H86672199J01030R417J9610Q3923k8312l7551J08838Q4877O0022J81914J29878
2310.9H87385845m77R8169J91033J34468J47283J28687j7286m3869j6749j41680k18630
2333.3H87646794j82092k12431j53184Q941r3758l12448j24991K69175N01573N65052
2353.7H87912631M83811K26319l517j74522l83735m22597l72350m91798n76556n05566
$$ plain form
2374.1 885692120 885171831 884634018 884256124 883999109 883741856 883582771 883552074 883485079 883398831 883396149
2394.5 883396149 883374333 883309484 883310139 883304000 883233011 883225560 883262932 883230865 883222580 883244455 883163095 883093655
2419 883093655 883132100 883125544 883082449 883114219 883098900 883013308 883030891 883078814 883020222 882983744 882975519 882868648
2443.5 882868648 882786572 882803977 882758200 882662833 882628381 882534444 882380188 882345319 882316411 882170737 882090807
2465.9 882090807 882055581 881913185 881820202 881821752 881743550 881663561 881640553 881507933 881353199 881320596 881245315
2488.3 881245315 881100714 881042242 880965054 880791962 880714476 880683601 880524695 880408823 880401552 880302072 880204558
2510.8 880204558 880229354 880174637 880057812 880034983 879961312 879824340 879808366 879791737 879670084 879600763 879515767
2533.2 879515767 879324019 879253328 879280686 879161656 879048228 879056156 878952801 878793120 878788471 878768623 878635764
$$ packed form
2374.1H85692120n20289n37813l77894k57015k57253j59085l0697o6995q6248k682
2394.5H83396149k1816o4849O55o139p0989p451L7372l2067q285K1875q1360o9440
2419H83093655L8445o556m3095L1770j5319q5592J7583M7923n8592l6478q225j06871
2443.5H82868648q2076J7405m5777r5367l4452r3937j54256l4869k8908j45674p9930
2465.9H82090807l5226j42396r2983J550p8202p9989k3008j32620j54734l2603p5281
2488.3H81245315j44601n8472p7188j73092p7486l0875j58906j15872p271r9480r7514
2510.8H80204558K4796n4717j16825k2829p3671j36972j5974j6629j21653o9321q4996
2533.2H79515767j91748p0691K7358j19030j13428P928j03355j59681m649j9848j32859
$$ plain form
2555.6 878635764 878550768 878456414 878325224 878339529 878382683 878277361 878194869 878157854 878006160 877892017 877908349
2578.1 877908349 877833247 877701104 877658904 877549648 877379239 877347112 877323329 877184749 877100527 877031147 876848638
2600.5 876848638 876734436 876731634 876643896 876528621 876466155 876329601 876191676 876162291 876068950 875903964 875837564
2623 875837564 875746787 875549138 875438929 875382125 875219882 875080645 875010192 874865949 874716580 874643505 874541223
2645.4 874541223 874410629 874310076 874160230 873980284 873879135 873784781 873652816 873583078 873517871 873385072
2665.8 873385072 873301387 873256922 873151600 873058021 873003185 872886598 872734487 872596502 872413933 872219503
2686.2 872219503 872087657 871955693 871779978 871632874 871506035 871327400 871137202 870956779 870739698 870539784
2706.6 870539784 870385468 870183706 869942248 869725108 869467616 869176328 868995607 868905067 868750572 868497849
$$ packed form
2555.6H78635764q4996r4354j31190J4305M3154j05322q2492l7015j51694j14143J6332
2578.1H77908349p5102j32143m2200j09256j70409l2127k3783j38580q4222o9380j82509
2600.5H76848638j14202k802q7738j15275o2466j36554j37925k9385r3341j64986o6400
2623H75837564r0777j97649j10209n6804j62243j39237p0453j44243j49369p3075j02282
2645.4H74541223j30594j00553j49846j79946j01149r4354j31965o9738o5207j32799
2665.8H73385072q3685m4465j05322r3579n4836j16587j52111j37985j82569j94430
2686.2H72219503j31846j31964j75715j47104j26839j78635j90198j80423k17081j99914
2706.6H70539784j54316k01762k41458k17140k57492k91288j80721r0540j54495k52723
$$ plain form
2727 868497849 868201375 867925823 867702186 867483795 867227733 866956651 866693914 866421402 866168439 865949929
2747.4 865949929 865663648 865310967 864997327 864688098 864325702 863982558 863672853 863343060 863001168 862650812
2767.8 862650812 862302363 862024963 861822605 861555994 861179352 860799074 860444903 860108614 859829247 859577239
2788.2 859577239 859242141 858811140 858378589 857992947 857586265 857110262 856630504 856170475 855713308 855272174
2808.6 855272174 854822934 854357541 853934169 853559732 853196025 852856040 852544248 852220297 851893425 851571679
2828.9 851571679 851184845 850703061 850155890 849551022 848788440 847752213 846534848 845266640 843950152
2847.3 843950152 842589140 841315031 840297282 839570761 839080930 838663459 838057578 837191343 836222231
2865.7 836222231 835280001 834471464 833942354 833584785 833110034 832519233 831941724 831283092 830405116 829311430
$$ packed form
2727H68497849k96474k75552k23637k18391k56062k71082k62737k72512k52963k18510
2747.4H65949929k86281l52681l13640l09229l62396l43144l09705l29793l41892l50356
2767.8H62650812l48449k77400k02358k66611l76642l80278l54171l36289k79367k52008
2788.2H59577239l35098m31001m32551l85642m06682m76003m79758m60029m57167m41134
2808.6H55272174m49240m65393m23372l74437l63707l39985l11792l23951l26872l21746
2828.9H51571679l86834m81784n47171o04868p62582j036227j217365j268208j316488
2847.3H43950152j361012j274109j017749p26521m89831m17471o05881q66235r69112
2865.7H36222231r42230q08537n29110l57569m74751n90801n77509o58632q77976j093686
$$ plain form
2886.1 829311430 828062594 826681316 825223565 823761225 822240710 820640802 819168210 818043113
2902.4 818043113 817326605 816938877 816690922 816432655 816003740 815152407 813811243 812192619 810489118
2920.7 810489118 808829069 807408512 806417465 805882812 805639565 805640399 805989563 806716144 807792127 809110820
2941.1 809110820 810419321 811400294 811833024 811758280 811431050 810960054 810370624 809849322 809459329 809051633
2961.5 809051633 808452368 807522535 806215703 804620981 803004324 801644683 800764203 800723255 801686406
2979.9 801686406 803378105 805566907 808132052 810887098 813741624 816492379 818787575 820665598
2996.2 820665598 822344184 823775411 824950159 825970948 826869488 827739477 828671396 829476535 829897285
3014.5 829897285 829994977 829933643 829730034 829418540 828985989 828330100 827559173 826824844 826020956 824962795
$$ packed form
2886.1H29311430j248836j381278j457751j462340j520515j599908j472592j125097
2902.4H18043113p16508l87728k47955k58267m28915q51333j341164j618624j703501
2920.7H10489118j660049j420557r91047n34653k43247Q34L49164P26581J075983J318693
2941.1H09110820J308501R80973M32730p4744l27230m70996n89430n21302l89993m07696
2961.5H09051633n99265r29833j306832j594722j616657j359641q80480m0948R63151
2979.9H01686406J691699K188802K565145K755046K854526K750755K295196J878023
2996.2H20665598J678586J431227J174748J020789Q98540Q69989R31919Q05139M20750
3014.5H29897285R7692o1334k03609l11494m32551o55889p70927p34329q03888j058161
$$ plain form
3034.9 824962795 823686838 822482109 821397185 820155561 818622828 816940010 815387964 813993931
3051.3 813993931 812602282 811297119 810132921 809047282 808104336 807320893 806567729 805641532 804439902
3069.6 804439902 803133965 801961660 801047325 800287187 799392879 798341513 797292173 796225667 795209825
3088 795209825 794325054 793375015 792328835 791449428 790831029 790270984 789590597 788895845 788417995 788099408
3108.4 788099408 787662566 787257373 787176371 787185371 786979079 786484540 785814285 785311460 785152495 785167277
3128.8 785167277 785126746 785023153 785049260 785305738 785615861 785726249 785699010 785742998 785871029 786098599
3149.2 786098599 786443174 786586881 786302328 785903692 785604417 785279334 784868717 784347534 783684790 782907069
3169.6 782907069 782001853 780944228 779792130 778544605 777122200 775522292 773817360 772046089
$$ packed form
3034.9H24962795j275957j204729j084924j241624j532733j682818j552046j394033
3051.3H13993931j391649j305163j164198j085639r42946p83443p53164r26197j201630
3069.6H04439902j305937j172305r14335p60138q94308j051366j049340j066506j015842
3088G95209825q84771r50039j046180q79407o18399n60045o80387o94752m77850l18587
3108.4G88099408m36842m05193q1002R000k06292m94539o70255n02825j58965J4782
3128.8G85167277m0531j03593K6107K56478L10123J10388k7239M3988J28031K27570
3149.2G86098599L44575J43707k84553l98636k99275l25083m10617n21183o62744p77721
3169.6G82907069r05216j057625j152098j247525j422405j599908j704932j771271
$$ plain form
3185.9 772046089 770189524 768261969 766252398 764130473 761957467 759778559 757577002 755384624
3202.2 755384624 753242135 751124024 749020994 746947885 744872153 742808104 740834296 738942981
3218.5 738942981 737103581 735342383 733636498 731958091 730390489 729023457 727792025 726496935
3234.8 726496935 725091875 723774195 722666860 721719801 720902443 720170915 719421804 718687177 718099117
3253.2 718099117 717629373 717135906 716619194 716161251 715755165 715404451 715166926 714997470 714710474 714274466
3273.6 714274466 713824511 713364422 712873578 712373555 711845398 711305737 710764825 710184097 709543824 708828688
3294 708828688 707994699 707051992 706113458 705248773 704418302 703531861 702450335 701134741 699764371
3312.3 699764371 698495567 697240233 695883930 694485843 693103313 691716492 690247118 688626289
$$ packed form
3185.9G72046089j856565j927555k009571k121925k173006k178908k201557k192378
3202.2G55384624k142489k118111k103030k073109k075732k064049j973808j891315
3218.5G38942981j839400j761198j705885j678407j567602j367032j231432j295090
3234.8G26496935j405060j317680j107335r47059q17358p31528p49111p34627n88060
3253.2G18099117m69744m93467n16712m57943m06086l50714k37525j69456k86996m36008
3273.6G14274466m49955m60089m90844n00023n28157n39661n40912n80728o40273p15136
3294G08828688q33989r42707r38534q64685q30471q86441j081526j315594j370370
3312.3F99764371j268804j255334j356303j398087j382530j386821j469374j620829
$$ plain form
3328.6 688626289 686945677 685302258 683675528 682057381 680377364 678514719 676531613 674546838
3345 674546838 672583520 670630991 668608785 666444838 664186180 661950409 659787059 657587469 655304968
3363.3 655304968 653053582 650833309 648580551 646315753 644081354 641979873 640078664 638258696
3379.6 638258696 636430383 634724736 633207381 631823957 630564988 629370153 628164530 627005756
3395.9 627005756 626018047 625192106 624401331 623618007 622947574 622435391 622033179 621697605 621426344 621239245
3416.3 621239245 621131361 621104658 621197224 621430159 621789277 622260094 622805655 623438299 624184906 624951124
3436.7 624951124 625638306 626353502 627274573 628360271 629512310 630732000 632003486 633305192 634677112
3455.1 634677112 636174440 637754560 639242887 640693665 642363608 644172430 645750523 646990776
$$ packed form
3328.6F88626289j680612j643419j626730j618147j680017j862645j983106j984775
3345F74546838j963318j952529k022206k163947k258658k235771k163350k199590k282501
3363.3F55304968k251386k220273k252758k264798k234399k101481j901209j819968
3379.6F38258696j828313j705647j517355j383424j258969j194835j205623j158774
3395.9F27005756r87709q25941p90775p83324o70433n12183m02212l35574k71261j87099
3416.3F21239245j07884k6703R2566K32935L59118M70817N45561O32644P46607P66218
3436.7F24951124O87182P15196R21071J085698J152039J219690J271486J301706J371920
3455.1F34677112J497328J580120J488327J450778J669943J808822J578093J240253
$$ plain form
3471.4 646990776 648217916 649670303 651336968 653004467 654482841 656004190 657714903 659384966
3487.7 659384966 660995245 662767589 664695799 666640460 668520808 670389712 672316611 674143374
3504 674143374 675837100 677647769 679674506 681834459 683941185 685854971 687722147 689760983 691989243
3522.4 691989243 694106340 695992708 697942555 700040102 702190220 704456449 706719339 708787084
3538.7 708787084 710871220 713123560 715361536 717405617 719372630 721452594 723623335 725830495
3555 725830495 728096306 730446875 732785463 734878182 736812055 739251196 742265642 745100975 747695208
3573.4 747695208 750417113 753260553 756187499 759216785 762121320 764761567 767505229 770641088
3589.7 770641088 773742318 776682436 779763460 783003926 786197960 789250791 792056799 794592500
$$ packed form
3471.4F46990776J227140J452387J666665J667499J478374J521349J710713J670063
3487.7F59384966J610279J772344J928210J944661J880348J868904J926899J826763
3504F74143374J693726J810669K026737K159953K106726J913786J867176K038836K228260
3522.4F91989243K117097J886368J949847K097547K150118K266229K262890K067745
3538.7G08787084K084136K252340K237976K044081J967013K079964K170741K207160
3555G25830495K265811K350569K338588K092719J933873K439141L014446K835333K594233
3573.4G47695208K721905K843440K926946L029286K904535K640247K743662L135859
3589.7G70641088L101230K940118L081024L240466L194034L052831K806008K535701
$$ plain form
3606 794592500 797204852 800016105 802844346 805675149 808274746 810757518 813638687 816502392 818747461
3624.4 818747461 820416212 822158277 824553847 826979756 829115987 831033111 832764864 834432125
3640.7 834432125 835950375 837096810 837919414 839018703 840803266 842526257 843780458 845068991
3657 845068991 846530437 847649574 848390222 849017501 849398375 849549234 849913776 850216389 850335479 851031423
3677.4 851031423 852130234 853073239 853803217 854348540 854750454 855168581 855838001 856637537 857238710
3695.8 857238710 857565641 857701898 857862890 858273506 858638108 858570516 858197629 858147919 858691394 859313607
3716.2 859313607 859630466 859623373 859498560 859440088 859490514 859611392 859560728 859182656 858815014 859029353
3736.5 859029353 859590650 859662712 859028757 858525574 858703434 858693421 858461499 858751476 859274864 859492362
$$ packed form
3606G94592500K612352K811253K828241K830803K599597K482772K881169K863705K245069
3624.4H18747461J668751J742065K395570K425909K136231J917124J731753J667261
3640.7H34432125J518250J146435Q22604J099289J784563J722991J254201J288533
3657H45068991J461446J119137P40648O27279L80874J50859L64542L02613J19090O95944
3677.4H51031423J098811R43005P29978N45323M01914M18127O69420P99536O01173
3695.8H57238710L26931J36257J60992M10616L64602o7592l72887m9710N43475O22213
3716.2H59313607L16859p093j24813n8472N0426J20878n0664l78072l67642K14339
3736.5H59029353N61297P2062o33955n03183J77860j0013k31922K89977N23388K17498
$$ plain form
3756.9 859492362 859488904 859620631 859790802 859766662 859672964 859677792 859857380 860126853 860290229 860274792 860158741
3779.4 860158741 860081732 860032380 859984815 860010803 860086262 860076785 859867573 859588265 859379888 858999848 858677268
3801.8 858677268 858803213 858860135 858896673 859197497 859290302 858935595 858525276 858309627 858031869 858020723
3822.2 858020723 858361065 858528197 858525872 858445644 858325481 858230829 857923508 857493103 857442141 857673049
3842.6 857673049 857930958 858141840 858070731 857351720 856194139 856072843 856894910 857396185 857377052 857107162
3863 857107162 856931627 856805503 856525064 856447160 856712937 857014120 857061327 856758535 856570661 856611609
3883.4 856611609 856580198 856636047 856639385 856461167 856485784 856565118 856271207 855753899 855397582 855388522 855768859
3905.8 855768859 856213987 856354713 856271446 856132805 855903625 855720282 855750740 855769932 855672777 855687082
$$ packed form
3756.9H59492362l458J31727J70171k4140r3698M828J79588K69473J63376j5437j16051
3779.4H60158741p7009m9352m7565K5988P5459r477k09212k79308k08377l80040l22580
3801.8H58677268J25945N6922L6538L00824R2805l54707m10319k15649k77758j1146
3822.2H58020723L40342J67132k325q0228j20163r4652l07321m30405n0962K30908
3842.6H57673049K57909K10882p1109p19011j157581j21296Q22067N01275j9133k69890
3863H57107162j75535j26124k80439p7904K65777L01183M7207l02792j87874M0948
3883.4H56611609l1411N5849L338j78218K4617P9334k93911n17308l56317r060L80337
3905.8H55768859M45128J40726q3267j38641k29180j83343L0458J9192r7155J4305
$$ plain form
3926.2 855687082 855744064 855617404 855510235 855617642 855694771 855640769 855571270 855512559 855489850 855454862 855375469
3948.7 855375469 855350256 855400145 855449796 855480611 855500579 855439246 855322957 855310380 855353832 855335116 855291486
3971.1 855291486 855230451 855162382 855152428 855179846 855193317 855211735 855205953 855114102 854997575 854937255 854920030 854903042
3995.6 854903042 854881465
3997.6 854881465
$$ packed form
3926.2H55687082N6982j26660j07169J07407P7129n4002o9499n8711k2709l4988p9393
3948.7H55375469k5213M9889M9651L0815J9968o1333j16289j2577M3452j8716m3630
3971.1H55291486o1035o8069r954K7418J3471J8418n782r1851j16527o0320j7225j6988
3995.6H54903042k1577
3997.6H54881465
##END=$$ End of the data block
