##TITLE=MS-14 $$ Begin of the data block
##JCAMP-DX=5.00 $$ ACD/SpecManager v 10.08
##SPECTROMETER/DATA SYSTEM=Alpha
##DATE=06 Jul 2015 08:38:20
##DATA TYPE=INFRARED SPECTRUM
##DATA CLASS=XYDATA
##ORIGIN=
##OWNER=
##NPOINTS=1765
##FIRSTX=399.76428223
##LASTX=3997.64306641
##MAXX=3997.64306641
##MINX=399.76428223
##MAXY=0.87612230
##MINY=0.63633204
##XFACTOR=1.0000000000
##YFACTOR=1.000000000000000e-9
##FIRSTY=0.82682735
##DELTAX=2.03961372
##XUNITS=1/CM
##YUNITS=ARBITRARY UNITS
##XYDATA=(X++(Y..Y))
399.8 826827347 826605916 826617777 827083766 826845646 826582432 827370703 827629030 826555431 825713158 825538695
420.2 825538695 824307621 822435141 821604431 820966542 819221258 817680240 816916823 815534949 814439714
438.5 814439714 815550745 817172945 816923916 815840244 814775229 812433779 809099078 806889772 805996239
456.9 805996239 805866122 807725012 811686218 815328658 817624509 820205867 823211730 825073004 826174140
475.2 826174140 827731669 828800857 828587234 828433990 828926802 828848600 828083634 827729821 827410936 826032877
495.6 826032877 824252248 823023856 821651459 819668233 818082392 817046702 815804482 815018773 815621912
514 815621912 816283226 815696299 815595865 817354143 819084108 819297493 819264710 819655776 819287241 818332255
534.4 818332255 818238139 818567932 818312645 818619072 820044041 820583344 819596946 819003940 818989277 817870855
554.8 817870855 816099942 815164149 814174771 812059522 810312271 810051918 809926927 809619725 810730994
573.1 810730994 812866151 814113081 814770341 815750837 815947235 814943790 814247310 813994288 812769711
591.5 812769711 810930729 809991896 809643567 808884859 808032990 807105064 805113494 802906334 803118348
609.8 803118348 806080163 809436262 811904252 813924789 815400302 815991819 816402733 817138731 817629695
628.2 817629695 817765296 818269432 819281757 820329189 821405530 822577715 823107362 822498739 821488500
646.6 821488500 820740163 819812000 818391979 816997349 815682292 813675106 810885489 808297396 806754351
664.9 806754351 807086706 811109602 816027999 818823874 819507003 819342732 819404781 819011331 817596376
683.3 817596376 815729082 813342094 809688389 805195808 800619960 795862675 792569816 794634581
699.6 794634581 802915633 813270509 821690261 827395380 830718458 831871450 831823826 831613064 831077576
717.9 831077576 829993665 829132915 828776896 828296542 827486038 826716781 825980246 824861526 823402345
736.3 823402345 821780622 819600105 816562951 812997580 809246004 805426955 801716030 798358142
752.6 798358142 795542061 793135345 790477872 786686718 781406939 776021659 773489296 775374949
768.9 775374949 779930949 784143746 786562026 787861884 789309084 791492522 794680953 798879325
785.3 798879325 803358853 807349861 810946107 814398587 817247868 819242179 821037591 823183835
801.6 823183835 825499594 827843308 830419242 833010614 835442066 838384211 841993690 845059872
817.9 845059872 846920431 848384321 849811614 850538373 850528598 850420117 850291669 850183666 850852430 852507114
838.3 852507114 854182541 855402768 856644094 857754409 857929349 857272625 856609643 855994701 855008185
856.6 855008185 854004800 853662133 853937387 854419410 854858935 854857028 854016602 852739096 851935744 851878047
877 851878047 852415323 853785753 855994999 858110249 859285474 859870672 860359013 860405922 860044301 860135317
897.4 860135317 860802352 861257017 861460865 862042010 862727642 862781823 862469971 862449586 862502098 862211585
917.8 862211585 861946523 861921370 861544132 860697389 860045850 859584212 858672857 857513785 856695294 855822623
938.2 855822623 854396701 852918744 851710021 850237966 848489285 847238958 846586049 845986247 845665336
956.6 845665336 846154273 846938610 847245038 847305596 847451270 847200930 846426845 845819414 845472574 844692469
977 844692469 843435705 842285812 841213286 839802682 838137090 836169541 833138585 829169989 826411843
995.3 826411843 826340914 827128887 826517105 824803770 822860897 820775092 818893015 817515016 815979123
1013.7 815979123 813649535 811093986 809119582 807786644 807156265 807594419 808763683 809658408 809984446
1032 809984446 810224950 810398996 810219944 810003161 809993267 809671283 808754683 807777226 806969821 805822372
1052.4 805822372 804207981 802473426 800333261 797234297 793427885 789349854 784776330 779488385
1068.8 779488385 773688912 767188549 759290040 749863982 739448905 728530586 717980921 709425032
1085.1 709425032 703918397 701026320 699991941 700806201 703896880 710040867 720203459 734267414
1101.4 734267414 750184953 765075445 777126312 786113620 792601228 797256231 800746024 803723633
1117.7 803723633 806720734 810164690 814198196 818234503 821404278 823542535 824860215 825189412
1134 825189412 824398637 822873235 821136236 819449484 818028510 817309737 817484915 818050265 818352520
1152.4 818352520 818161309 817379951 815885961 813921571 811815500 809391081 806595862 804319859 803538978
1170.7 803538978 803966582 804497361 804401934 803384423 801497817 799514055 798434675 798412442 798842013
1189.1 798842013 799271405 799394965 798664749 796791434 794027448 790431201 785637736 779483855 771944940
1207.5 771944940 762555599 750693202 736376405 720506489 704881966 692056894 684070647 681343555
1223.8 681343555 683578193 690642893 701637685 714289188 726296902 736660779 745447695 753152430
1240.1 753152430 760483444 767926931 774944603 780073583 782381713 782713115 783126116 785054684 788315892
1258.4 788315892 791688979 794045269 795201659 795817971 796376050 796562314 795802355 793822289 790404618
1276.8 790404618 785326779 778903008 772224367 766766965 763897479 764477432 768357873 774315178
1293.1 774315178 780802548 786697030 791356325 794511616 796367466 797426164 797945201 797707438 796380281
1311.5 796380281 793999553 791059494 788304269 786566794 786198020 786940932 789112449 793666124 800476313
1329.8 800476313 808003128 814957619 821074486 826465607 831157744 835047662 837973356 839720964
1346.2 839720964 840213478 839740992 838520110 836345017 832925081 828001916 820776939 810846686 801029205
1364.5 801029205 795189619 794296145 796873927 800186217 801762223 800477982 797020853 793179929
1380.8 793179929 791060805 791586757 793781757 796098471 798142016 800320446 802713096 804619551
1397.1 804619551 805340946 804940462 803766429 801936805 799762130 797621071 795709133 794119477 792695105
1415.5 792695105 790940702 788465142 785791159 783181727 780796051 779054582 778020203 778003633 778918266
1433.9 778918266 779991865 780585289 780684292 780564129 780574799 780990601 781657040 782136500 782127798 781717479
1454.3 781717479 781024456 780338943 779881060 779166460 777905762 776926219 777495980 780162692 785374582
1472.6 785374582 792018592 798676789 805330455 811918795 817901671 822716594 826611519 830035686
1488.9 830035686 833153069 835855067 838280857 840539277 842399478 843942642 845329523 846316338
1505.2 846316338 846616864 846918821 847509027 848088562 848553300 849050820 849548519 849851727 850137115 850564301
1525.6 850564301 851007521 851404965 851660073 851701736 851795197 851818502 851168931 850057662 849137247 848368406
1546 848368406 847644091 846719682 845580518 844391406 843174458 840775549 837091208 834407270 831617653
1564.4 831617653 828177154 825031996 823348761 823645949 824609876 824614048 823169231 820370615 815949380
1582.8 815949380 810735464 806901395 806506932 809012234 811429799 811555684 809493303 806290030 802548051
1601.1 802548051 798382759 793910086 789211929 784168839 778870761 773630857 767768443 760749996
1617.4 760749996 754598975 748973727 742214978 734944344 727538824 719977736 713223398 706469536
1633.7 706469536 697953820 689901412 683907390 679000258 675318897 673100710 672987342 675374985
1650.1 675374985 682163119 695443928 707895815 718740761 729721189 739829779 747104108 750755012
1666.4 750755012 751666188 750451505 748328984 745417655 741727114 738118947 734764993 730986774
1682.7 730986774 726080239 721693456 717768371 712928355 707066059 698571682 687338352 674684763
1699 674684763 660574615 651572347 648406804 648672104 652222395 658634961 666790128 674110472 677490413
1717.4 677490413 677295268 678072512 683120310 693421662 707306445 721957147 735121191 747423410
1733.7 747423410 757907271 765235960 771860957 778659701 785154939 791536212 797907174 804474592
1750 804474592 810803354 816245914 821209431 825859904 829815328 833360434 836577713 839280486 841655254
1768.4 841655254 843883753 846067727 848024786 849745214 851418495 853043437 854490221 855834186
1784.7 855834186 857266784 858663499 859865963 861027658 862286627 863463223 864466131 865422130
1801 865422130 866416335 867298782 868058980 868833303 869570017 870197177 870792508 871417880 871987224 872448444
1821.4 872448444 872851312 873278558 873683214 873936772 874183118 874501705 874715269 874883771 875202775 875505209
1841.8 875505209 875547707 875575662 875784993 875935674 875967264 876020968 876108229 876122296 876085401 876102090 876120746
1864.2 876120746 876001060 875757098 875626862 875631511 875600815 875549018 875491798 875329733 875113010 875015855 874991894
1886.7 874991894 874864042 874734521 874753356 874761641 874687076 874668777 874729276 874730170 874651194 874596834 874532819 874382973
1911.1 874382973 874242008 874155998 873979867 873767376 873659551 873574436 873470008 873372436 873296559 873235404
1931.5 873235404 873158514 873090744 873068869 873020828 872868776 872725844 872712195 872738361 872724056 872681201 872611582
1954 872611582 872506082 872371137 872259140 872218192 872192979 872115076 872049689 872042716 872037172 872040749 872098863 872142196
1978.5 872142196 872097075 872039139 872033119 872008264 871905625 871793747 871747196 871723294 871644557 871556163 871487260
2000.9 871487260 871357262 871191502 871078610 870985389 870842576 870694935 870567501 870361924 869993806 869478762
2021.3 869478762 868769169 868123591 868236184 868940175 869387329 869431615 869380713 869365692 869323075 869219303
2041.7 869219303 869137287 869073868 868951142 868813217 868743420 868700683 868597448 868452787 868357778 868308365 868230522
2064.1 868230522 868130982 868061781 868012786 867966473 867942631 867931724 867915928 867931724 867986321 868012369 868003488 868020475
2088.6 868020475 868081093 868130922 868110538 868062019 868057907 868065119 868029237 867983162 867970407 867961168 867927015 867910922
2113.1 867910922 867930233 867923498 867879272 867855489 867854834 867849767 867884040 867977381 868033886 868022978 868039310 868090451
2137.5 868090451 868099511 868072748 868063986 868057311 868015766 867975771 867962718 867920220 867846847 867828071 867847025 867810428
2162 867810428 867751300 867717803 867646217 867564678 867570937 867612958 867596626 867556572 867555380 867552578 867499232 867451727
2186.5 867451727 867461622 867468297 867410004 867346764 867316723 867256820 867160559 867094696 867062330 867015362 866955698 866883099
2211 866883099 866771579 866655529 866582215 866523325 866428912 866304159 866172791 866029859 865874290 865740538
2231.4 865740538 865653992 865590751 865534306 865483403 865415096 865347564 865322232 865321159 865301728 865250349 865179479 865105569
2255.8 865105569 865037143 864983201 864945948 864902198 864829302 864746213 864688814 864649057 864596367 864534855 864486396
2278.3 864486396 864447832 864401042 864342391 864256442 864132643 863996506 863864601 863720238 863566101 863423884
2298.7 863423884 863272786 863079607 862856746 862657368 862482429 862265825 862038314 861883283 861699283 861366510
2319.1 861366510 861011863 860768080 860548258 860253632 859937787 859689236 859471083 859196782 858919561 858723402
2339.5 858723402 858582079 858514249 858716011 859217465 859600782 859469175 858855486 858170390 857677221 857357085
2359.9 857357085 857092142 856911242 856928110 857080996 857267559 857497036 857781708 858081698 858367026 858676255
2380.2 858676255 859010458 859240592 859305143 859319448 859337866 859281719 859173477 859112918 859063566 858955860 858865559
2402.7 858865559 858856678 858837783 858732522 858625352 858592033 858564317 858518481 858505189 858492434 858423412 858336866
2425.1 858336866 858291745 858249307 858167708 858100116 858044386 857924461 857776582 857682049 857608438 857490599 857366085
2447.6 857366085 857295752 857226253 857107401 857010365 856951356 856846809 856710196 856606841 856505871 856354713
2467.9 856354713 856206715 856119037 856018126 855853975 855714679 855627060 855503559 855347514 855232537 855133474
2488.3 855133474 854977250 854805231 854689896 854569972 854395151 854237080 854123354 853982568 853826106 853752494
2508.7 853752494 853716195 853596210 853456676 853392184 853320658 853183925 853051543 852957845 852842271 852680743
2529.1 852680743 852550507 852459431 852324486 852200687 852167368 852123857 852018416 851942599 851903617 851805866 851672709
2551.6 851672709 851609111 851548553 851391256 851244509 851183593 851086915 850917876 850824893 850823522 850743949 850582659
2574 850582659 850462914 850338757 850145757 849980414 849896133 849787652 849599540 849433661 849312603 849147022
2594.4 849147022 848972201 848846555 848692417 848471880 848285139 848179877 848057687 847885132 847742260 847612619
2614.8 847612619 847433925 847273231 847182751 847083569 846936107 846809149 846728086 846611738 846448481 846340418
2635.2 846340418 846288800 846198261 846083939 846018195 845961750 845852911 845725954 845627427 845520973 845377326
2655.6 845377326 845264733 845183432 845051885 844890296 844751358 844605148 844424665 844272196 844179690 844065607
2676 844065607 843898356 843749344 843603849 843383431 843144238 842981696 842847586 842658460 842449546 842265606
2696.4 842265606 842042923 841750979 841484010 841267943 840997398 840667665 840366125 840065956 839724422 839407265
2716.8 839407265 839151859 838892043 838594794 838345706 838114500 837741673 837313771 837008119 836751282 836424172
2737.2 836424172 836094260 835856676 835654974 835461795 835340440 835204542 834909260 834542453 834266186 833998144
2757.6 833998144 833612204 833220720 832917273 832575381 832147121 831775784 831502557 831206620 830807865 830359101
2778 830359101 829932094 829505682 829078972 828709900 828365982 827931702 827401638 826881409 826398611 825904310
2798.4 825904310 825379670 824819684 824210584 823624372 823131621 822602749 821941555 821291745 820755899 820223868
2818.8 820223868 819596350 818916261 818200350 817389071 816442490 815339148 814003468 812339306 810320199
2837.1 810320199 807787418 804480314 800439715 795860946 790902615 785978734 781943560 779709518
2853.4 779709518 779519737 780862451 782924950 784914136 786301434 786942482 787021041 786953866 787133217
2871.8 787133217 787561417 787981808 788229704 788149357 787629187 786701739 785358131 783607244 781584144
2890.1 781584144 779414117 777110219 774609804 771947980 769311130 766803920 764364719 761890948
2906.5 761890948 759257793 756276011 752667964 748214245 743117988 738069773 733800948 730761170
2922.8 730761170 729142487 729097486 730647147 733354211 736706316 740444064 744324446 748087764 751578391
2941.1 751578391 754603684 756821394 758010387 758315265 758162856 757891536 757707179 757866263 758488357
2959.5 758488357 759465396 760584116 761685550 762719452 763684392 764673412 765758991 766949773 768435299
2977.8 768435299 770355701 772504747 774722815 777139127 779880762 782901287 785896719 788494289
2994.2 788494289 790708423 792619646 794169068 795483172 796648681 797686040 798737526 799833953
3010.5 799833953 800758243 801275074 801400185 801309824 801097631 800825834 800482392 799972832 799409568 798910975
3030.9 798910975 798367977 797578752 796497762 795396090 794402480 793318450 792019129 790638685 789399266
3049.2 789399266 788266659 787145615 786142766 785236657 784313798 783375323 782419562 781439662 780313432
3067.6 780313432 778909445 777400434 776081443 775094032 774301708 773353040 772188485 771021247 769840419
3085.9 769840419 768660724 767622888 766637564 765635729 764794171 764243782 763805568 763224900 762630761
3104.3 762630761 762288868 762048125 761625707 761240244 761207998 761299729 761250973 761060596 760766029 760627687
3124.7 760627687 760934472 761607766 762377560 763145328 764036357 765126348 766205370 767019331 767649829
3143 767649829 768266678 768856406 769443512 769998074 770221651 770001471 769627094 769256055 768777907 768139601
3163.4 768139601 767388046 766519189 765516698 764442384 763332546 762134433 760820508 759452999 758058488
3181.8 758058488 756599963 755112410 753658533 752197146 750658154 749049723 747427344 745826781
3198.1 745826781 744246185 742675960 741114199 739550829 737979472 736435652 734918892 733346522
3214.4 733346522 731705964 730072141 728460014 726849735 725264728 723740697 722343743 721162915
3230.7 721162915 720113575 718938291 717657328 716545701 715679526 715024471 714581847 714279056 714036942
3249.1 714036942 713955402 714197636 714721203 715346754 716033876 716862738 717848003 718969345 720209658
3267.5 720209658 721490502 722643197 723565578 724345684 725109160 725879669 726579309 727133036 727563083
3285.8 727563083 727935016 728271246 728509188 728572309 728466988 728212118 727854192 727516651 727228224 726788759
3306.2 726788759 726024032 725011408 723878801 722708344 721556187 720374763 719120026 717852831
3322.5 717852831 716591060 715215445 713666320 712046862 710461259 708931506 707411110 705760837
3338.8 705760837 703906298 701912701 699817300 697742343 695788503 693714559 691364646 688938379
3355.2 688938379 686581552 684309244 682056785 679794431 677656829 675629854 673468292 671064615
3371.5 671064615 668651104 666463912 664450467 662492454 660525620 658598721 656861484 655357778
3387.8 655357778 654005826 652625203 651102483 649624467 648427784 647414088 646283925 644989252
3404.1 644989252 643783212 642784238 641888022 641015589 640153587 639332414 638611257 637975812 637395740
3422.5 637395740 636944771 636675000 636532664 636413693 636332035 636371434 636463046 636562705 636790156 637206197
3442.9 637206197 637743294 638349056 639027953 639800310 640648067 641557813 642578900 643715799 644823074
3461.2 644823074 645897806 647159278 648578346 649820447 650766432 651724041 652929246 654310882 655657828
3479.6 655657828 656832635 658000410 659338593 660712421 662021697 663379550 664849937 666397095
3495.9 666397095 667908251 669391572 670908630 672298610 673561990 674932837 676511526 678281307
3512.2 678281307 680023670 681579053 683143616 684874237 686738253 688533008 690132082 691717088
3528.5 691717088 693448663 695337713 697346985 699298561 701112092 703041434 705183148 707258344
3544.8 707258344 709022820 710693717 712523639 714414775 716354609 718429983 720587134 722714067
3561.1 722714067 724697053 726563811 728633583 731039286 733452439 735724390 738040447 740492404
3577.5 740492404 743057668 745742798 748468816 751027286 753320932 755719125 758363426 760979831
3593.8 760979831 763547957 766234517 768948197 771547139 774055839 776422977 778694093 781016529
3610.1 781016529 783369303 785736561 788019836 790102363 792213023 794440687 796506703 798155725
3626.4 798155725 799411595 800904810 802765846 804515600 806030571 807396293 808667600 809931219
3642.7 809931219 811195910 812223315 812975466 813879550 814944327 815819860 816611469 817596734 818432391
3661.1 818432391 818890214 819340408 819829583 819981992 820085943 820398808 820392132 820427537 820956051 821619749
3681.5 821619749 822326124 823084295 823719263 823991358 824160635 824570835 825037539 825361669 825507045 825510025
3701.9 825510025 825666845 826087594 826393247 826273322 825993836 826127231 826533973 826831698 826933503 826867044
3722.3 826867044 826740623 826777697 827135503 827500463 827494502 827240288 827149212 827350080 827539980 827247560
3742.7 827247560 826553702 826372325 826411545 826043963 825870156 826142430 826338947 826258838 826207161 826332867
3763.1 826332867 826387405 826269209 826028407 825874090 825976074 826129854 826169431 826066017 825911820 825793505
3783.5 825793505 825710654 825730741 825785935 825790346 825749815 825615942 825477362 825263679 824892819 824809790 824793637
3805.9 824793637 824628234 824758232 825042069 825015485 824684024 824570775 824422956 824065328 824104249 824276268
3826.3 824276268 824291468 824275076 824287295 824393690 824250579 823675096 823330283 823352933 823442459 823624015
3846.7 823624015 823856115 823743641 822781920 821946084 822288215 822836936 822974324 822795391 822626472 822620332
3867.1 822620332 822473526 822205901 822125733 822201490 822376013 822328925 822106183 822077215 821985185 821865499
3887.5 821865499 821832418 821659803 821586072 821742713 821730852 821369648 820916414 820622206 820653319 820932090
3907.9 820932090 821102798 821106791 821076632 820878208 820537806 820418894 820501685 820471644 820390880 820392311 820298553
3930.3 820298553 820139170 820153475 820249617 820245385 820128143 819950521 819850087 819796979 819682062 819619060 819645166
3952.7 819645166 819661140 819630027 819577098 819509685 819427371 819353163 819288671 819246411 819222033 819202065 819189012
3975.2 819189012 819146633 819081783 819054008 819048464 818995476 818917572 818826079 818680167 818542480 818462551 818423331
3997.6 818423331
##END=$$ End of the data block
