##TITLE=MS-11 $$ Begin of the data block
##JCAMP-DX=5.00 $$ ACD/SpecManager v 10.08
##SPECTROMETER/DATA SYSTEM=Alpha
##DATE=06 Jul 2015 08:38:20
##DATA TYPE=INFRARED SPECTRUM
##DATA CLASS=XYDATA
##ORIGIN=
##OWNER=
##NPOINTS=1765
##FIRSTX=399.76428223
##LASTX=3997.64306641
##MAXX=3997.64306641
##MINX=399.76428223
##MAXY=0.87486464
##MINY=0.30028749
##XFACTOR=1.0000000000
##YFACTOR=1.000000000000000e-9
##FIRSTY=0.78558207
##DELTAX=2.03961372
##XUNITS=1/CM
##YUNITS=ARBITRARY UNITS
##XYDATA=(X++(Y..Y))
$$ plain form
399.8 785582066 788475931 792227507 794709206 795430183 796115935 797201633 797203481 796464086 796273530
418.1 796273530 795953810 794880867 793932438 792909563 790762782 787629306 784464538 781016290 776654541
436.5 776654541 771600962 764047801 751901448 740821362 738054931 739779353 737945080 730973721
452.8 730973721 721675038 713353336 711459219 719180524 732863665 747370064 760669529 772074163
469.1 772074163 780538619 786672533 791662574 795024633 796295643 796878994 797549486 797252655 796016097
487.5 796016097 795000136 793741226 791282117 788442254 785716116 781578362 775010049 766382992
503.8 766382992 754357994 738607705 726990879 727996767 737347364 745658994 752750516 762393355
520.1 762393355 772751868 780543685 785296261 787037313 786366343 785238862 784281313 782309294 779469073
$$ packed form
399.8G85582066K893865L751576K481699P20977O85752J085698J848p39395j90556
418.1G96273530l19720j072943r48429j022875k146781l133476l164768l448248m361749
436.5G76654541n053579p553161j2146353j1080086k766431J724422j834273o971359
452.8G30973721r298683q321702j894117P721305J3683141J4506399J3299465J1404634
469.1G72074163Q464456O133914M990041L362059J271010N83351O70492k96831j236558
487.5G96016097j015961j258910k459109k839863k726138m137754o568313q627057
503.8G66382992j2024998j5750289j1616826J005888R350597Q311630P091522R642839
520.1G62393355J0358513P791817M752576J741052o70970j127481r57549j972019k840221
$$ plain form
538.5 779469073 776707411 772738338 766461909 762006342 764269769 769942701 772793233 772209346 769383073
556.8 769383073 764105260 757717490 752363324 747586727 742939055 742641568 749983311 759898126 766027331
575.2 766027331 768074393 767619967 765350401 762652159 760147333 756925941 752935350 748942554 744351745
593.5 744351745 738111377 730545759 721612990 709813952 694631994 678530693 666831076 666145086
609.8 666145086 678680420 698079765 715185940 725433290 729196191 728254974 724141300 720102191
626.2 720102191 720062196 723384261 724291444 717490017 706882834 703447044 709930539 719847381 728069961
644.5 728069961 733053207 735238373 735441804 733033180 727523446 720922172 717075408 719557345 728941619
662.9 728941619 740794897 750921786 755441308 752000928 742219031 725570858 706016660 697724044
$$ packed form
538.5G79469073k761662l969073o276429m455567K263427N672932K850532n83887k826273
556.8G69383073n277813o387770n354166m776597m647672k97487P341743R914815O129205
575.2G66027331K047062m54426k269566k698242k504826l221392l990591l992796m590809
593.5G44351745o240368p565618q932769j1799038j5181958j6101301j1699617o85990
609.8F66145086J2535334J9399345J7106175J0247350L762901r41217m113674m039109
626.2G20102191l9995L322065R07183o801427j0607183l435790O483495R916842Q222580
644.5G28069961M983246K185166K03431k408624n509734o601274l846764K481937R384274
662.9G28941619J1853278J0126889M519522l440380r781897j6648173j9554198q292616
$$ plain form
679.2 697724044 711466610 736879945 756541431 765000880 763495088 752224326 730265319 695355356
695.5 695355356 650760055 622342229 643030822 703080595 759411335 791367888 805889308
709.8 805889308 811636090 812886357 812696755 812230051 811007261 809673429 809256434 808864832 807398379
728.1 807398379 805663705 804331124 802630186 800349295 797961891 794500887 788013101 777169704
744.5 777169704 760300756 737809896 718729496 714465261 723258018 733342230 738054812 737578094
760.8 737578094 731648564 718478143 701118350 691862583 700748026 719691634 733390272 737685144
777.1 737685144 735946000 731216133 724875569 716478705 705400884 692121506 677175283 660211504
793.4 660211504 640740871 624285400 624173760 646648228 682827234 717214882 737771749 744458795
$$ packed form
679.2F97724044J3742566K5413335J9661486Q459449j505792j1270762k1959007l4909963
695.5F95355356m4595301k8417826K0688593O0049773N6330740L1956553J4521420
709.8H05889308N746782J250267j89602m66704j222790j333832m16995l91602j466453
728.1H07398379j734674j332581j700938k280891k387404l461004o487786j0843397
744.5G77169704j6868948k2490860j9080400m264235Q792757J0084212M712582m76718
760.8G37578094n929530j3170421j7359793r255767Q885443J8943608J3698638M294872
777.1G37685144j739144m729867o340564q396864j1077821j3279378j4946223j6963779
793.4F60211504j9470633j6455471j11640K2474468L6179006L4387648K0556867O687046
$$ plain form
809.7 744458795 746128023 748944163 753480673 758811116 763781488 766476095 766980767 768584609 773320973
828.1 773320973 779399991 784564078 788394570 791009307 792907178 795540571 799395025 802648067
844.4 802648067 803123355 799469113 789816976 774188042 761684179 764931738 782178223 799516737
860.7 799516737 809377909 813402951 814560652 814528763 813973427 812333167 808865249 804363310 800749898
879.1 800749898 800124228 804160655 811886191 819439769 823734820 824584603 823372126 821047544 818992853
897.4 818992853 820044398 824411154 828337252 829616487 829483807 829114377 828236639 826706052 825154424
915.8 825154424 824101746 823650658 823601305 823437154 822616041 821120918 819507003 817854881 815548718
934.1 815548718 812460840 808949411 804642498 798913479 792267740 786216319 782570124 782974124 787518144
$$ packed form
809.7G44458795J669228K816140M536510N330443M970372K694607N04672J603842M736364
828.1G73320973O079018N164087L830492K614737J897871K633393L854454L253042
844.4H02648067M75288l654242r652137j5628934j2503863L247559J7246485J7338514
860.7G99516737R861172M025042J157701l1889n55336j640260l467918m501939l613412
879.1H00749898o25670M036427P725536P553578M295051Q49783j212477k324582k054691
897.4H18992853J051545M366756L926098J279235j32680l69430q77738j530587j551628
915.8H25154424j052678m51088m9353j64151q21113j495123j613915j652122k306163
934.1H15548718l087878l511429m306913n729019o645739o051421l646195M04000M544020
$$ plain form
952.5 787518144 793655515 798371434 800948679 802218080 802434087 801606417 800421119 799265265 797686875
970.9 797686875 795500278 793165267 791014671 789057195 787165940 785216451 782885373 779785693
987.2 779785693 775583625 768658340 756327748 743116140 740488052 746860683 749220550 745094836
1003.5 745094836 740656316 738768876 737795591 734524012 726830423 715521753 705927849 705676913
1019.8 705676913 716890335 733088315 746793509 755813718 761422515 765057683 767378211 768345833
1036.1 768345833 767891586 766598344 765103579 763354480 761195838 759036362 757068336 754800856
1052.4 754800856 751988769 748909056 745478630 741301119 736342311 730539560 723773837 716873884
1068.8 716873884 710651875 704022288 695343077 684378803 671637595 657287836 641595066 625305116
$$ packed form
952.5G87518144O137371M715919K577245J269401K16007q27670j185298j155854j578390
970.9G97686875k186597k335011k150596j957476j891255j949489k331078l099680
987.2G79785693m202068o925285j2330592j3211608k628088O372631K359867m125714
1003.5G45094836m438520j887440r73285l271579p693589j1308670r593904k50936
1019.8G05676913J1213422J6197980J3705194R020209N608797L635168K320528R67622
1036.1G68345833m54247j293242j494765j749099k158642k159476j968026k267480
1052.4G54800856k812087l079713l430426m177511m958808n802751o765723o899953
1068.8G16873884o222009o629587q679211j0964274j2741208j4349759j5692770j6289950
$$ plain form
1085.1 625305116 608719707 591461957 573633015 555971086 538401663 520086944 502832770
1099.4 502832770 494392633 504516900 533428371 568797529 599500537 624067843 642645001
1113.6 642645001 655562639 670217812 693793178 722581446 747667551 764381111 773076415
1127.9 773076415 775849998 774037540 768235624 759879708 751944661 747906864 749580264 755452275
1144.2 755452275 761599898 764706254 763946414 759939253 753253102 745144427 738459647 735253692
1160.5 735253692 734026909 731622517 726501346 719413340 713573217 712934852 716668606 719161689
1176.9 719161689 717022419 710700929 701410830 691114783 683692098 681992054 683952034 685256779
1193.2 685256779 684012592 680337787 674327254 665984869 655412495 642431259 626538634 607220232
$$ packed form
1085.1F25305116j6585409j7257750j7828942j7661929j7569423j8314719j7254174
1099.4E02832770q440137J0124267K8911471L5369158L0703008K4567306J8577158
1113.6F42645001J2917638J4655173K3575366K8788268K5086105J6713560Q695304
1127.9G73076415K773583j812458n801916q355916p935047m037797J673400N872011
1144.2G55452275O147623L106356p59840m007161o686151q108675o684780l205955
1160.5G35253692j226783k404392n121171p088006n840123o38365L733754K493083
1176.9G19161689k139270o321490r290099j0296047p422685j700044J959980J304745
1193.2F85256779j244187l674805o010533q342385j0572374j2981236j5892625j9318402
$$ plain form
1209.5 607220232 584024549 556644619 525075197 489701033 451983362 416512847 392647892
1223.8 392647892 390664250 413514137 454077095 500539362 542718470 574986994 596426547
1238.1 596426547 609676003 619048357 628043115 637212515 643723965 643965960 639295757 638356864
1254.4 638356864 649462581 671664000 696760356 717343032 730578065 737034559 738516212 736734688
1270.7 736734688 732760310 727041960 719517708 709702969 697127163 681706369 663385034 642523766
1287 642523766 622461140 610656500 613515198 629021525 648351669 665463328 679572225 689134240
1303.3 689134240 690524042 681820393 663874924 639204919 612513006 591235161 582995534 592955768
1319.6 592955768 619779348 654272735 686733067 713558018 735497832 753301978 767145813
$$ packed form
1209.5F07220232k3195683k7379930l1569422l5374164l7717671l5470515k3864955
1223.8C92647892j983642K2849887M0562958M6462267M2179108L2268524K1439553
1238.1E96426547J3249456R372354Q994758R169400O511450K41995m670203r38893
1254.4F38356864J1105717K2201419K5096356K0582676J3235033O456494J481653j781524
1270.7G36734688l974378n718350p524252r814739j2575806j5420794j8321335k0861268
1287F42523766k0062626j1804640K858698J5506327J9330144J7111659J4108897R562015
1303.3F89134240J389802q703649j7945469k4670005k6691913k1277845q239627R960234
1319.6E92955768K6823580L4493387L2460332K6824951K1939814J7804146J3843835
$$ plain form
1333.9 767145813 777658522 785676479 791534543 795081258 796096861 794445992 790156007 783373594
1350.2 783373594 773583412 759359121 739366412 714916110 692375958 680050075 678340912 679578245
1366.6 679578245 679699719 678056777 672549605 661105335 645561337 631241322 624114215 626162887
1382.9 626162887 634557366 648458719 666981399 685000241 699424505 709320128 713830292 713820338
1399.2 713820338 711011529 706141651 699141383 690740943 681375921 670676768 659177184 648439705
1415.5 648439705 639682353 633718252 630703032 629389882 628827453 628736675 630564332 636239469 643583596
1433.9 643583596 648493886 648382485 644156277 637790740 630826652 624107540 616667569 608144045
1450.2 608144045 600179553 595203698 595400572 601261318 608268559 614255726 620026827 625794411
$$ packed form
1333.9G67145813J0512709Q017957N858064L546715J015603j650869m289985o782413
1350.2G83373594r790182j4224291j9992709k4450302k2540152j2325883j709163J237333
1366.6F79578245J21474j642942n507172j1444270j5543998j4320015p127107K048672
1382.9F26162887Q394479J3901353J8522680J8018842J4424264R895623M510164r954
1399.2G13820338k808809m869878p000268q400440r365022j0699153j1499584j0737479
1415.5F48439705q757352n964101l015220j313150n62429r0778J827657N675137P344127
1433.9F43583596M910290j11401m226208o365537o964088o719112p439971q523524
1450.2F08144045p964492m975855J96874N860746P007241N987167N771101N767584
$$ plain form
1466.5 625794411 630715132 634932637 643594205 662276804 684603035 701484263 711548150 717738569
1482.8 717738569 720840335 720216513 717032015 715088665 717444956 725267053 738988161 754451573
1499.1 754451573 766782224 775200486 780969203 784944355 786937535 787720144 787752211 787036121 786189795
1517.5 786189795 785889149 785958529 786148131 786539435 786974072 786832213 785637856 783676207 781850576
1535.8 781850576 779685974 776155293 772436261 769288421 766006052 762579322 758890390 754943430
1552.2 754943430 750819564 746636689 741101086 734759748 730540872 726235032 720446765 713813066
1568.5 713813066 709037662 708499134 709915817 710457385 709022462 705300450 698806226 690175295 681644320
1586.8 681644320 676132321 674493253 674539089 673468351 670214415 665205181 659021676 651883006 643952429
$$ packed form
1466.5F25794411M920721M217505Q661568J8682599K2326231J6881228J0063887O190419
1482.8G17738569L101766o23822l184498j943350K356291P822097J3721108J5463412
1499.1G54451573J2330651Q418262N768717L975152J993180P82609L2067p16090q46326
1517.5G86189795l00646O9380J89602L91304M34637j41859j194357j961649j825631
1535.8G81850576k164602l530681l719032l147840l282369l426730l688932l946960
1552.2G54943430m123866m182875n535603o341338m218876m305840n788267o633699
1568.5G13813066m775404n38528J416683N41568j434923l722012o494224q630931q530975
1586.8F81644320n511999j639068M5836j070738l253936n009234o183505p138670p930577
$$ plain form
1605.2 643952429 635234833 625498235 614935398 604089737 591776252 577273548 564333677 551859021
1621.5 551859021 536411583 519081473 500246227 479733378 460265636 441325665 422368705
1635.8 422368705 412038773 413843155 424569756 442008018 467088938 495540619 518022299
1650.1 518022299 541447163 570236862 588021994 596276939 599068522 595512867 587059915 576520205
1666.4 576520205 562610328 544037759 523563445 497148842 462804556 426667273 390063137
1680.7 390063137 352568090 319040895 303135514 300287485 302430451 309104919 323248327 343618602
1697 343618602 364915431 388223261 409226775 430595219 455741972 480673879 504130781 526861548
1713.3 526861548 550382614 576977432 602553785 622777045 640476763 656446040 669868708
$$ packed form
1605.2F43952429q717596r736598j0562837j0845661j2313485j4502704j2939871j2474656
1621.5E51859021j5447438j7330110j8835246k0512849j9467742j8939971j8956960
1635.8D22368705j0329932J804382J0726601J7438262K5080920K8451681K2481680
1650.1E18022299K3424864K8789699J7785132Q254945K791583l555655q452952j0539710
1666.4E76520205j3909877j8572569k0474314k6414603l4344286l6137283l6604136
1680.7C90063137l7495047l3527195j5905381k848029K142966O674468J4143408K0370275
1697C43618602K1296829K3307830K1003514K1368444K5146753K4931907K3456902K2730767
1713.3E26861548K3521066K6594818K5576353K0223260J7699718J5969277J3422668
$$ plain form
1727.6 669868708 681138933 690777481 700914323 711167932 719381273 727321923 735729694 743725836
1743.9 743725836 751374066 758793652 766523838 774189770 780730784 786714733 792629957 797991276
1760.2 797991276 803055227 807888567 812183261 816119015 819819391 823743343 827547967 830632031
1776.5 830632031 833319128 835860908 838045955 839866996 841610610 843044519 844125152 845591307
1792.8 845591307 847787321 850079119 852161348 854230046 856276989 857962906 859337032 860744059
1809.2 860744059 862167716 863447368 864625812 865747809 866610229 867137432 867559850 868086278 868558943
1827.5 868558943 868973553 869660676 870408416 870931149 871377766 871785045 871834397 871641815 871871710 872525215
1847.9 872525215 873172224 873743117 874286294 874659538 874787867 874827147 874864638 874734938 874371946 874050558
$$ packed form
1727.6F69868708J1270225R638548J0136842J0253609Q213341P940650Q407771P996142
1743.9G43725836P648230P419586P730186P665932O541014N983949N915224N361319
1760.2G97991276N063951M833340M294694L935754L700376L923952L804624L084064
1776.5H30632031K687097K541780K185047J821041J743614J433909J080633J466155
1792.8H45591307K196014K291798K082229K068698K046943J685917J374126J407027
1809.2H60744059J423657J279652J178444J121997Q62420N27203M22418N26428M72665
1827.5H68558943M14610O87123P47740N22733M46617M07279M9352j92582K29895O53505
1847.9H72525215O47009N70893N43177L73244J28329L9280L7491j29700l62992l21388
$$ plain form
1868.3 874050558 874001384 873927176 873631895 873307228 872993290 872587264 872084618 871433198 870427072 869017363
1888.7 869017363 867466569 865843594 864037156 862601519 862267733 862895668 863893807 865019441 866197467
1907.1 866197467 867198169 867964506 868587792 868972003 869014382 868938625 868870795 868666530 868342936 868035793
1927.5 868035793 867770970 867420495 867039979 866885304 866893470 866722405 866390407 866152108 865827322 865155816
1947.9 865155816 864304125 863523781 863073766 863305867 864108920 864911318 865386307 865642488 865796685 865748107
1968.3 865748107 865461230 865162671 864991128 864825249 864727378 864880860 865134180 865214646 865175009 865137815
1988.7 865137815 864996850 864766300 864679396 864702284 864596009 864398897 864277840 864128947 863804996 863489807
2009 863489807 863317430 863070965 862650454 862276196 861954749 861419559 860634565 860022068 860028923 860330403
$$ packed form
1868.3H74050558m9174p4208k95281l24667l13938m06026n02646o51420j006126j409709
1888.7H69017363j550794j622975j806438j435637l33786O27935R98139J125634J178026
1907.1H66197467J000702P66337O23286L84211M2379p5757o7830k04265l23594l07143
1927.5H68035793k64823l50475l80516j54675Q166j71065l31998k38299l24786o71506
1947.9H65155816q51691p80344m50015K32101Q03053Q02398M74989K56181J54197m8578
1968.3H65748107k86877k98559j71543j65879r7871J53482K53320Q0466l9637l7194
1988.7H65137815j40965k30550q6904K2888j06275j97112j21057j48893l23951l15189
2009H63489807j72377k46465m20511l74258l21447n35190p84994o12497O855L01480
$$ plain form
2029.4 860330403 860450625 860430658 860268533 859963775 859709799 859496355 859130621 858678520 858323336 857971728
2049.8 857971728 857506633 857115865 856902182 856661081 856372237 856273353 856333435 856381655 856530070 856844008
2070.2 856844008 857064009 857063532 857082605 857186496 857151806 857007265 856977165 856952071 856717288 856442750 856298983
2092.7 856298983 856079876 855661988 855238318 854823530 854337990 854040623 854117274 854225039 854059815 853843808
2113.1 853843808 853782296 853692293 853463113 853299737 853231251 853020430 852650106 852280557 851798832 851072490
2133.5 851072490 850249290 849248528 847553432 844601035 839608371 830793619 815898359 797356486
2149.8 797356486 787696660 797443688 818568766 836073995 845582843 850002766 852090776 853196025
2166.1 853196025 853721857 853840232 853887677 853991687 853945673 853707910 853529572 853470683 853301287 853038728
$$ packed form
2029.4H60330403J20222j9967j62125l04758k53976k13444l65734m52101l55184l51608
2049.8H57971728m65095l90768k13683k41101k88844r8884O0082M8220J48415L13938
2070.2H56844008K20001m77J9073J03891l4690j44541l0100k5094k34783k74538j43767
2092.7H56298983k19107m17888m23670m14788m85540k97367P6651J07765j65224k16007
2113.1H53843808o1512r0003k29180j63376o8486k10821l70324l69549m81725p26342
2133.5H51072490q23200j000762j695096k952397m992664q814752j4895260j8541873
2149.8G97356486r659826R747028K1125078J7505229R508848M419923K088010J105249
2166.1H53196025N25832J18375M7445J04010m6014k37763j78338n8889j69396k62559
$$ plain form
2186.5 853038728 852860868 852658510 852278113 851886213 851588666 851235449 850822926 850500226 850235760 849900126
2206.9 849900126 849597931 849467993 849397540 849256396 849138439 849065661 848844171 848474026 848205805 848084331
2227.3 848084331 847930491 847753286 847645640 847496450 847233653 847023964 846936405 846837938 846709728 846661925
2247.7 846661925 846649706 846527874 846340179 846190870 846026897 845776618 845545709 845400870 845205724 844955146
2268.1 844955146 844836533 844843090 844825983 844835877 844957173 845052660 844999671 844911993 844831109 844627857 844316006
2290.5 844316006 844028533 843741417 843344986 842944264 842657447 842324197 841844797 841403902 841064155 840634346
2310.9 840634346 840100527 839618862 839089751 838369071 837663054 837175906 836753488 836225688 835732400 835379243
2331.3 835379243 835004032 834609628 834382236 834250629 834092379 834105372 834484339 834925354 834983587 834573627
$$ packed form
2186.5H53038728j77860k02358l80397l91900k97547l53217m12523l22700k64466l35634
2206.9H49900126l02195j29938p0453j41144j17957p2778k21490l70145k68221j21474
2227.3H48084331j53840j77205j07646j49190k62797k09689q7559r8467j28210m7803
2247.7H46661925j2219j21832j87695j49309j63973k50279k30909j44839j95146k50578
2268.1H44955146j18613O557j7107R894J21296R5487n2989q7678q0884k03252l11851
2290.5H44316006k87473k87116l96431m00722k86817l33250m79400m40895l39747m29809
2310.9H40634346n33819m81665n29111p20680p06017m87148m22418n27800m93288l53157
2331.3H35379243l75211l94404k27392j31607j58250J2993L78967M41015N8233m09960
$$ plain form
2351.7 834573627 833831966 832958639 832232058 831781566 831477642 831365526 831552207 831846237 832055509 832255363
2372.1 832255363 832531989 832776666 832931578 833094716 833255947 833251536 833052397 832846284 832701206 832513809
2392.5 832513809 832320988 832221448 832142532 831991315 831848741 831790864 831729352 831648350 831649005 831695259 831670344
2414.9 831670344 831603885 831577420 831527889 831365824 831145585 830919623 830657899 830381513 830141008 829944074
2435.3 829944074 829764843 829608321 829526365 829493880 829444647 829387426 829328477 829221666 829082012 828959227
2455.7 828959227 828808606 828574955 828302681 828038573 827734649 827351093 826956689 826604903 826260865 825927258
2476.1 825927258 825647950 825374722 825029790 824626207 824186683 823684871 823096156 822451353 821814597 821227789
2496.5 821227789 820780993 820585907 820581257 820606589 820617259 820618153 820570588 820459902 820342898 820246577 820114553
$$ packed form
2351.7H34573627p41661q73327p26581m50492l03924j12116J86681K94030K09272J99854
2372.1H32255363K76626K44677J54912J63138J61231m411j99139k06113j45078j87397
2392.5H32513809j92821r9540p8916j51217j42574n7877o1512q1002O55M6254k4915
2414.9H31670344o6459k6465m9531j62065k20239k25962k61724k76386k40505j96934
2435.3H29944074j79231j56522q1956l2485m9233n7221n8949j06811j39654j22785
2455.7H28959227j50621k33651k72274k64108l03924l83556l94404l51786l44038l33607
2476.1H25927258k79308k73228l44932m03583m39524n01812n88715o44803o36756n86808
2496.5H21227789m46796j95086m650K5332J0670Q94m7565j10686j17004r6321j32024
$$ plain form
2518.9 820114553 819933116 819764972 819625199 819453716 819248438 819060087 818877995 818666637 818451643 818296373
2539.3 818296373 818202496 818102598 817983389 817885399 817782223 817643344 817494929 817323446 817080975 816765130
2559.7 816765130 816430986 816151142 815955937 815828264 815708756 815520406 815253615 814955592 814610124 814182520
2580.1 814182520 813769579 813448489 813139021 812767982 812372327 811996162 811596751 811160862 810772181 810450256
2600.5 810450256 810120523 809795022 809545040 809333086 809088349 808841944 808639050 808437228 808188796 807909489
2620.9 807909489 807606876 807248294 806851685 806453466 806021571 805561423 805190682 804954350 804732800 804469287
2641.3 804469287 804230928 804005325 803705335 803360522 803053260 802738488 802369177 802026868 801720083 801348805
2661.7 801348805 800916493 800517857 800196648 799966097 799892843 799968660 800016642 799907923 799679995 799374521
$$ packed form
2518.9H20114553j81437j68144j39773j71483k05278j88351j82092k11358k14994j55270
2539.3H18296373r3877r9898j19209r7990j03176j38879j48415j71483k42471l15845
2559.7H16765130l34144k79844j95205j27673j19508j88350k66791k98023l45468m27604
2580.1H14182520m12941l21090l09468l71039l95655l76165l99411m35889l88681l21925
2600.5H10450256l29733l25501k49982k11954k44737k46405k02894k01822k48432k79307
2620.9H07909489l02613l58582l96609l98219m31895m60148l70741k36332k21550k63513
2641.3H04469287k38359k25603k99990l44813l07262l14772l69311l42309l06785l71278
2661.7H01348805m32312l98636l21209k30551p3254P5817M7982j08719k27928l05474
$$ plain form
2682.1 799374521 798985958 798567653 798165977 797712922 797151685 796556771 795989037 795377791 794690847 794013143
2702.5 794013143 793360054 792659342 791920364 791193068 790463448 789767504 789190054 788713396 788228333 787671030
2722.9 787671030 787070036 786414087 785668373 784931660 784307361 783744156 783157587 782568693 782032609 781539977
2743.3 781539977 781052768 780537605 779937804 779228985 778470516 777697384 776862383 775954366 775010705 774018228
2763.7 774018228 772921562 771705568 770411491 769063115 767652690 766164482 764611661 763032854
2780 763032854 761457145 759939432 758540630 757228673 755857885 754323840 752669811 750939965 749068737
2798.4 749068737 747051656 745065928 743317723 741986454 741223693 741003394 741186798 741711795 742451429
2816.7 742451429 743122697 743504524 743513644 743115902 742299855 741042912 739305496 737040579 734183669
$$ packed form
2682.1G99374521l88563m18305m01676m53055n61237n94914n67734o11246o86944o77704
2702.5G94013143o53089p00712p38978p27296p29620o95944n77450m76658m85063n57303
2722.9G87671030o00994o55949p45714p36713o24299n63205n86569n88894n36084m92632
2743.3G81539977m87209n15163n99801p08819p58469p73132q35001r08017r43661r92477
2763.7G74018228j096666j215994j294077j348376j410425j488208j552821j578807
2780G63032854j575709j517713j398802j311957j370788j534045j654029j729846j871228
2798.4G49068737k017081j985728j748205j331269p62761k20299J83404N24997P39634
2816.7G42451429O71268L81827R120l97742q16047j256943j737416k264917k856910
$$ plain form
2835.1 734183669 730673790 726347148 720937669 714301169 706425965 697594225 688957214 682471156
2851.4 682471156 679660022 680536509 683836043 687868953 691172659 692913651 692993701 691863954 690437973
2869.7 690437973 689940214 691042781 693185210 695145130 696006894 695523322 693854868 691198945 687759697
2888.1 687759697 683780491 679432154 674873948 670259118 665524662 660467267 654972136 648931742
2904.4 648931742 642074049 634163678 625472009 616732657 608513951 601057231 594636261 589564085
2920.7 589564085 586021781 584152997 584195554 586349428 590447307 595728517 601028204 605443537 608911991
2939.1 608911991 612120986 615695834 619401991 622268438 623525918 623181343 621776819 620093286
2955.4 620093286 618792415 618130922 618237376 619217694 620891929 622842968 624706388 626563787 629165709
$$ packed form
2835.1G34183669l509879m326642n409479o636500p875204q831740q637011o486058
2851.4F82471156k811134Q76487L299534M032910L303706J740992Q0050j129747j425981
2869.7F90437973m97759J102567K142429J959920Q61764m83572j668454k655923l439248
2888.1F87759697l979206m348337m558206m614830m734456n057395n495131o040394
2904.4F48931742o857693p910371q691669q739352q218706p456720o420970n072176
2920.7E89564085l542304j868784M2557K153874M097879N281210N299687M415333L468454
2939.1F08911991L208995L574848L706157K866447J257480l44575j404524j683533
2955.4F20093286j300871o61493J06454R80318J674235J951039J863420J857399K601922
$$ plain form
2973.8 629165709 633529544 640124261 648109853 655670941 661451221 665299654 667994440 670773685
2990.1 670773685 674592137 679679096 685726941 691855311 697061360 701020062 703896880 706026316
3006.4 706026316 707931280 709922254 711826682 713423014 714693666 715564370 715919971 715862453 715481460
3024.7 715481460 714680791 713539898 712256372 710816145 709076047 707155585 705441952 703938365
3041.1 703938365 702269197 700260103 697983384 695519567 692811430 689825594 686672032 683431208
3057.4 683431208 680229247 677174091 674057305 670585513 666653097 662429214 658463001 655310035
3073.7 655310035 653011262 651055157 648825705 646170497 643295527 640252590 637145698 634163976
3090 634163976 631215572 628307104 625728846 623653173 621966660 620566308 619615734 619306445 619568288
$$ packed form
2973.8F29165709M363835O594717P985592P561088N780280L848433K694786K779245
2990.1F70773685L818452N086959O047845O128370N206049L958702K876818K129436
3006.4G06026316J904964J990974J904428J596332J270652Q70704L55601n7518l80993
3024.7G15481460q00669j140893j283526j440227j740098j920462j713633j503587
3041.1G03938365j669168k009094k276719k463817k708137k985836l153562l240824
3057.4F83431208l201961l055156l116786l471792l932416m223883l966213l152966
3073.7F55310035k298773j956105k229452k655208k874970l042937l106892k981722
3090F34163976k948404k908468k578258k075673j686513j400352r50574l09289K61843
$$ plain form
3108.4 619568288 620211005 621338308 623077691 625188053 627471626 629862964 632278144 634801328
3124.7 634801328 637564898 640496612 643389463 646205842 649151504 652358472 655699492 659007788
3141 659007788 662311733 665663600 669032991 672471404 675989211 679395497 682650149 685984552 689463735
3159.4 689463735 692943156 696329415 699580908 702571511 705136955 707159162 708449066 708814740
3175.7 708814740 708256304 706898928 704821944 702070177 698715746 694813132 690354288 685315847
3192 685315847 679706872 673556924 667007208 660307109 653680146 647380412 641741097 636990190 633237481
3210.3 633237481 630565524 628953159 628251970 628259420 628823459 629874408 631386161 633348107 635752797
3228.7 635752797 638569593 641657829 644825697 648041487 651344895 654654622 657897949 661071897
$$ packed form
3108.4F19568288O42717J127303J739383K110362K283573K391338K415180K523184
3124.7F34801328K763570K931714K892851K816379K945662L206968L341020L308296
3141F59007788L303945L351867L369391L438413L517807L406286L254652L334403L479183
3159.4F89463735L479421L386259L251493K990603K565444K022207J289904L65674
3175.7G08814740n58436j357376k076984k751767l354431l902614m458844n038441
3192F85315847n608975o149948o549716o700099o626963o299734n639315m750907l752709
3210.3F33237481k671957j612365p01189P450N64039J050949J511753J961946K404690
3228.7F35752797K816796L088236L167868L215790L303408L309727L243327L173948
$$ plain form
3245 661071897 664109826 666957200 669633865 672114611 674364567 676420391 678315461 680021167 681476951
3263.4 681476951 682673752 683662772 684487402 685149670 685627162 685926437 686048329 685962200 685660422 685129106
3283.8 685129106 684374332 683452547 682364166 681039393 679430306 677563071 675448239 673011303 670249581
3302.1 670249581 667223871 663846254 659983575 655659497 650950193 645877719 640432119 634589911
3318.4 634589911 628334343 621661544 614597440 607205510 599605918 591958046 584331751 576645136
3334.8 576645136 568655014 559964478 550238431 539507031 528287351 517780185 509903371 506609619
3351.1 506609619 509052575 516987979 528677881 541821718 554674029 566206038 575900793 583661616
3367.4 583661616 589621842 593954027 596829534 598515987 599387527 599751115 599772990 599575520 599232912
$$ packed form
3245F61071897L037929K847374K676665K480746K249956K055824J895070J705706J455784
3263.4F81476951J196801R89020Q24630O62268M77492K99275J21892q6129l01778n31316
3283.8F85129106p54774r21785j088381j324773j609087j867235k114832k436936k761722
3302.1F70249581l025710l377617l862679m324078m709304n072474n445600n842208
3318.4F34589911o255568o672799p064104p391930p599592p647872p626295p686615
3334.8E76645136p990122q690536r726047j0731400j1219680j0507166p876814l293752
3351.1E06609619K442956P935404J1689902J3143837J2852311J1532009R694755P760823
3367.4E83661616N960226M332185K875507J686453Q71540L63588K1875j97470l42608
$$ plain form
3385.7 599232912 598823428 598481297 598385215 598676503 599294722 600094736 600995779 601910532 602745891 603491485
3406.1 603491485 604134262 604599297 604858875 604973376 604996324 604906380 604688764 604424775 604214489 604085088
3426.5 604085088 604027808 603986263 603958488 604035020 604228377 604482412 604822099 605340242 606032252 606795490
3446.9 606795490 607592404 608450115 609337866 610246539 611259758 612398982 613533258 614681423 616039097
3465.3 616039097 617526531 618809342 619803727 620791078 621972919 623340607 624734581 625977218 627179027
3483.6 627179027 628516018 629893243 631198049 632510245 633931339 635448456 636920393 638343811
3500 638343811 639843285 641329467 642711222 644129395 645699620 647412479 649148166 650799811 652430713
3518.3 652430713 654125094 655900359 657616913 659173965 660771847 662586868 664537251 666527927
$$ packed form
3385.7E99232912m09484l42131r6082K91288O18219Q00014R01043R14753Q35359P45594
3406.1F03491485O42777M65035K59578J14501K2948q9944k17616k63989k10286j29401
3426.5F04085088n7280m1545k7775P6532J93357K54035L39687N18143O92010P63238
3446.9F06795490P96914Q57711Q87751R08673J013219J139224J134276J148165J357674
3465.3F16039097J487434J282811R94385R87351J181841J367688J393974J242637J201809
3483.6F27179027J336991J377225J304806J312196J421094J517117J471937J423418
3500F38343811J499474J486182J381755J418173J570225J712859J735687J651645J630902
3518.3F52430713J694381J775265J716554J557052J597882J815021J950383J990676
$$ plain form
3534.6 666527927 668473542 670322239 672241509 674292505 676312625 678172529 679952979 681805253
3551 681805253 683779001 685835123 687900126 690006256 692153931 694159269 695998132 698118806 700708032
3569.3 700708032 703281045 705663621 708063900 710586905 713272214 716041625 718679190 721086323
3585.6 721086323 723509371 726253688 729017079 731597006 734266698 737129986 739977658 742676497
3601.9 742676497 745200694 747531176 749858856 752315342 754776776 757215261 759499490 761685848
3618.3 761685848 764115036 766461790 768269181 769588947 770995021 773014128 775030792 776726604
3634.6 776726604 778236032 779558718 780741215 781772971 782521844 783046484 783948243 785529733 786975861
3652.9 786975861 787987351 789082825 790310085 791152000 791593671 791893423 791969597 791877985 792068839
$$ packed form
3534.6F66527927J945615J848697J919270K050996K020120J859904J780450J852274
3551F81805253J973748K056122K065003K106130K147675K005338J838863K120674K589226
3569.3G00708032K573013K382576K400279K523005K685309K769411K637565K407133
3585.6G21086323K423048K744317K763391K579927K669692K863288K847672K698839
3601.9G42676497K524197K330482K327680K456486K461434K438485K284229K186358
3618.3G61685848K429188K346754J807391J319766J406074K019107K016664J695812
3634.6G76726604J509428J322686J182497J031756P48873N24640R01759J581490J446128
3652.9G86975861J011490J095474J227260Q41915M41671K99752P6174r1612J90854
$$ plain form
3671.3 792068839 792282939 792256713 792587519 793239713 793803036 794227660 794586003 794948578 795268774 795648694
3691.7 795648694 796188414 796664298 796893895 796918750 796939373 797096610 797159195 796946168 796640694 796640754 797057331
3714.1 797057331 797408879 797400177 797170758 796951592 796853244 796915591 797049820 796970010 796598434 796243668
3734.5 796243668 796292782 796621561 796609759 795956910 795302868 795334041 795348346 795170963 795432866 795876145
3754.9 795876145 796022296 796001077 796130955 796270490 796184063 795956194 795759678 795770824 795934975 796019614
3775.3 796019614 795968533 795816898 795598149 795382619 795277357 795288861 795272827 795143902 794883609 794519961
3795.7 794519961 794152319 793720424 793420374 793517172 793573141 793572187 793740213 793748438 793416739 793046772 792837977
3818.1 792837977 792524457 792352080 792544484 792667925 792551041 792287648 792053640 791888118 791526675 791050971
$$ packed form
3671.3G92068839K14100k6226L30806O52194N63323M24624L58343L62575L20196L79920
3691.7G95648694N39720M75884K29597K4855K0623J57237O2585k13027l05474O0M16577
3714.1G97057331L51548q702k29419k19166r8348O2347J34229p9810l71576l54766
3734.5G96243668M9114L28779j1802o52849o54042L1173J4305j77383K61903M43279
3754.9G95876145J46151k1219J29878J39535q6427k27869j96516J1146J64151Q4639
3775.3G96019614n1081j51635k18749k15530j05262J1504j6034j28925k60293l63648
3795.7G94519961l67642m31895l00050R6798N5969r54J68026Q225l31699l69967k08795
3818.1G92837977l13520j72377J92404J23441j16884k63393k34008j65522l61443m75704
$$ plain form
3838.5 791050971 790925622 791079104 791208565 791186154 790915370 790220380 789213657 788962424 789463818 789743066
3858.9 789743066 789619863 789282084 789036870 788928092 788743675 788658917 788774014 788930237 788959980 788742185
3879.3 788742185 788636148 788713574 788631260 788524568 788406074 788215339 788189411 788164735 787823915 787311852
3899.7 787311852 786955893 786923110 787205279 787456691 787422717 787253976 787070930 786834896 786641419 786553025
3920.1 786553025 786426723 786254883 786151111 786020160 785818160 785749078 785832465 785850585 785736442 785511076
3940.5 785511076 785262287 785126507 785020292 784868300 784760058 784695804 784615099 784505308 784373999 784282446
3960.9 784282446 784261167 784204900 784062386 783893645 783731818 783565879 783354163 783108175 782879949 782650769
3981.3 782650769 782413244 782187998 781969607 781786621 781699002 781693816 781691074 781643987
$$ packed form
3838.5G91050971j25349J53482J29461k2411k70784o94990j006723k51233N01394K79248
3858.9G89743066j23203l37779k45214j08778j84417q4758J15097J56223K9743k17795
3879.3G88742185j06037P7426q2314j06692j18494j90735k5928k4676l40820n12063
3899.7G87311852l55959l2783K82169K51412l3974j68741j83046k36034j93477q8394
3920.1G86553025j26302j71840j03772j30951k02000o9082Q3387J8120j14143k25366
3940.5G85511076k48789j35780j06215j51992j08242o4254q0705j09791j31309r1553
3960.9G84282446k1279n6267j42514j68741j61827j65939k11716k45988k28226k29180
3981.3G82650769k37525k25246k18391j82986q7619n186k742m7087
$$ plain form
3997.6 781643987
$$ packed form
3997.6G81643987
##END=$$ End of the data block
