##TITLE=MS-10 $$ Begin of the data block
##JCAMP-DX=5.00 $$ ACD/SpecManager v 10.08
##SPECTROMETER/DATA SYSTEM=Alpha
##DATE=06 Jul 2015 08:38:20
##DATA TYPE=INFRARED SPECTRUM
##DATA CLASS=XYDATA
##ORIGIN=
##OWNER=
##NPOINTS=1765
##FIRSTX=399.76428223
##LASTX=3997.64306641
##MAXX=3997.64306641
##MINX=399.76428223
##MAXY=0.81647295
##MINY=0.29557514
##XFACTOR=1.0000000000
##YFACTOR=1.000000000000000e-9
##FIRSTY=0.77700841
##DELTAX=2.03961372
##XUNITS=1/CM
##YUNITS=ARBITRARY UNITS
##XYDATA=(X++(Y..Y))
399.8G77008414J090050O218016P508457K981543m449308j0500073j5938222k1860779
416.1G42058098j5882849J2070894K6750147J5975058L659010O56307J823246J383305
432.4G88493216R46581K472043K492965m42088j649916J03891K03907j343250q25584
450.8G90451765L05951j364827m146457m025698o89149L230334N243599M487276J943827
469.1G95436621j060784j471996M12166R3758j835466j515984J7822p42793k350390
487.5G86982954j712263p27475j961589l123223k275348j833499k992451k943635j165032
505.8G68248439o95884k067507k738297k640485m612685q158147j0264754j1320234
522.1G25750446j3130724j3517320q484900J602351J4102400K5766790L0075550K2488832
$$ y = [777008414, 778098464, 784316480, 791824937, 794806480, 790357172, 779857099, 763918877, 742058098, 726175249, 738246143, 764996290, 780971348, 784630358, 785286665, 787109911, 788493216, 789439797, 791911840, 794404805, 793962717, 792312801, 792416692, 792620599, 791277349, 790451765, 790757716, 789392889, 785246432, 781220734, 780531585, 783761919, 789005518, 793492794, 795436621, 794375837, 792903841, 793316007, 793409765, 791574299, 790058315, 790076137, 789333344, 786982954, 785270691, 784543216, 782581627, 779458404, 777183056, 775349557, 772357106, 769413471, 768248439, 767552555, 765485048, 762746751, 760106266, 755493581, 747335434, 737070680, 725750446, 712619722, 699102402, 690617502, 692219853, 706322253, 732089043, 762164593, 784653425]
538.5G84653425R499014J355171l20733m77373j522184j615047l58403k15113j397848
556.8G89600909j477659n48065o76095j599372j250326l21388o87540j440227q57294
575.2G80742943M8816n35607j339793o85692P7248n97120j135587l38972J35362q57293
595.6G75514305j269341k01344Q046j271426j654983n42879n28038j723587j836240
613.9G66494513j006425j363277k269328j853228j268744k331972l931403m529775
630.2G47940361n980253j0283470j8167555k8748810k6964307O629169M1757643L5887718
646.6G42070496J1741877M07755k812922n135238q581698j3671815j9515574k5947929
662.9F78554952k9981792l5323322l7397146k0427585j923143J4606297K7731955L5980105
$$ y = [784653425, 794152439, 795507610, 795186877, 794709504, 793187320, 791572273, 791213870, 790998757, 789600909, 788123250, 787575185, 786899090, 785299718, 784049392, 783728004, 783040464, 781600237, 780742943, 780791759, 780256152, 778916359, 778230667, 778307915, 777710795, 776575208, 776236236, 776371598, 775514305, 774244964, 774043620, 774051666, 772780240, 771125257, 770582378, 770054340, 768330753, 766494513, 765488088, 764124811, 761855483, 760002255, 758733511, 756401539, 752470136, 747940361, 741960108, 731676638, 713509083, 684760273, 657795966, 664425135, 706182778, 742070496, 753812373, 754220128, 751407206, 746271968, 737690270, 724018455, 704502881, 678554952, 648573160, 613249838, 575852692, 555425107, 553501964, 568108261, 595840216, 631820321]
679.2F31820321L5046399K5412917J5495896O846607j820207r999811j7936588k7499139
695.5F57366395l8442016l9585054j3029337L3162058O3202381O3147128M7465443
709.8G73286998K8036237J1575401L012657N61655r92477k594829k406895j433551
726.1H09045196k242685l664076l054142j913190k506852l190398k077937j071632
742.4G89324284j765907k204299j107097p48098k201974l126204k687693l024339m542113
760.8G67916560n018592m491150n297542p503032r302795j1397839j6037404k1968008
777.1F86900198k5921523k8329432l2137811l7673056l9971710k4702459J3160556
791.4E11324763M4712007M5356810K7786732R292126Q52287J6930341M5151413M9509466
$$ y = [631820321, 666866720, 692279637, 707775533, 714622140, 712801933, 702802122, 684865534, 657366395, 618924379, 579339325, 566309988, 599472046, 662674427, 725821555, 773286998, 801323235, 812898636, 815911293, 816472948, 815480471, 812885642, 810478747, 809045196, 806802511, 803138435, 800084293, 798171103, 795664251, 792473853, 790395916, 789324284, 787558377, 785354078, 784246981, 783498883, 781296909, 778170705, 775483012, 772458673, 767916560, 762897968, 758406818, 753109276, 745606244, 736303449, 724905610, 708868206, 686900198, 660978675, 632649243, 600511432, 562838376, 522866666, 498164207, 511324763, 556036770, 601393580, 629180312, 638472438, 639324725, 656255066, 701406479, 750915945]
807.7G50915945K9161155J1521697M238486P38680j004457r88781j285613k700031
824G90597081l495455l551960m949390p585645q410692o186724l069639k307177n111635
842.4G45928764j0301530j6264439k1667838k6626706l3949494l7789464j6799987
856.6E82529306K9070080O2665283O1881364M0902197J8356145J678049r077012j5349269
873G72656143j8461883k2375942k8997957k3874283P050812L8000405L7503362J9268989
889.3G80769646P124126K311349J45495j27375O93440P96855K33471L87609Q48472
907.6G93183088K01762r23991j048863n83947n05268m04895K89142O97494J5914o61671
928G90258765j05023O50763K45929m12941k20895j57833q90076j179755n80251m53949
$$ y = [750915945, 780077100, 791598797, 795837283, 796575963, 795571506, 794582725, 793297112, 790597081, 787101626, 783549666, 778600276, 771014631, 762603939, 756417215, 753347576, 751040399, 745928764, 735627234, 719362795, 697694957, 671068251, 637118757, 599329293, 582529306, 611599386, 674264669, 736146033, 777048230, 795404375, 797082424, 788005412, 772656143, 754194260, 731818318, 702820361, 678946078, 685996890, 723997295, 761500657, 780769646, 787893772, 790205121, 790350616, 790223241, 790916681, 791713536, 791947007, 792334616, 793183088, 793384850, 792460859, 791411996, 790828049, 790322781, 789917886, 790207028, 790904522, 790920436, 790258765, 790153742, 790804505, 791050434, 790637493, 790416598, 790258765, 789368689, 788188934, 787608683, 787154734]
948.4G87154734j131475j225114o24358o79851j381814j403869q66532j047015j768887
966.8G77025819j808226j462519j981378k877176k897203k509415l182352m930675
983.1G55376875o655156o464184k822399O20604N43237J304984L977954L462732K71857
1001.4G49616504j438260p27773O43432k11120l642976k769172M956007Q659780M352570
1019.8G59438992k1577j107753p99954p89642j203656j158655q18372j041114j500904
1038.2G50997365j293123q74639j180708j800895k026081k383590l567278n295634
1054.5G32575417p921040j3203323j8901050j1145652J3626754K8365016J9711495
1068.8G43107617P194102J878023k22445j608491k207458k272308k808153l785372
$$ y = [787154734, 786023259, 784798145, 784173787, 783493936, 782112122, 780708253, 779841721, 778794706, 777025819, 775217593, 773755074, 771773696, 768896520, 765999317, 763489902, 760307550, 755376875, 748721719, 742257535, 739435136, 740055740, 740598977, 741903961, 745881915, 749344647, 749616504, 748178244, 747450471, 748093903, 747882783, 744239807, 741470635, 746426642, 755086422, 759438992, 759417415, 758309662, 757509708, 756720066, 755516410, 754357755, 753539383, 752498269, 750997365, 749704242, 748829603, 747648895, 745848000, 743821919, 741438329, 737871051, 732575417, 724654377, 711451054, 692550004, 681404352, 695031106, 723396122, 743107617, 750301719, 752179742, 751957297, 750348806, 748141348, 745869040, 743060887, 739275515]
1085.1G39275515l553450j325905N36143N09203R8109j6689p04885j747250k281785
1103.4G30789006k268255k194226j997292p14838J013815J260638L77953j35421m57108
1121.8G25674272j078606j417816j069545p23899r82940j350224j443744j732468k389551
1140.1G13485479k762377k815723l351987m609585o242573q790612j3681412k0526409
1156.5F50704801k3342609j4155746K384961J2717187J3870299J0043085L908634j432777
1172.8F54697835m818201p280469q870482r900510j3231755k1646082l4897923m9853027
1189.1E04199386n9838355n6996465l9034217r534955K8002590O4304918Q1454485
1203.4E12557387P3053122N2002549L2455444J9799591J3360381R754717O947577O288290
$$ y = [739275515, 735722065, 734396160, 734932303, 735441506, 735539615, 735522926, 734818041, 733070791, 730789006, 728520751, 726326525, 724329233, 723614395, 724628210, 725888848, 726266801, 726131380, 725674272, 724595666, 723177850, 722108305, 721384406, 720401466, 719051242, 717607498, 715875030, 713485479, 710723102, 707907379, 704555392, 699945807, 693703234, 684912622, 671231210, 650704801, 627362192, 613206446, 615591407, 628308594, 642178893, 652221978, 656130612, 654697835, 649879634, 642599165, 633728683, 623828173, 610596418, 588950336, 554052413, 504199386, 444361031, 387364566, 348330349, 338795394, 366797984, 431102902, 512557387, 585610509, 637613058, 670068502, 689868093, 703228474, 712983191, 719930768, 726219058]
1219.7G26219058R303331J2918771J2087702P119775K358437l49164j863361k760648
1236G65033901l120423l279745l471494l345072k775431k391934k639830l168643l465295
1254.4G37376034l451884l144025k703786k919019m735291p617950r860933j1295318
1270.7F91647828j3771356j7838001j9874811j3464630K896011K0497918L0383945
1285F80476904K9515386J9103765P256985P72953j612962k617001k621532j262009
1301.3G29012489K96474J17898j793385k979099l72887N444586Q687258O808340L570080
1319.6G48791754J532913M24683k34008p09355j144767j456141j702726j945973j999199
1338G41557181j658440j235008j277745j559853j474679p85589j4365R7871m56810
$$ y = [726219058, 735522389, 748441160, 760528862, 767648637, 770007074, 769657910, 767794549, 765033901, 761913478, 758633733, 755162239, 751817167, 749041736, 746649802, 744009972, 740841329, 737376034, 733924150, 730780125, 728076339, 725157320, 720422029, 712804079, 702943146, 691647828, 677876472, 660038471, 640163660, 626699030, 629595041, 650092959, 680476904, 709992290, 729096055, 736353040, 737125993, 735513031, 732896030, 730274498, 729012489, 729308963, 729426861, 727633476, 724654377, 724281490, 729726076, 738413334, 745221674, 748791754, 750324667, 750749350, 750515342, 749805987, 748661220, 747205079, 745502353, 743556380, 741557181, 739898741, 738663733, 737385988, 735826135, 734351456, 733565867, 733551502, 733649373, 733192563]
1356.4G33192563j183033j897216k393603k577543l161073m703343p166505j0638714
1372.7F99471533j3857245j4088035j2433350j1469245j1029839j0024131r898781
1386.9F16670907j1494756o223619J7056405M5865119M5182764K1909237M972220j029492
1403.3G32908785j999497j656175j576781j970232k680361l850519n595386p231415
1419.6G06348419p208586o670832n945564m986345n593956p637858n666077Q090615
1435.9F70729816K2749722J6912341N463243R7513j665235k175867k337516k779781
1452.2G06994236l661335n246937o358266o600082q963168j2525737j2650609j1027873
1468.5F39960229r100556Q235157L4028589L2280386J4057338K303660j272678k122224
$$ y = [733192563, 732009530, 730112314, 727718711, 725141168, 721980095, 717276752, 710110247, 699471533, 685614288, 671526253, 659092903, 647623658, 636593819, 626569688, 616670907, 605176151, 598952532, 616008937, 661874056, 707056820, 728966057, 733938277, 732908785, 730909288, 729253113, 727676332, 725706100, 723025739, 719175220, 713579834, 706348419, 699139833, 692469001, 686523437, 681537092, 675943136, 668305278, 662639201, 670729816, 693479538, 710391879, 715855122, 715952635, 714287400, 712111533, 709774017, 706994236, 703332901, 698085964, 691727698, 685127616, 676164448, 663638711, 650988102, 639960229, 630859673, 639094830, 673123419, 705403805, 719461143, 721764803, 720492125, 718369901]
1484.9G18369901k538562k571284k072514j703321j547397m49836J153112J142859
1501.2G09782958j66237j715780k022862q15690o73115j227021j599789j563430j573443
1519.5F98425591j775682j531064j306475j460969j800776k554595l063858k928853
1535.8F82003319l723085n543470n467415m931152n853832p079184q305668q508623
1552.2F32590890p648230o710708q871078j2329638j2556911j6836881k4179221l2428741
1568.5E11029482l5842091k1054983R147018N0855398O4071060L8960874L983020k2440374
1584.8E98709404j6672015J6953945M2256356L6687910J6855538L949523J21772j14500
1601.1F98747933l5584p34091k174318l607154m444003m845380n519569n726934m429281
$$ y = [718369901, 715831339, 713260055, 711187541, 709484220, 707936823, 707486987, 708640099, 709782958, 709616721, 707900941, 705878079, 705062389, 704389274, 703162253, 701562464, 699999034, 698425591, 696649909, 695118845, 693812370, 692351401, 690550625, 687996030, 684932172, 682003319, 678280234, 672736764, 667269349, 662338197, 656484365, 649405181, 641099513, 632590890, 624942660, 618231952, 609360874, 597031236, 584474325, 567637444, 543458223, 511029482, 475187391, 454132408, 463279426, 514134824, 578205884, 617166758, 621149778, 598709404, 582037389, 598991334, 641247690, 677935600, 694791138, 698740661, 698862433, 698747933, 698712349, 697978258, 695803940, 692196786, 687752783, 682907403, 677387834, 671660900, 667231619]
1619.5F67231619m079461m724085m793584m552246l976941l115475l143072l669083
1635.8F35177672l350794l698469n070269n932986m990221k491533k109886n379617
1652.1F02153897p898330n035639l774047m695892p369340j0816097j3686657j9068837
1668.4E29809058k5685370k8002084l4056663m1317493m0262252l5849422k5172353
1682.7B99463421l888279J3506710J5994519J2147814N587519K245485M881323J5283644
1699C65222156L0325234L0779690K3181408J3477117J914203j441091N683541K1370024
1715.3D90512282M2654305M9990476L9693474L1826675K5517702J8401265J3096810
1729.6G11692989Q966148O662488M561364J940966J103520J810968K290011K313733
$$ y = [667231619, 663152158, 658428073, 653634489, 649082243, 645105302, 641989827, 638846755, 635177672, 631826878, 628128409, 623058140, 617125154, 612134933, 609643400, 607533514, 602153897, 594255567, 589219928, 585445881, 580749989, 573380649, 562564552, 548877895, 529809058, 504123688, 476121604, 442064941, 400747448, 360485196, 324635774, 299463421, 295575142, 309081852, 325076371, 337224185, 342811704, 345057189, 349938512, 365222156, 395547390, 426327080, 449508488, 462985605, 464899808, 463458717, 469142258, 490512282, 533166587, 583157063, 622850537, 654677212, 680194914, 698596179, 711692989, 720659137, 727321625, 731882989, 733823955, 734927475, 736738443, 739028454, 741342187]
1745.9G41342187J885176J635491J523972P75456j94788q34405n21898J363873L199041
1764.3G50174105K895296J638591M86136J59502K18749j73688o45578q23319p35104
1782.6G53194690o62625o97434j106381j452208j158297q46803j216173j654089j601934
1801G42798746j207650q47697o07610l33250k6285K74539L55184K23994o9320m85659
1821.4G40074992q44598r62853j021981j043380q22961r63092j372516j497090j471877
1839.8G30074644j669168j527667j91451J318992J775205J212299M30405j66714o17564
1858.1G30638981q24630p41721o53684o99162n01693l2067L7670k41935l58820l37541
1878.5G26285398l16858l21508l15249m52995p05659p70808p57217q30650r00507r22501
$$ y = [741342187, 743227363, 744862854, 746386826, 747162282, 746967494, 746133089, 745611191, 746975064, 750174105, 753069401, 754707992, 755194128, 755353630, 755572379, 755398691, 754753113, 753929794, 753194690, 752532065, 751834631, 750728250, 749276042, 748117745, 747270942, 746054769, 744400680, 742798746, 741591096, 740743399, 740135789, 739802539, 739776254, 740050793, 740405977, 740629971, 740560651, 740074992, 739230394, 738267541, 737245560, 736202180, 735379219, 734416127, 733043611, 731546521, 730074644, 728405476, 726877809, 726686358, 728005350, 729780555, 730992854, 731423259, 731256545, 730638981, 729814351, 729072630, 728418946, 727719784, 727218091, 727186024, 727223694, 726981759, 726622939, 726285398, 725968540, 725647032, 725331783, 724878788, 724173129, 723402321, 722645104, 721814454, 720913947, 719991446]
1898.9G19991446r30846j035631j354158j710534j864076j806438j639783j162052
1915.2G08487928l6001J262307J787424J682878J270532O29902J36733r894R1254J88411
1935.6G15491474R2625j38581k39312j22965q5294k20001m24742o39379p21693o20127
1956G12372005n38945o06060p22170p95901p94947p19547o28114n75781o38187q66175
1976.4G05486178j105308j216889j205802r22918r3102J046776J680375J443028P64191
1994.8G05876529J76728k00093m27186n00560m82142m92752n08129m30465l42011l68894
2015.2G02301025m24027m56035o17087r52721r50575k33471K98738N365l94404m95553
2035.6F98081255n66185p74264j049220j295448j599729j937151j727402l70920J424492
$$ y = [719991446, 719060600, 718024969, 716670811, 714960277, 713096201, 711289763, 709649980, 708487928, 708451927, 709714234, 711501658, 713184536, 714455068, 715084970, 715221703, 715211809, 715303063, 715491474, 715584099, 715445518, 715206206, 715083241, 714997947, 714777946, 714353204, 713713825, 712992132, 712372005, 711833060, 711227000, 710504830, 709708929, 708913982, 708194435, 707566321, 706990540, 706352353, 705486178, 704380870, 703163981, 701958179, 701035261, 700942159, 701988935, 703669310, 705112338, 705876529, 706053257, 705853164, 705425978, 704925418, 704443276, 703950524, 703442395, 703011930, 702669919, 702301025, 701876998, 701420963, 700803876, 699851155, 698900580, 698667109, 698965847, 698971212, 698576808, 698081255, 697515070, 696740806, 695691586, 694396138, 692796409, 690859258, 689131856, 688760936, 690185428]
2053.9F90185428K248704J855075J081467M59612K8371j89244k40386k61903l10659
2072.3F94856465k80440j65343q6427j04725j32263j43945k07544k88903l14236k99931
2092.7F92832708l76582m82678n15580n24223o44028q30830q94486n56946J05619K92361
2113.1F88405335j10328m58777o21379p85172q82208j006603j185119j234234j232445
2131.4F80889070j364589j550555j784861k456605l749609n671323q148312j1145354
2147.7F45017862j4356017j6932428j8083393j4813483M931509L8007677M7758818
2162F71530545K5364160M557312j355946j579285j147091r70304r41515q16226o52850
2180.4F93988800o57797p05659o64354n74946n78165n69880m78029m06385m48525m96030
$$ y = [690185428, 692434132, 694289207, 695370674, 695830286, 695858657, 695669413, 695429027, 695167124, 694856465, 694576025, 694410682, 694324255, 694219530, 694087267, 693943322, 693735778, 693446875, 693132639, 692832708, 692456126, 691973448, 691457868, 690933645, 690289617, 689458787, 688564301, 688007355, 688112974, 688405335, 688295007, 687836230, 687214851, 686429679, 685547471, 684540868, 683355749, 682121515, 680889070, 679524481, 677973926, 676189065, 673732460, 669982851, 664311528, 656163216, 645017862, 630661845, 613729417, 595646024, 580832541, 585764050, 623771727, 671530545, 696894705, 701452017, 700096071, 698516786, 697369695, 696399391, 695457876, 694641650, 693988800, 693331003, 692625344, 691960990, 691386044, 690807879, 690237999, 689759970, 689353585, 688905060, 688409030]
2200.8F88409030m04834l20494l43979l80754l11852k80738l30329l54588l26097l55720
2221.2F84999645m29273l80754k52426k15828l02256l11017k23100j87754k19882j94430
2241.6F82282925j57953k40326l62813l63112k76565k95580l83675l76105k95579l16680
2262F79214537l82304l56257l08454l11315k76446j47403q2016j50859k24352k37405
2282.3F76737726l00765l96073l68536k39253j96218k94626l75807l75092m23074n55277
2302.7F73213005o11424o00577o53684p24852o73771o18517q01862j062274j093745
2321.1F66372299r39548q58724q31604o74784m63903m66168n98073n52893l92556k25365
2341.5F60368681K05100R18924P28846n96941j811564k164781j940548j608312r59873
$$ y = [688409030, 688004196, 687683702, 687339723, 686958969, 686647117, 686366379, 686036050, 685681462, 685355365, 684999645, 684570372, 684189618, 683937192, 683721364, 683419108, 683108091, 682884991, 682697237, 682477355, 682282925, 682124972, 681884646, 681521833, 681158721, 680882156, 680586576, 680202901, 679826796, 679531217, 679214537, 678832233, 678475976, 678167522, 677856207, 677579761, 677432358, 677350342, 677199483, 676975131, 676737726, 676436961, 676040888, 675672352, 675433099, 675236881, 674942255, 674566448, 674191356, 673768282, 673213005, 672601581, 672001004, 671347320, 670622468, 669948697, 669330180, 668528318, 667466044, 666372299, 665432751, 664574027, 663742423, 663067639, 662603736, 662137568, 661539495, 660986602, 660594046, 660368681, 660573781, 661492705, 662221551, 661624610, 659813046, 657648265, 655707717, 654099405, 653139532]
2359.9F53139532j6392P69079J182914J365304J401961J271069J115501J065313R67145
2378.2F62261426O94812L41594N0545j99497m62532n94854m24683J2576M67777O76811
2398.6F62823975N64218K51889p4268k65717k89857k71798k98202k85208j89662j33216
2419F61832154j78099k32816k52425k86103l28779l03447k40266k78831l97384l72887
2439.4F58961117j77800l9399l6001o3718j05917k10404k96414k91467k89321l37780
2459.8F57112896l51131l36587l87430m76658n19455n18799n31912m97758k70903O9260
2480.2F53291523K43307J79886N7280l3318j38701k40921k85388l55184n45621p38084
2500.6F51434779p54654n03540P3373O34074O63162K92003k7061j44720j56581j98543
$$ y = [653139532, 653123140, 653892219, 655075133, 656440437, 657842398, 659113467, 660228968, 661294281, 662261426, 662956238, 663297832, 663348377, 663148880, 662686348, 662091494, 661666811, 661679387, 662147164, 662823975, 663388193, 663640082, 663565814, 663300097, 663010240, 662738442, 662440240, 662155032, 661965370, 661832154, 661654055, 661421239, 661168814, 660882711, 660553932, 660250485, 660010219, 659731388, 659334004, 658961117, 658783317, 658743918, 658707917, 658644199, 658538282, 658327878, 658031464, 657739997, 657450676, 657112896, 656761765, 656425178, 656037748, 655561090, 655041635, 654522836, 653990924, 653493166, 653222263, 653291523, 653534830, 653714716, 653771996, 653738678, 653599977, 653359056, 653073668, 652718484, 652172863, 651434779, 650680125, 650176585, 650249958, 650884032, 651547194, 651839197, 651812136, 651667416, 651510835, 651312292]
2521F51312292k86281l32535l45349m14372m67896l60310j77980j05917j29044j60813
2541.4F48531795k15769l31402m54009n16772n62847n92649m86731k14815Q106K6286
2561.8F45191193l0697q2969k09272l88742m67956l84569k60770j92225j44422j28091
2582.2F42901480j84655k74837l24667l13818k47538o7771J83225K98381K03133L1888
2602.6F42204821r7752j89960k73525l22223l47555m06980m47750l80993k48611j75357
2623F39314115j93357k17915k15471k03848j69158j13368j09255k13325l35336l75569
2643.4F37167513l87370m35055m42326l46779k60473k76863l10004l15011l86536n13732
2663.7F33493364n70774n23627l88861j99377p5102j11222k71619m64797n98788o36697
$$ y = [651312292, 651026011, 650693476, 650348127, 649933755, 649465859, 649105549, 648927569, 648821652, 648692608, 648531795, 648316026, 647984624, 647530615, 647013843, 646450996, 645858347, 645371616, 645156801, 645164907, 645191193, 645160496, 645077527, 644868255, 644479513, 644011557, 643626988, 643366218, 643173993, 643029571, 642901480, 642716825, 642441988, 642117321, 641803503, 641555965, 641488194, 641671419, 641969800, 642172933, 642204821, 642107069, 641917109, 641643584, 641321361, 640973806, 640566826, 640119076, 639738083, 639489472, 639314115, 639120758, 638902843, 638687372, 638483524, 638314366, 638200998, 638091743, 637878418, 637543082, 637167513, 636780143, 636345088, 635902762, 635555983, 635295510, 635018647, 634708643, 634393632, 634007096, 633493364, 632922590, 632398963, 632010102, 631810725, 631735623, 631624401, 631352782, 630887985, 630289197, 629652500]
2684.1F29652500o37591n49793k45154J46151L72886L55602J31726j54376l19779l57687
2704.5F28394485m01855n70297q32141j042902j165867j282334j404107j475632j498759
2722.9F18720591j492500j451612j312792j024604o88672l83317p8202J90139L69310
2741.2F12848341M97342O39498P35521O13153K55585k50220r40562j752615k152681
2759.6F10493362j175880J281142L244400K903342J115978l67224j057387j279831
2775.9F15157902j281798j050949n01096K09093N97715L66211k33531p63356j014769
2794.3F11485422r58741o94096l97802j84655j27315j87516l02077n39422q90970j219690
2814.7F05983138j458645j620710j713276j723349j691997j671672j644790j605630
$$ y = [629652500, 629014909, 628465116, 628219962, 628366113, 628738999, 629094601, 629226327, 629071951, 628752172, 628394485, 627992630, 627422333, 626590192, 625547290, 624381423, 623099089, 621694982, 620219350, 618720591, 617228091, 615776479, 614463687, 613439083, 612750411, 612367094, 612288892, 612479031, 612848341, 613345683, 613985181, 614720702, 615333855, 615589440, 615339220, 614398658, 612646043, 610493362, 609317482, 610598624, 613843024, 616746366, 617862344, 617495120, 616437733, 615157902, 613876104, 612825155, 612324059, 612533152, 613130867, 613497078, 613263547, 612500191, 611485422, 610526681, 609832585, 609434783, 609250128, 609122813, 608935297, 608633220, 608093798, 607202828, 605983138, 604524493, 602903783, 601190507, 599467158, 597775161, 596103489, 594458699, 592853069]
2831E92853069j621723j705050j866877k248824k766907l139675l403842l652275l563881
2849.3E68884015k631366q04961J286626K829790L402591L241360K866507K374827
2865.7E81449389J578451O29007j07646l34441L64244J962483L285289L258466K216220
2884E94301462J056016K39014j87218l93271n84782q66174j186013j378775j409650
2902.4E89590609j438558j561821j804709k233863k907276l787398m578710m909456
2918.7E66368818m546642l355205j516581N11706K218902L242910L675521L826618
2935E70426047L843784L637314L107905K351821J494229N46217l19183q00431r66191
2953.4E83321512r41158o16848l4809O43551J263738J709282K006352K180815K144515
$$ y = [592853069, 591231346, 589526296, 587659419, 585410595, 582643688, 579504013, 576100171, 572447896, 568884015, 566252649, 565447688, 566734314, 569564104, 572966695, 576208055, 579074562, 581449389, 583027840, 583656847, 583549201, 583214760, 583579004, 585541487, 588826776, 592085242, 594301462, 595357478, 595596492, 595409274, 595016003, 594431221, 593565047, 592379034, 591000259, 589590609, 588152051, 586590230, 584785521, 582551658, 579644382, 575856984, 571278274, 566368818, 561822176, 558466971, 556950390, 557462096, 559680998, 562923908, 566599429, 570426047, 574269831, 577907145, 581015050, 583366871, 584861100, 585407317, 585088134, 584287703, 583321512, 582380354, 581763506, 581728697, 582372248, 583635986, 585345268, 587351620, 589532435, 591676950]
2971.7E91676950J842499J406729J083255Q24034M37558J24633O3122Q4638O8546m0174
2992.1E97571790k30729l78430n24581o90520p42912p28667p52925p40588o60896n70715
3012.5E91550827n07116n17667m79400k00331K20478M05669J32024l93271r30548j396954
3032.9E87883711j758099j811206j190722k29836J55271k60830p91073q11041n89668
3051.3E80596507o75917j032472j438141j797139k037704k168000k320886k671063
3067.6E66455185k883195k049745J73927K862155M527748M516542L561973K686441
3083.9E79851031K169788J818419J407623Q95083N19216L90172L24011J93715M1783
3102.2E87610841k9624k3126q0407j89543j76489o4492K145K981p6592k06769k37524
$$ y = [591676950, 593519449, 594926178, 596009433, 596833467, 597271025, 597395658, 597458780, 597543418, 597611964, 597571790, 597341061, 596962631, 596438050, 595747530, 595004618, 594275951, 593523026, 592782438, 592121542, 591550827, 591043711, 590526044, 590046644, 589846313, 590066791, 590472460, 590604484, 590211213, 589280665, 587883711, 586125612, 584314406, 583123684, 582893848, 583049119, 582788289, 581997216, 581186175, 580596507, 579920590, 578888118, 577449977, 575652838, 573615134, 571447134, 569126248, 566455185, 563571990, 561522245, 561696172, 564558327, 569086075, 573602617, 577164590, 579851031, 582020819, 583839238, 585246861, 586141944, 586661160, 587051332, 587375343, 587569058, 587610841, 587581217, 587558091, 587477684, 587288141, 587111652, 587047160, 587049305, 587052286, 586975694, 586768925, 586531401]
3124.7E86531401j58251j24275j76549j86503j16408o8486r0837j61112k07364k12014
3145.1E85029602k56121k93374k58446k75731l67284m02748l98636l93451l36766k48253
3165.5E81798792k07543k58983l20613k96652k83718l92080n12242n40555n46753n47826
3185.9E77891827n11408m73082m86970n47230n65589n11885m81605n39422n94676n83768
3206.3E72596192n99146o26266n69164n24581o03974o81638o39499n82516o07729o39558
3226.7E66522121n91337m83632m84348o73711p74443o81281o55949o77049n94855o11365
3247.1E60294151q00848q44538o49512n16176n66542n84304n03481m73022m80295l69310
3267.5E54506123j96397k51115m78565n68092n40614n19872m96268m67241m70996m80175
$$ y = [586531401, 586373150, 586248875, 586072326, 585885823, 585769415, 585700929, 585610092, 585448980, 585241616, 585029602, 584773481, 584480107, 584221661, 583945930, 583578646, 583175898, 582777262, 582383811, 582047045, 581798792, 581591249, 581332266, 581011653, 580715001, 580431283, 580039203, 579526961, 578986406, 578439653, 577891827, 577380419, 576907337, 576420367, 575873137, 575307548, 574795663, 574314058, 573774636, 573179960, 572596192, 571997046, 571370780, 570801616, 570277035, 569673061, 568991423, 568351924, 567769408, 567161679, 566522121, 565930784, 565447152, 564962804, 564289093, 563514650, 562833369, 562177420, 561500371, 560905516, 560294151, 559493303, 558648765, 557999253, 557483077, 556916535, 556332231, 555828750, 555355728, 554875433, 554506123, 554309726, 554058611, 553580046, 553011954, 552471340, 551951468, 551455200, 550987959, 550516963, 550036788]
3287.8E50036788m43280m57883o05046p72655q18491p60436o78480o14405o77109q88586
3308.2E43320417j066744j097202j043797j039743j118005j166462j135290j149893
3324.6E34503281j318812j488149j549542j613200j698375j758039j816690j920163
3340.9E21340311k068818k241910k389013k417803k159000j396715l77476J37925j64151
3359.2E08263350q40962j414478j740337j850664j800180j689881j606375j512438
3375.5D95808035j410037j366079j323760j192063j004934q75324q37475p86215p19816
3393.9D86292332p15911p60317q20845q48592q48740q37982p91311p60972p76559p70748
3414.3D78360355p21455o51985n63353m79997m21911l58403l11702k85328j88380j04338
$$ y = [550036788, 549593508, 549135625, 548530579, 547757924, 546939433, 546178997, 545500517, 544886112, 544209003, 543320417, 542253673, 541156471, 540112674, 539072931, 537954926, 536788464, 535653174, 534503281, 533184469, 531696320, 530146778, 528533578, 526835203, 525077164, 523260474, 521340311, 519271493, 517029583, 514640570, 512222767, 510063767, 508667052, 508289576, 508427501, 508263350, 507422388, 506007910, 504267573, 502416909, 500616729, 498926848, 497320473, 495808035, 494397998, 493031919, 491708159, 490516096, 489511162, 488635838, 487798363, 487012148, 486292332, 485576421, 484816104, 483995259, 483146667, 482297927, 481459945, 480668634, 479907662, 479131103, 478360355, 477638900, 476986915, 476423562, 475943565, 475521654, 475163251, 474851549, 474566221, 474377841, 474273503]
3434.7D74273503j60843k61277k30342p8559P0095K09212K59519J97798K06023L08633
3455.1D74793762L98934M50700M39793M61549O32345P28369N12988K63691L32653N16594
3475.5D79531378N95659N86301M57912M18365N62251O09159N46843N45025O02603O54638
3495.9D85110134N86271M98057N86509O17057M87745N44697P74801Q98659Q08835O37979
3516.3D91550744O06268P11113Q25555P57247O24239P53194R13263R10520R93222J038611
3536.7D99683976Q62420P63833Q36790R13978Q46684O76929P13766Q81791Q83103Q17120
3557.1E07880390Q31365P33614M31597N42343J352787J647234J097977Q09968R04918
3575.4E16232193J003861J116931J131416Q81254Q38817J359045J488328R93610R45508
$$ y = [474273503, 474112660, 473851383, 473621041, 473542482, 473612577, 473821789, 474081308, 474279106, 474485129, 474793762, 475192696, 475643396, 476083189, 476544738, 477177083, 477905452, 478418440, 478682131, 479014784, 479531378, 480127037, 480713338, 481171250, 481589615, 482151866, 482761025, 483307868, 483852893, 484455496, 485110134, 485696405, 486194462, 486780971, 487398028, 487885773, 488430470, 489205271, 490103930, 490912765, 491550744, 492157012, 492868125, 493693680, 494450927, 495075166, 495828360, 496741623, 497652143, 498645365, 499683976, 500546396, 501310229, 502147019, 503060997, 503907681, 504584610, 505298376, 506180167, 507063270, 507880390, 508711755, 509445369, 509876966, 510419309, 511772096, 513419330, 514517307, 515327275, 516232193, 517236054, 518352985, 519484401, 520365655, 521204472, 522563517, 524051845, 525045455, 525990963]
3593.8E25990963J263738J324117J287699J219928Q54552N93125R25601J261950J175344
3612.1E35897017R63151O95944J055479J658141J030028r1672k73048J133143J997948
3630.5E44066131R70066M94122N45502M44829L57092K622n83231m45426R89914J664043
3650.9E48505664M12762k4497P26699P18058J28865j99974n82874p98106j41084J71185
3671.3E48916698l79503M24981J062929K07603j96337m32432o50167N0067J061738
3689.6E50065577P90298R5189j82748l39031k33293K04206J02698n77390p90298j29282
3710E49005926Q41796N54442m11093p17044n48064k96414o199J54614k87115p35045
3730.4E47555804m24504M40180J064241K90275j168132j048207N49495K78294m64320
$$ y = [525990963, 527254701, 528578818, 529866517, 531086445, 531940997, 532534122, 533459723, 534721673, 535897017, 536860168, 537556112, 538611591, 540269732, 541299760, 541208088, 540935040, 542068183, 544066131, 545036197, 545530319, 546075821, 546520650, 546877742, 546880364, 546297133, 545851707, 546841621, 548505664, 548918426, 548893929, 549620628, 550338686, 550467551, 550267577, 549684703, 548886597, 548745513, 548916698, 548537195, 548962176, 550025105, 550232708, 550036371, 549603939, 548953772, 549003839, 550065577, 550855875, 550951064, 550768316, 550429285, 550195992, 550400198, 550502896, 549925506, 549135208, 549005926, 549847722, 550402164, 549991071, 549274027, 548725963, 548429549, 548423350, 548577964, 548290849, 547555804, 547131300, 547571480, 548635721, 548925996, 547757864, 546709657, 547259152, 547537446, 547073126]
3748.8E47073126P13885J077115q8572m90010L4392K05815k42770l99053k87593R8348
3769.2E47694683M38392L0458m42803l18288J29163Q4817j80662k3186L2306j57595
3789.6E47287285l67939n38945m93408o24775m81070L85881K40445k205N00917m3988
3810E45862198r62973q37743m4346j70350j03056O51538J41144l66628l60787m29094
3830.4E43379903m06504m84168k82646K40207K77937J76191P7963n54919j424671j514315
3850.8E39484978M44114K059996L35217r27866q10802k58148j6152l95060j44959M63725
3871.2E40235043K44557j74760o15776m74632j5795q7559J72615L2902m55261j8119
3891.6E38843215R9539n96225q23379m31478N2989M76837M77254k4080l01003l11136
$$ y = [547073126, 547787011, 548864126, 548775554, 548285544, 548319936, 548525751, 548282981, 547883928, 547596335, 547694683, 548133075, 548163533, 547720730, 547402442, 547531605, 547616422, 547435760, 547412574, 547444880, 547287285, 546919346, 546380401, 545886993, 545262218, 544781148, 545167029, 545407474, 545405269, 545906186, 545862198, 544899225, 544061482, 544017136, 543846786, 543743730, 544395268, 544536412, 544169784, 543808997, 543379903, 542973399, 542489231, 542206585, 542446792, 542724729, 542900920, 542978883, 542423964, 540999293, 539484978, 539929092, 541989088, 542324305, 541396439, 540585637, 540327489, 540311337, 539916277, 539771318, 540235043, 540479600, 540304840, 539689064, 539214432, 539198637, 539111078, 539283693, 539316595, 538861334, 538843215, 538942754, 538346529, 537523150, 537091672, 537144661, 537621498, 538098752, 538074672, 537773669, 537462533]
3912E37462533l68059k23279K8670n0783k61605k22206j45257k62082j96039J14679
3932.3E35876572J78635o2823k78115k73764q5712n7936j48534l7551J5676j15455
3952.7E35010993j70528j28389j04606q5652p7128j54138k29001k09629j73092j36257
3973.1E33542573o6936q9228j94132j89781j22547j87755l05057k51710j33216j23620
3993.5E31878591j26720j05560
3997.6E31646311
$$ y = [537462533, 537094474, 536871195, 536899865, 536849082, 536587477, 536365271, 536220014, 535957932, 535761893, 535876572, 536055207, 535992384, 535714269, 535440505, 535354793, 535296857, 535148323, 535110772, 535126448, 535010993, 534840465, 534712076, 534607470, 534521818, 534444690, 534290552, 534061551, 533851922, 533678830, 533542573, 533475637, 533386409, 533192277, 533002496, 532879949, 532692194, 532387137, 532135427, 532002211, 531878591, 531751871, 531646311]
##END=$$ End of the data block
