##TITLE=$$ Begin of the data block
##JCAMP-DX=5.00 $$ ACD/SpecManager v 10.08
##SPECTROMETER/DATA SYSTEM=Varian
##DATE=04 Dec 2012 13:37:20
##DATA TYPE=INFRARED SPECTRUM
##DATA CLASS=XYDATA
##ORIGIN=
##OWNER=
##NPOINTS=3735
##FIRSTX=399.26403809
##LASTX=4000.35498047
##MAXX=4000.35498047
##MINX=399.26403809
##MAXY=69.54367828
##MINY=26.50528526
##XFACTOR=1.0000000000
##YFACTOR=0.000000100000000
##FIRSTY=53.18067169
##DELTAX=0.96440572
##XUNITS=1/CM
##YUNITS=TRANSMITTANCE
##XYDATA=(X++(Y..Y))
399.3E31806717j4690895J2543640N581474j133957K991867k741012o722832q902588
407E18732414l458977M037934P545318J269761j837273O12640q462639l464622Q030434
415.7E23004990N704040K737503r75532j2428437N46494N819702M189262Q206177m888992
424.3E31915207j5722237k339325M568062M815064J102905j494675K662392K58865
432.1E25766258N00107k089920l870468R95026o035538m995690L487091L381691L859826
440.7E20998383J834678j071472j86386M44069N74531l942794k228241K644500L517037
449.4E22584305K416420L14789L139572r95713n553779j19057K037926k580414j976852
458.1E19267197N340156l30848l599625q77800J251106j139526k037888Q23326k755661
$$ plain form
399.3 531806717 517115822 529659462 535240936 534106979 537098846 534357834 527635002 518732414
407 518732414 515273437 519311371 526856689 528126450 526289177 526901817 518439178 514974556 523004990
415.7 523004990 528709030 531446533 530471001 518042564 518589058 524408760 528598022 536804199 531915207
424.3 531915207 516192970 513853645 518421707 523236771 524339676 522845001 525507393 525766258
432.1 525766258 526266365 524176445 520305977 521301003 515265465 510269775 513756866 517138557 520998383
440.7 520998383 522833061 521761589 521575203 522019272 522593803 518651009 516422768 519067268 522584305
449.4 522584305 525000725 525315514 528455086 527459373 521905594 521786537 523824463 521244049 519267197
458.1 519267197 524607353 524276505 520676880 519799080 521050186 519910660 517872772 518696098 515940437
466.8E15940437l387375q93554J341133L460350J690063j884613l263740p02019l013267
475.5E09287415J493339N31082n890503L160019K760582l271484j324692q24051R53217
484.1E06874924J923980j327514j114502L54309k848663O81305K217597K74582J971398
492.8E09007416j514054r80568J006279k998123n499115j187248J304131Q45565J857682
501.5E01841965k532311k938843j307182j458778k105866l334541j01280O58111P92046
510.2D89513321j856346j344795J146049j997261l193970k612495J59111K460747k10953
518.9D82063408j739998j253586j825981j173820J98516J351014J503563k450982N51415
527.5D77223549K78511l624268j099853J224899J905594J17340J506958J937523L29781
$$ plain form
466.8 515940437 512553062 511659508 513000641 516460991 518151054 516266441 513002701 512300682 509287415
475.5 509287415 510780754 511311836 505421333 508581352 511341934 508070450 506745758 505921707 506874924
484.1 506874924 508798904 507471390 506356888 506711197 503862534 504543839 506761436 507036018 509007416
492.8 509007416 507493362 506512794 507519073 504520950 499021835 497834587 499138718 499984283 501841965
501.5 501841965 499309654 496370811 495063629 493604851 491498985 488164444 488063164 488721275 489513321
510.2 489513321 487656975 486312180 487458229 485460968 482266998 479654503 479813614 482274361 482063408
518.9 482063408 480323410 479069824 477243843 476070023 476268539 477619553 479123116 476672134 477223549
527.5 477223549 477502060 473877792 472777939 474002838 475908432 476025772 477532730 479470253 479800034
536.2D79800034O62918k402192p47413K844620L022575J996384m1657r52148p00836
544.9D83482285R34524L72696M86908q1596k179757j458664j609230J055985J847534
553.6D82850685K04620J851998Q77495Q03299n45273l966980k608452j550674r01375
562.3D77015343J139221M83971o56052j319275j630859j484375k052613j914329k459183
570.9D67121849j754265O45981N1651j404304L23753J939087J332664M88930k258072
579.6D66487274j082229J730423K000465J376572O51092K990913L097573L082847J534539
588.3D81869469r99680j513748j470757J532326J106148P9193J70860O29425K428360
597D83831596J425896O58798j042061k368545j274223j28403L37868L37371J823883
$$ plain form
536.2 479800034 480462952 478060760 477313347 480157967 483180542 485176926 485135269 484183121 483482285
544.9 483482285 484416809 484789505 485276413 485194817 483015060 481556396 479947166 481003151 482850685
553.6 482850685 483055305 484907303 485784798 486588097 486042824 482075844 479467392 477916718 477015343
562.3 477015343 478154564 478638535 477982483 476663208 475032349 473547974 471495361 469581032 467121849
570.9 467121849 465367584 466013565 466065216 464660912 464984665 466923752 468256416 468745346 466487274
579.6 466487274 465405045 467135468 469135933 470512505 471163597 474154510 477252083 480334930 481869469
588.3 481869469 480869789 479356041 477885284 479417610 480523758 480602951 480773811 481403236 483831596
597 483831596 485257492 485916290 484874229 482505684 481231461 481103058 481440926 481778297 483602180
605.6D83602180J644135O25267n59235p63397j39503k64511L25470k81792p77817J85127
615.3D83595924K735634L271332J934776J605759J310348P69196j183968M6158J378327
624D95463486O63948J922302K590675K798005J615638J448822K404251R67255j264420
632.7E08609962j254501j32294K51885J914940J406898O84090J386871O35910N10903
641.3E14014664J9684o01349r76448n42946L55491M90418J593361K152176J929474
650E18434525R35554J4229q91953j179161M0016J37558n4512M8714J062279J665420
659.7E20212669N23568p15104j239166j61438m83894k00348J204796j563912n308799
668.3E12268372N154762L294296J310272L55988m52767m94842R7923r42192r44977
$$ plain form
605.6 483602180 485246315 485871582 485312347 484548950 484409447 484144936 484470406 484188614 483410797 483595924
615.3 483595924 486331558 489602890 491537666 493143425 494453773 495222969 494039001 494085159 495463486
624 495463486 496127434 498049736 500640411 503438416 505054054 506502876 508907127 509874382 508609962
632.7 508609962 507355461 507223167 507475052 509389992 510796890 511480980 512867851 513503761 514014664
641.3 514014664 514034348 513432999 512456551 511913605 512269096 512759514 514352875 516505051 518434525
650 518434525 519370079 519384308 518492355 517313194 517353210 517490768 517436256 517484970 518547249 520212669
659.7 520212669 520736237 520021133 518781967 518620529 518136635 517936287 519141083 517577171 512268372
668.3 512268372 517423134 520717430 522027702 522383690 521930923 521436081 521534004 520591812 519646835
677E19646835M40369R51805J302185K167053K418557Q71963j115608j625023m31175
685.7E24626961k81792q90770M53873J352348J448898K129441J074753r41086j211396
694.4E27761230j214828k200317k043419m01230Q47816R58710R52644O34461l84140
703.1E24910927j153946j467781j133843q58879j531982p71675Q79478J292191J988411
711.7E22152901K011566J429748P7134j624299n11894K39296l18756k58484M96521
720.4E23693733K361450K637787J987419J598473J472054J806869O81686o09550J071281
729.1E36701202K169762J794243L655891L876114J812439J831398J844483M96482j36642
737.8E54045372l63464M2762P43714J425895J991120J456718J875878J700515j47972
$$ plain form
677 519646835 520087204 521039009 522341194 524508247 526926804 527798767 526683159 525058136 524626961
685.7 524626961 524345169 523454399 523908272 525260620 526709518 528838959 529913712 528972626 527761230
694.4 527761230 526546402 524346085 522302666 521901436 522749252 523707962 524660606 525295067 524910927
703.1 524910927 523756981 522289200 521155357 520296478 518764496 517992821 518872299 520164490 522152901
711.7 522152901 524164467 525594215 525671349 524047050 523535156 523774452 523455696 523197212 523693733
720.4 523693733 526055183 528692970 530680389 532278862 533750916 535557785 536239471 535629921 536701202
729.1 536701202 538870964 540665207 544321098 548197212 550009651 551841049 553685532 554182014 554045372
737.8 554045372 553681908 553724670 554468384 555894279 557885399 559342117 561217995 562918510 562770538
746.5E62770538r37767j807365j754303o86798p00722j20468O54373L56598L75977
755.1E58150063P8468j130104j502114j111030j234589j126747n96580K9716J644249
763.8E53201332K480507J413803L81699N27191N41649l97606j78375L60450Q19397
772.5E59150047K445870L310928L880844L391724J947670J357269L13149j86577p92046
781.2E74818878o58607K56958J650619L903885L106499J521988J636162J224708k08931
789.9E87252159p54433n61828p51343J17950N37949J821518L692131K661133J747322
798.5E95762558J134987m78592p23076K35863O40755P40966P77207J623649K317353
807.2F02031670K308769K318382N01976p67136k15377m2267k29530l44658k23580Q03910
$$ plain form
746.5 562770538 561832771 560025406 558271103 557584305 556883583 556763115 557417488 557774086 558150063
755.1 558150063 558228531 557098427 555596313 554485283 553250694 552123947 551527367 551557083 553201332
763.8 553201332 555681839 557095642 557477341 558004532 558546181 558148575 557970200 558330650 559150047
772.5 559150047 561595917 564906845 568787689 572179413 574127083 575484352 575797501 575610924 574818878
781.2 574818878 574160271 574417229 576067848 579971733 583078232 584600220 586236382 587461090 587252159
789.9 587252159 586497726 585935898 585184555 585302505 585840454 587661972 591354103 594015236 595762558
798.5 595762558 596897545 596418953 595695877 595931740 596572495 597313461 598090668 599714317 602031670
807.2 602031670 604340439 606658821 607160797 606393661 606178284 606136017 605906487 605561829 605338249 606142159
816.9F06142159J549530J131668J164398L91884o02532k008514k831803r89418m68483
825.5F03478889k91900N16128P71523N11475k26174k273750m176369k697105k249527
834.2E93363190k298699o98890N64117O81877m9133k42996q11043r02901j844787l263779
843.9E84496956k660294j979599j271934K50435O97631p5302R86557R32541o77376
852.5E80699615j191673j990852j304016j69106L60222N60875J501503K404518J279259
861.2E82150345R03282L73192L44238M20494m64477M50668J465492K748986M354057
869.9E92746277M453468L605957K798233J198273K1439L55796k67334J81237M73251
878.6F05566597J335793K535018J844788Q15163j424942j927834k476921k902679k561875
$$ plain form
816.9 606142159 607691689 608823357 609987755 610379639 609777107 607768593 604936790 603947372 603478889
825.5 603478889 603186989 603703117 604474640 604986115 604759941 602486191 598309822 595612717 593363190
834.2 593363190 591064491 590365601 590929718 591611595 591562462 591319466 590508423 589605522 587760735 584496956
843.9 584496956 581836662 579857063 578585129 578835564 579533195 579457893 580444450 581376991 580699615
852.5 580699615 579507942 577517090 576213074 576043968 576404190 576965065 578466568 580871086 582150345
861.2 582150345 583053627 583426819 583771057 584191551 583727074 584177742 585643234 588392220 592746277
869.9 592746277 597199745 600805702 603603935 604802208 604823647 605179443 604912109 605093346 605566597
878.6 605566597 606902390 609437408 611282196 612097359 610672417 608744583 606267662 603364983 600803108
887.3F00803108k757911j290436o88706l60717m99802j443863k013054k204323j952400
895.9E87591896k379456k101974j876373j828957p15637K9869m78210j080666j574326
904.6E75586166k197418k757149l916473l607330k383271j893844j324082o93130r44252
913.3E55869217k054634k164383j951180l074722l550453k055702k281533k770881
921E35965729j266861n22347K02904M04625J79977R9259k64702r64928j482162n75943
930.7E31775551K41966O61392M29344R16710J763268O70357r995J06430M49639j79978
940.3E36824684p66640K58789P89910J254120J256370O94275k05307m90951p60689
949E38854561k416382k183876j836662k106591j722068j952820k198525k414817k698479
$$ plain form
887.3 600803108 598045197 596754761 596066055 595705338 595205536 593761673 591748619 589544296 587591896
895.9 587591896 585212440 583110466 581234093 579405136 578689499 578719368 578241158 577160492 575586166
904.6 575586166 573388748 570631599 566715126 563107796 560724525 558830681 557506599 556813469 555869217
913.3 555869217 553814583 551650200 549699020 546624298 543073845 541018143 538736610 535965729
921 535965729 534698868 534176521 534379425 534784050 534964027 535063286 534798584 533833656 532351494 531775551
930.7 531775551 532017517 532678909 533108253 534024963 535788231 536458588 536448593 536555023 537004662 536824684
940.3 536824684 536058044 536316833 537106743 538360863 539617233 540311508 540106201 539615250 538854561
949 538854561 536438179 534254303 532417641 530311050 528588982 526636162 524437637 522022820 519324341
957.7E19324341k788773l191757m107437m234657m347840l967399l557511m000663
965.4D89128304l860093m163055m123573m435921n753555o855431o583137n997735
973.1D47355804o227264n826569n764732n929527o499443n840836n838241p056199
980.8C98372993p098312o861610n642968n325927m958077m765358l854103l665314
988.5C56201324l967437k582283k365723j464081j692695o70433l34359j032791l26385
997.2C41765137m75884L54195m81262N8479j49422m33120k50245j298217L31993k57416
1006.8C39164238R3002K4643n51224l81240q41370o69746k642708j691857j142921
1015.5C31360817q85582m73824k61688N15175j194801L29094J29623k94304O5155l62510
$$ plain form
957.7 519324341 516535568 513343811 509236374 505001717 500653877 496686478 493128967 489128304
965.4 489128304 485268211 481105156 476981583 472545662 466792107 459936676 453353539 447355804
973.1 447355804 441128540 435301971 429537239 423607712 417108269 411267433 405429192 398372993
980.8 398372993 391274681 384413071 378770103 373444176 368486099 363720741 359866638 356201324
988.5 356201324 352233887 349651604 347285881 345821800 344129105 343458672 343124313 342091522 341765137
997.2 341765137 341289253 341643448 341162186 341220665 341071243 340638123 340387878 339089661 339421654 339164238
1006.8 339164238 339257240 339281883 338730659 338349419 337508049 336838303 334195595 332503738 331360817
1015.5 331360817 330475235 330001411 329739723 330254898 329060097 329389191 329518814 329224510 329289665 328927155
1025.2C28927155R6550k17057N48134k49901R17130P90405M32587P3356j327896L81546
1034.8C30372009o28700m93889j013527m22134P47528j58234L55683p24030k30446
1043.5C27804260q88557N0125m76265j461105q850m74473J613808O27556M64249N8975
1053.1C27309723J242332L122826M03404J474762K158852L158226J807861K267113
1060.9C42945099L279419J551399L061829J519394J613426J086731K36015M92172J75438
1069.5C55960922k32086k365951j781121l151588k200089j951484k090187l56217j978493
1078.2C39853706n75904o52733J030159J413879Q36868J011811K68058K615433K090073
1086.9C47891350K853546J104851J104927K812538J482696K098275P79800J584969
$$ plain form
1025.2 328927155 329023705 328806648 329354782 329104881 330022011 330812416 331245003 331318359 329990463 330372009
1034.8 330372009 329743309 329249420 328235893 327813759 328561287 328403053 328758736 328034706 327804260
1043.5 327804260 326915703 326965828 326489563 325028458 325019608 324545135 326158943 326786499 327250748 327309723
1053.1 327309723 328552055 331674881 332078285 333553047 335711899 338870125 340677986 342945099
1060.9 342945099 346224518 347775917 350837746 352357140 353970566 355057297 355293312 355785484 355960922
1069.5 355960922 355728836 353362885 351581764 348430176 346230087 344278603 342188416 341832199 339853706
1078.2 339853706 339277802 338625069 339655228 341069107 341905975 342917786 343185844 345801277 347891350
1086.9 347891350 350744896 351849747 352954674 355767212 357249908 359348183 360127983 361712952
1094.6C61712952J011772J378631J702919M08249R94263j79481P71980J57585N88760
1103.3C68547630N78232j44729P85636P10144K073365N62706J054420J471062P94105
1112C76432571P23916L43360J823311Q94356J085663J78146j29204Q75359J134224
1120.6C83361702J597710L13339J335258J175270J661988J396713O02913J594620M65698
1129.3C93505211J084213J156159J403884M53835r48486n51339q24050q7815l40118
1138C94851494m76952j793785k072258j401863j172028p83653k267456j563530j856079
1146.7C81463890j208382p10067j589661j796265k662773j287613j597633n40695o67038
1155.4C69403763j037293K01264p60155L93295N98793J660271J321030J064110K101097
$$ plain form
1094.6 361712952 362724724 364103355 365806274 366214523 367208786 367029305 367801285 367958870 368547630
1103.3 368547630 369125862 368981133 369766769 370476913 372550278 373112984 374167404 375638466 376432571
1112 376432571 377156487 377499847 379323158 380217514 381303177 381481323 381352119 382227478 383361702
1120.6 383361702 384959412 385272751 386608009 387783279 389445267 390841980 391444893 393039513 393505211
1129.3 393505211 394589424 395745583 397149467 397603302 396654816 396103477 395279427 395191612 394851494
1138 394851494 394374542 392580757 390508499 389106636 387934608 387150955 384883499 383319969 381463890
1146.7 381463890 380255508 379545441 377955780 376159515 373496742 372209129 370611496 370070801 369403763
1155.4 369403763 368366470 368567734 367807579 368200874 368799667 370459938 371780968 372845078 374946175
1164C74946175K059631L102493K957497L870964L307114L660812M072952L420639M070854
1172.7D05469131M198151N108452M285622M175987M355812M666023M582825L968124
1180.4D40810127M263497L047905L498306L160629L124695L591766K736817L131408
1188.1D67365150K421647K302322J844253J377411J789246J045341O99234P24679J171112
1196.8D80740395J107025Q21800P75261J024895Q79211L8605r3880k70042N36842P64580
1206.5D86324692O49833P96738O27976J838264J539917P09877N39475M66156O63642
1215.1D94156570K34909L17002N35164P69844K80533j12496J89629o08063j207352
1223.8D94555740j220894j049919q47358l59269l45687j075898q62465q05892j265259
$$ plain form
1164 374946175 377005806 380108299 383065796 386936760 390243874 393904686 397977638 401398277 405469131
1172.7 405469131 409667282 414775734 419061356 423237343 427593155 432259178 436842003 440810127
1180.4 440810127 445073624 448121529 451619835 454780464 457905159 461496925 464233742 467365150
1188.1 467365150 469786797 472089119 473933372 475310783 477100029 478145370 478844604 479569283 480740395
1196.8 480740395 481847420 482669220 483444481 484469376 485348587 485387192 485293312 485023270 485560112 486324692
1206.5 486324692 486974525 487771263 488399239 490237503 491777420 492487297 493026772 493492928 494156570
1215.1 494156570 494391479 494708481 495243645 496013489 496294022 496181526 496371155 495763092 494555740
1223.8 494555740 493334846 492284927 491437569 491078300 490732613 489656715 488794250 487988358 486723099
1232.5D86723099j031685m99153j115189j357460o97594j73301L40271M18815O18096
1241.2D83225899K37083J06163j73187j70059M16031P32994J601944J134185J362114
1249.9D88473167J577340J152725J521187J087875Q85506L85818N44434Q42247K69432
1258.5D96739731O10466J211700J503525J146126J060867O75240N3863K58217M74892
1267.2E03734627P28721P67594R43527J099892J110191J281624R51881K05994J15585
1275.9E10939636M13895L03650L07541K48336P38907J420479J017189O54831Q21190
1284.6E16865654J008911N66635M82712Q95348M41627L14026M54788L38173M74510
1293.3E21842384K43836n6114j85357j88789n12657o92062j01357k9030J49002L8910
$$ plain form
1232.5 486723099 485691414 485192261 484077072 482719612 482022018 481848717 482188988 482607803 483225899
1241.2 483225899 483462982 483569145 483395958 483225899 483641930 484374924 485976868 487111053 488473167
1249.9 488473167 490050507 491203232 492724419 493812294 494697800 495083618 495628052 496470299 496739731
1258.5 496739731 497350197 498561897 500065422 501211548 502272415 502947655 503001518 503259735 503734627
1267.2 503734627 504463348 505230942 506174469 507274361 508384552 509666176 510618057 510824051 510939636
1275.9 510939636 511353531 511657181 511964722 512213058 512951965 514372444 515389633 516044464 516865654
1284.6 516865654 517874565 518441200 518923912 519819260 520260887 520574913 521029701 521367874 521842384
1293.3 521842384 522086220 522030106 521844749 521655960 521143303 520451241 520349884 520320854 520469856 520508766
1302.9E20508766r9563K93121j01395k17247k85148m32969n64575p39784m39987l47481
1312.5E17573738L8033p5188n01633p17125p34825k51159r07212r05113p0686l8452
1322.2E13410378j53122l84522K14081J98326m47693l45955m01802l29704n64232o19392
1331.8E10576363m78173m54406j9951n86777j291428j051674r53712j030846M5967
1340.5E04755363J196175P55463J03950m58870Q5984L99818Q9340K1591n93414j84898
1350.2E06170502K67296J01623n8594o18171o85540j32255J58996m79965n93338l33710
1359.8E03796844j220092j820679j970940p19986Q27103P9842p97577j195450j326180
1368.5D95652885N9624P30095k89535p91016j655235k094460k41127N65262n60799
$$ plain form
1302.9 520508766 520409203 520702324 520600929 520383682 520098534 519665565 519100990 518361206 517921219 517573738
1312.5 517573738 517611771 517536583 517034950 516317825 515583000 515331841 514424629 513519516 513448830 513410378
1322.2 513410378 513257256 512872734 513086815 513285141 512837448 512491493 512089691 511759987 511195755 510576363
1331.8 510576363 510098190 509643784 509623833 509037056 507745628 506693954 505740242 504709396 504755363
1340.5 504755363 505951538 506707001 506810951 506352081 506438065 506837883 506927223 506948814 506355400 506170502
1350.2 506170502 506437798 506539421 506480827 505862656 505177116 505044861 505203857 504723892 504130554 503796844
1359.8 503796844 502576752 500756073 498785133 498065147 498892250 498972092 498174515 496979065 495652885
1368.5 495652885 495712509 496442604 496153069 495362053 493706818 491612358 491371231 491936493 491375694
1377.2D91375694j289787N14069J292800J466523J118393M39949M33616M10538P19757
1385.8D96481552K44446R03130J949920J534271R40667J011734R31816n27993k173118
1394.5E01296425j224442R62067j45340j282654q57506R96323J664124P70759N79338
1403.2E02759094o33583j427841R00536N56106q5182m14047o33927k65464J84173L0899
1412.8E00970764k11143q30574j517258j543884j308976q19549j307602K545357L047638
1421.5D99024773J267547k22244l0594K055931R49021q24852n76706r29070j382370
1430.2D99331436j10702N88874k64816Q0986j98326j867218k908173R83429J985054
1438.9D97620544o6757l73573j40381k00348M13551l10440J86081o92215j543922j937218
$$ plain form
1377.2 491375694 490085907 490599976 491892776 493359299 494477692 494917641 495351257 495761795 496481552
1385.8 496481552 496725998 497629128 499579048 501113319 502053986 503065720 503997536 503469543 501296425
1394.5 501296425 500071983 501034050 500888710 499606056 498748550 499744873 501408997 502179756 502759094
1403.2 502759094 502125511 500697670 501598206 502154312 502069130 501655083 501021156 500755692 500939865 500970764
1412.8 500970764 500759621 499929047 498411789 496867905 495558929 494739380 493431778 495977135 499024773
1421.5 499024773 500292320 500070076 500039482 502095413 503044434 502219582 501642876 500713806 499331436
1430.2 499331436 499220734 499809608 499544792 499625778 499427452 497560234 494652061 495635490 497620544
1438.9 497620544 497553787 497180214 497039833 496839485 497253036 496942596 497128677 496436462 494892540 492955322
1448.5D92955322J15891K56424j901856j820030k218933j406174l016281l227005l050461
1457.2D76686897j835022M633560J956025K683715N33524M51355L03497k454376L469811
1465.9D86428986K274360M503403M959335P251931O750412L299217O351204O860656
1473.6E28679504R399109M767914M256973N962563M712486L405876J383553J950035
1481.3E64518013J966743K710877J740646J099854J181030m45595M92745k96097j949577
1490E71018639J294746K669868J401444l21426o41556k031670l445167J793289J32179
1498.7E71870346j052246P11098q91724j402397j025543j416817l948708j4345131
1506.4E48498878l709106N841293L088074P51038N50880j770439l116226j141205k843170
$$ plain form
1448.5 492955322 493071213 493327637 491425781 489605751 487386818 485980644 482964363 479737358 476686897
1457.2 476686897 474851875 479485435 481441460 484125175 484658699 485110054 485413551 482959175 486428986
1465.9 486428986 488703346 493206749 498166084 505418015 512168427 515467644 521818848 528679504
1473.6 528679504 538078613 542846527 547103500 553066063 557778549 561184425 562567978 564518013
1481.3 564518013 566484756 569195633 570936279 572036133 573217163 572771568 573264313 572968216 571018639
1490 571018639 572313385 574983253 576384697 576063271 575421715 573390045 569944878 571738167 571870346
1498.7 571870346 570818100 571529198 570637474 569235077 568209534 566792717 562844009 548498878
1506.4 548498878 544789772 550631065 553719139 554470177 555021057 553250618 550134392 548993187 546150017
1515.1E46150017k586594m026451M08554M201012M04854n615082l240357L017769L031578
1523.7E41745300N608k721367N41878J015892K47307J202201P27425j542702j782112
1532.4E39439430k556114k428551K419701J306534k97203k030411r259949k858887
1540.1E23734550M774628J425896J079178J886902k42959J127396L024101J584778
1547.9E38394470K07062j085243J071663L089103J615754P133n36041K299118K502174
1556.5E47565193j566505j2763977m493332J5510368R063301M277344K311974M25148
1564.2E60329514O3781J662178J723557K05650k639503j404229M532700L279648R57146
1572.9E68710442j64719k72865j800003l487168K759209K863769O69137P2898k861
$$ plain form
1515.1 546150017 543563423 539536972 539945526 544146538 544551392 538936310 535695953 538713722 541745300
1523.7 541745300 541750908 539029541 539571419 540587311 540834618 542036819 542764244 541221542 539439430
1532.4 539439430 536883316 534454765 536874466 538181000 537883797 535853386 526593437 523734550
1540.1 523734550 528509178 529935074 531014252 532901154 532658195 533785591 536809692 538394470
1547.9 538394470 538601532 537516289 538587952 541677055 543292809 543299942 542763901 545063019 547565193
1556.5 547565193 545998688 533234711 528741379 544251747 553315048 557592392 559904366 560329514
1564.2 560329514 560393295 562055473 563779030 563984680 561345177 559940948 564473648 567753296 568710442
1572.9 568710442 568545723 568272858 566472855 562985687 565744896 568608665 569277802 569350700 569347839
1581.6E69347839j54838o88935n79528j82648j080017p68509r61494j325646j457596
1590.3E62148628j063652j174774j114540j436234k266464j094208j262168j396866
1598E51339722k070237j901245j977577k281952j749992k458801j164208j852951k649002
1606.7E33233757l242378k544213k522773l270989j342544k947121k861252l702278
1614.4E10800209l082275m224549q758087J472321j272011k389717l727303k810669
1622.1D86007919m254760o032792j4114j910973j862144n425301l306846j665077k969704
1630.8D58566208k388077l864784k158928m067383p195854j698494J015625L32031
1638.5D38540344j076088K06948j662980k36396j772805m12101j226235n359688K12212
$$ plain form
1581.6 569347839 569193001 568504066 567924538 567741890 566661873 565893364 564931870 563606224 562148628
1590.3 562148628 561084976 559910202 558795662 557359428 555092964 553998756 552736588 551339722
1598 551339722 549269485 547368240 545390663 543108711 541358719 538899918 537735710 535882759 533233757
1606.7 533233757 529991379 527447166 524924393 521653404 520310860 517363739 514502487 510800209
1614.4 510800209 507717934 503493385 494735298 496207619 494935608 492545891 488818588 486007919
1622.1 486007919 481753159 475720367 475706253 473795280 471933136 466507835 463200989 461535912 458566208
1630.8 458566208 456178131 452313347 450154419 446087036 438891182 437192688 438208313 438540344
1638.5 438540344 437464256 437671204 436008224 435771828 433999023 433586922 432360687 427000999 427213211
1647.2D27213211j334228M090232O41365M29383o39115j1646728K699699N316811N713653
1655.9D32484283J502877K390480J511459J185303J420669L84942J816902J683311
1663.6D44380226M102974K286453K381783J980209M19617J248436J929207L912163
1671.3D62641068J939697L861160K887344L64647K931938M157372L856773J192398
1679D83832397K280655K220230L028679J802216m597511M238662O159859N814171K907753
1687.7E07687111K289085L363457K853432L889274L126641K478332J607666J494942
1695.4E28789940p87888L759461M466133K311363q38661J428490O732368L873291O39114
1704.1E50373611l54843R96590J861916K322769J670570p62863P7438J658440O85272
$$ plain form
1647.2 427213211 425878983 429969215 430610580 431039963 430400848 418754120 421453819 426770630 432484283
1655.9 432484283 433987160 436377640 437889099 439074402 440495071 440880013 442696915 444380226
1663.6 444380226 448483200 450769653 453151436 455131645 455551262 456799698 458728905 462641068
1671.3 462641068 464580765 468441925 471329269 471693916 474625854 478783226 482639999 483832397
1679 483832397 486113052 488333282 491361961 493164177 488566666 492805328 498965187 504779358 507687111
1687.7 507687111 509976196 513339653 516193085 520082359 523209000 525687332 527294998 528789940
1695.4 528789940 528002052 531761513 536227646 538539009 537700348 539128838 545861206 549734497 550373611
1704.1 550373611 550018768 551015358 552877274 555200043 556870613 556107750 556185188 557843628 558528900
1712.8E58528900l62434k121125k98385K006073K40745j468582M701576L115120J136284
1721.4E65478172l547r84345l39317m65088j064453j568718k010460k585831n286751
1730.1E51169662l676681j739922l571014j0044251r011802P45239k895508n811004
1737.8E15164719n540314p460289p485314k762146l165092o485748j123123M25453
1745.5D81568146J550293J764221L170776P956353O596641J1838837J1410904J1638069
1753.3E37494240J1334648J0322800J0029335R427528J1926460Q901062Q104401N958443
1761F13498917N037803P577324N831604N468369L671570L188247K069397J163101L262711
1769.7F50769043J305466j823731p41730M741593M700394K189178J519928K155762
$$ plain form
1712.8 558528900 558166466 556045341 555746956 557753029 557993774 556525192 561226768 564341888 565478172
1721.4 565478172 565474625 564490280 564150963 563685875 562621422 561052704 559042244 556456413 551169662
1730.1 551169662 547492981 545753059 542182045 532137794 523125992 523871231 520975723 515164719
1737.8 515164719 509624405 502164116 494678802 491916656 488751564 482265816 481142693 481568146
1745.5 481568146 483118439 484882660 488053436 496009789 502606430 514445267 525856171 537494240
1753.3 537494240 548828888 559151688 569181023 578608551 590535011 599436073 607540474 613498917
1761 613498917 618536720 626114044 631945648 637414017 641085587 644273834 646343231 647506332 650769043
1769.7 650769043 652074509 650250778 649509048 654250641 658951035 661140213 662660141 664815903
1777.4F64815903N80368Q65783N27573j37329K019424J743699R86709j90430Q89359
1786F72101059J843338K57111K14920L09143j220475j381225q48389K444534L204880
1794.7F76924896K46887k37884K096939R36356j140290m61044J323242P2785J140136
1803.4F80902023J938172K10876M24195K00271q4457M27780l30887r45358P47146J575394
1813F85065155P46384M00695M60511Q61053M730N2872O84433r3460q0872q60977J83029
1823.7F87423553J99128j833954J588592J737213k98080j995468j173172K405777J774216
1832.3F89827805J96838J89667M18014k8305m12216L91464J265869J88523l01361p50504
1842F90985794n79452j333771k682953K759323K010956j30539M47616Q65937O60934
$$ plain form
1777.4 664815903 665396271 666262054 666789627 666652298 668671722 670415421 671402130 671211700 672101059
1786 672101059 673944397 674201508 674416428 674725571 673505096 672123871 671275482 673720016 676924896
1794.7 676924896 677171783 676933899 679030838 679967194 678826904 678365860 679689102 679761887 680902023
1803.4 680902023 682840195 683051071 683475266 683675537 683591080 684018860 683687973 682742615 683489761 685065155
1813 685065155 685811539 686212234 686672745 687533798 687538528 687591400 688275833 688182373 688101501 687240524 687423553
1823.7 687423553 687622681 685788727 687377319 689114532 688816452 686820984 685647812 688053589 689827805
1832.3 689827805 690024643 690214310 690632324 690604019 690191803 690583267 691849136 692037659 691736298 690985794
1842 690985794 690406342 689072571 686389618 689148941 691159897 691029358 691476974 692342911 693003845
1850.7F93003845k07443l01209j20010K48795K80532J03913L14865j97449K30942M75311
1860.3F93832092J08414m08783m00314l2349m64325n96466q24432o34919o97174N57251
1869.9F90438995J856232J449127O03409l68576l11127J53199L58657r5367k81372
1878.6F93803177K50549O01578M23508l43705k38571n23910k52915O4240j27182N41076
1888.3F94197845p45468j87530J652450N19486m09012o09665r92660l80631R87778
1896.9F94032593N32760J48774K64206J50985q1405l14331J94168m52729m47693l20892
1906.6F93706436p41730J43967L30887K75421P11136O94275k25678l10592m18930n73502
1916.2F93591690m03061j720199P22808J496735J03607l17993j164322K85339J142045
$$ plain form
1850.7 693003845 692796402 692495193 692375183 692623978 692904510 693008423 693323288 693125839 693356781 693832092
1860.3 693832092 693940506 693531723 693131409 693099060 692634735 692038269 691213837 690578918 689881744 690438995
1869.9 690438995 692295227 693744354 694347763 693979187 693668060 693821259 694179916 694084549 693803177
1878.6 693803177 694053726 694655304 695078812 694735107 694496536 693972626 693719711 693783951 693656769 694197845
1888.3 694197845 693452377 693264847 694917297 695436783 695027771 694418106 693425446 693044815 694032593
1896.9 694032593 694565353 694714127 694978333 695129318 695047913 694733582 694927750 694475021 694027328 693706436
1906.6 693706436 692964706 693108673 693439560 693714981 694426117 695120392 694894714 694584122 694165192 693591690
1916.2 693591690 693188629 691468430 692191238 693687973 693791580 693473587 692309265 692594604 693736649
1924.9F93736649n646m26102M5776J4039j67542m0359J75705L13873j36337J23977
1934.6F93634033l0441k67258j04980l05557k38877l42254R1400j242142q91190J819687
1944.2F92122421P15409k17743j73798l2959n6076k84119J17569K900K3040J73035
1953.8F92389679J1063J70364L20740k04621m16870l59726n69534o2561J92566J00479
1963.5F91571579K28500J86615m35638n45044M19846M29687j5030m73404j68533K62298
1973.1F91460876Q8120K30484K59552J22528j54571j01471l26462n09949l62396m51431
1982.8F90255280J2817j1139Q9035M33273K02408j24893k54211j34736j255416j353455
1992.4F87858963P46994Q88824K10190N1422J49003K83279J20087k40632n08499o78558
$$ plain form
1924.9 693736649 693731003 693304901 693350677 693364716 693197174 693156815 693332520 693646393 693510056 693634033
1934.6 693634033 693603592 693336334 693231354 692925797 692686920 692344666 692436066 691193924 690302734 692122421
1944.2 692122421 692837830 692620087 692446289 692413330 692357254 692073135 692190704 692193604 692216644 692389679
1953.8 692389679 692400742 692571106 692891846 692687225 692270355 691910629 691341095 691278534 691471100 691571579
1963.5 691571579 691800079 691986694 691551056 691006012 691425858 691855545 691840515 691367111 691198578 691460876
1973.1 691460876 691548996 691779480 692039032 692161560 692006989 691905518 691579056 691069107 690706711 690255280
1982.8 690255280 690268097 690256958 690345993 690779266 690981674 690856781 690602570 690467834 689212418 687858963
1992.4 687858963 688605957 689494781 689704971 689756393 689905396 690188675 690308762 690068130 689559631 688881073
2002.1F88881073k92511j56784k87552Q6517L94974L14408N416J34201l91540q61511
2011.7F87826691n99594r36509n38025k8457o5155K73971N39475M20685R3918m19846
2021.3F86567154j020584o18744m24423n71213j96228J48315M50058N93262M39606
2030F85367203o06308p58896j50986m19006m10996n42907m62265N1574L26996O00739
2039.7F82995148M51889l40805n41992l62626q51135o75125j80054J92490K82974K14691
2049.3F81185455M44413L12271K16293m45328p71560o55289o43616k3193J30997L91159
2059F80141602L89480K56424L48969J04065j39389r59397q97446l7078J59607J96533
2068.6F79563370L22952M50363N90973L86582k18277l52402o46515m39072l12958o68716
$$ plain form
2002.1 688881073 688588562 688431778 688144226 688230743 688625717 688940125 688945541 689079742 688688202 687826691
2011.7 687826691 687227097 686290588 685752563 685724106 685658951 685932922 686472397 686893082 686987000 686567154
2021.3 686567154 685546570 684927826 684503403 683932190 683735962 683884277 684334335 684927597 685367203
2030 685367203 684760895 684001999 683851013 683432007 683021011 682478104 682015839 682067413 682394409 682995148
2039.7 682995148 683447037 683106232 682564240 682201614 681350479 680675354 680495300 680687790 680970764 681185455
2049.3 681185455 681629868 681942139 682158432 681713104 680941544 680286255 679642639 679619446 679750443 680141602
2059 680141602 680531082 680787506 681136475 681240540 681101151 680141754 679244308 679207230 679366837 679563370
2068.6 679563370 679886322 680336685 680927658 681314240 681095963 680743561 680097046 679657974 679345016 678676300
2078.2F78676300J65405M55094L08075M10995M17175K70462l05938m57001p24792r07898
2087.9F78307877k98233L91540N86548N70526L59650K92816L57818l60565m29458l13645
2097.5F79464874n45578l59268k63138K84271O12793M61579L58581J46180j55259o04019
2107.2F79401016p17087m26559k02026K00805L95584L4256M27552M35867j08948j19781
2116.8F79320679l64991m45938o49871k65656K59628N55954Q82950J61438j49612k2431
2126.5F79282150p5378o34155o63605l6850k80762n7525J96380M59366L29590r5902
2136.1F78423309k0828k92663l81089o87408j59531M16184J54266J00632K6397N34211
2145.8F78113480L45687l22952l67050j36032j73645k46735q9340m15039J60904R31778
$$ plain form
2078.2 678676300 678841705 679296799 679604874 680015869 680433044 680703506 680397568 679940567 679215775 678307877
2087.9 678307877 678009644 678401184 678987732 679558258 679917908 680210724 680568542 680207977 679778519 679464874
2097.5 679464874 678919296 678560028 678296890 678581161 679193954 679655533 680014114 680160294 680005035 679401016
2107.2 679401016 678683929 678257370 678055344 678256149 678651733 678685989 679113541 679549408 679440460 679320679
2116.8 679320679 678955688 678509750 677859879 677594223 677853851 678409805 679292755 679454193 679304581 679282150
2126.5 679282150 679206772 678572617 677909012 677872162 677591400 677533875 677730255 678189621 678519211 678423309
2136.1 678423309 678402481 678109818 677728729 677041321 676881790 677297974 677452240 677552872 677579269 678113480
2145.8 678113480 678459167 678136215 677769165 677633133 677459488 677212753 677123413 676708374 676869278 677801056
2155.4F77801056P72934L5171n01251q5754q5602l76892n32837n29938j65634N50766
2165F76882019N98602K20871K69165J5869J94550R9869K29j30387m15039J96228L73307
2175.6F78305283M25872Q3924J54342M01383j09329p5379l71704l53699j1901K89535
2185.3F78738327L63617J85013L25622K41242J77460j27106n7144j80283k54288r2773
2194.9F79319687l57361J67618N34592Q12454N70831J25809j04447n93185k18735k9068
2204.6F80228195J43738l6240k47879O4698K57263M86297L83683N06820j62124m57917
2214.2F81166534k27127n84716M8980M42200J59607J14136L87039J53503N0659L1739
2223.9F81742554o01425k85874j02768r5138O0730Q3465M12522N05981J14899j67466
$$ plain form
2155.4 677801056 678573990 678609161 678107910 678022156 677936554 677559662 677026825 676496887 676331253 676882019
2165 676882019 677480621 677701492 677970657 677986526 678181076 678280945 678281174 678150787 677735748 677931976 678305283
2175.6 678305283 678731155 678815079 678969421 679370804 679261475 679186096 678814392 678460693 678448792 678738327
2185.3 678738327 679101944 679286957 679612579 679853821 680031281 679904175 679847031 679666748 679412460 679319687
2194.9 679319687 678962326 679129944 679664536 680476990 681047821 681173630 681069183 680475998 680257263 680228195
2204.6 680228195 680371933 680335693 680087814 680152512 680409775 680896072 681279755 681786575 681624451 681166534
2214.2 681166534 680939407 680354691 680403671 680845871 681005478 681119614 681506653 681660156 681710815 681742554
2223.9 681742554 681141129 680855255 680752487 680657349 680718079 680801544 681214066 681720047 681834946 681667480
2233.5F81667480J21842l87726n15137j11389j99356j5411J53732M93240M04053J85013
2243.2F81796341k99759n82123k14157j47552j04065l14865m6540K01187N46647N04913
2252.8F81340027j47782k32849n33828j42746k0142p5912m8294j33591J7319k73133
2262.4F79749069N47257M57840j56174R6512j63346m16336m22668q1711r9335M52958
2272.1F79964066J87072l01132L43628K50168J65024n29099m98199n1499j59378o4773
2281.7F79305878l9063K42996j20926j6860j49384k29874l4485m15267p5989l2425
2291.4F78434601l2273l77883j01777J83411K13623N00794m14277m19387p28913m23278
2301F76834641j52360m14810M57001j66626L8910l35312p98035L82r689l00675j175995
$$ plain form
2233.5 681667480 681789322 681401596 680886459 680775070 680575714 680560303 680714035 681207275 681611328 681796341
2243.2 681796341 681496582 680914459 680700302 680552750 680448685 680133820 680087280 680288467 680835114 681340027
2252.8 681340027 681192245 680959396 680425568 680282822 680262680 680186768 680138474 680004883 680022202 679749069
2262.4 679749069 680296326 680754166 680597992 680694504 680531158 680114822 679692154 679610443 679511108 679964066
2272.1 679964066 680151138 679850006 680193634 680443802 680608826 680079727 679581528 679530029 679370651 679305878
2281.7 679305878 679266815 679509811 679388885 679372025 679222641 678992767 678958282 678543015 678467026 678434601
2291.4 678434601 678402328 678024445 677922668 678106079 678319702 678820496 678406219 677986832 677257919 676834641
2301 676834641 676682281 676267471 676724472 676557846 676596756 676261444 675463409 675463791 675454102 675153427 673977432
2311.6F73977432j28631o87o37970k68021K5330O21185k98385o80008p83768m79279
2321.3F71347198l92608l83530k98233j133880N32760O79169k09580n38711o96030
2329.9F68906555p67898o82068J172027K17743n82275p57065o866J076507m18625o63147
2339.6F67494888j163559l99780M73862L53470k19880n97381N89065Q18711J748276
2348.3F69097672J157073o43005j412582j393662j403885j161194l83148q29620j98822
2356.9F62828827p0343q92563j09100k13013M68750j84021r81445k8534Q17489N37415
2366.6F62173462J96609N78003j64337j16806J029053J864776Q58841m38995l01666
2375.3F65678940J19781Q35572R89456N72281K98843N64575N89066O8283j20545j04980
$$ plain form
2311.6 673977432 673848801 673848114 673210144 672942123 672967453 673588638 673290253 672610245 671826477 671347198
2321.3 671347198 670954590 670571060 670272827 669138947 669671707 670350876 670141296 669602585 668906555
2329.9 668906555 668138657 667456589 668628616 668846359 668264084 667507019 667500153 668576660 668158035 667494888
2339.6 667494888 666331329 665931549 666405411 666758881 666539001 665941620 666530685 667349396 669097672
2348.3 669097672 670254745 669611740 668199158 666805496 665401611 664240417 663857269 663027649 662828827
2356.9 662828827 662758484 661865921 661756821 661543808 662012558 661828537 660847092 660818558 661636047 662173462
2366.6 662173462 662370071 662948074 662783737 662666931 663695984 665560760 666419601 665980606 665678940
2375.3 665678940 665798721 666634293 667623749 668196030 668494873 669059448 669648514 669716797 669596252 669491272
2384.9F69491272q7433k09427j907K8000k16217k12174r0561M40445L87650j17645
2394.6F69412003m12674o07911m47921j75782l28674m13971J87378K90527l0517l00217
2404.2F67172241k42538J05362j71814n09110o26983l52860k670K02102K72522J96305
2413.8F66042557J11542n13688q39920p35855k54745K6703k58026m0055M71878M89426
2423.5F64499817n21774n52750j14594m38919l46145n54657l48282p935R5902J45492
2433.1F61856155l4942P782m27475n95551n13077l78189j48544k69012k06910k28881
2442.8F59061356k31095K47116L60947n47333p10907l30505l60947j30310j49994j50909
2452.4F57057419j87607J18103K3193m60586K5711j76926m99344l50875k62452j16043
$$ plain form
2384.9 669491272 669403839 669194412 669192505 669220505 669004288 668792114 668701553 669141998 669529648 669412003
2394.6 669412003 668999329 668391418 667943497 667767715 667439041 667025070 667212448 667502975 667472458 667172241
2404.2 667172241 666929703 667035065 666863251 666354141 665727158 665374298 665371628 665573730 665846252 666042557
2413.8 666042557 666154099 665640411 664800491 664064636 663809891 663836594 663578568 663538513 664010391 664499817
2423.5 664499817 663978043 663425293 663310699 662871780 662525635 661970978 661622696 661614761 661710663 661856155
2433.1 661856155 661821213 661828995 661401520 660805969 660292892 659914703 659766159 659497147 659290237 659061356
2442.8 659061356 658830261 659077377 659438324 658890991 658180084 657849579 657488632 657358322 657208328 657057419
2452.4 657057419 656869812 656987915 657011108 656550522 656576233 656399307 655899963 655549088 655286636 655170593
2462.1F55170593j21383j24665m31976k97241J8692j13983j83411k61307m71954k20261
2471.7F52963104J61820j79825o1798J31225l22113m01230j20010l67050o72302r7504
2481.3F51034317J07880k38266o75965k78167O34689J11389k10800J08795j50299p50656
2491F49692917p92236k11335l8910j23748k9374Q9264l19748k07061J33819j39618
2500.6F48053970m1198k42005n10940m29306J48391M50669m883R6435k87246q40226
2510.3F46393661m08782L4790L0136K8763j77231l84903r8954j61972l6087J07727
2519.9F45327148j98059l34472j28098m0130n52750j67008J90430q6288j44120n30700
2529.6F43335953m05274j8081O9122n01404q39691k51465L0136P7362k53067j89590
$$ plain form
2462.1 655170593 655049210 654924545 654492569 654195328 654214020 654100037 653916626 653655319 653183365 652963104
2471.7 652963104 653124924 652945099 652883301 653014526 652692413 652291183 652171173 651804123 651131821 651034317
2481.3 651034317 651142197 650903931 650227966 649949799 650584488 650695877 650485077 650593872 650443573 649692917
2491 649692917 648900681 648689346 648650436 648526688 648497314 648586578 648266830 648059769 648193588 648053970
2500.6 648053970 648012772 647770767 647259827 646830521 646978912 647429581 647424698 647521133 647233887 646393661
2510.3 646393661 645984879 646019669 646049805 646078568 645901337 645516434 645417480 645255508 645219421 645327148
2519.9 645327148 645129089 644794617 644666519 644626389 644073639 643906631 644097061 644010773 643866653 643335953
2529.6 643335953 642930679 642912598 642981720 642480316 641640625 641389160 641419296 641496658 641243591 641054001
2539.2F41054001q9646n68618k93351n5923l8681R4299l15971m82369Q2093J02081
2548.9F39487915m46777l85933j74217m08020m56658L7918J4420n72739l03573L929
2558.5F36796265l39737j58158N5504n8822p9766j79214j69449l67851l41225k99950
2568.1F34857597n49583j43776K13280L9673m45137l80517j17797l36457j33857k79503
2577.8F32723923n59998k85568J64490J91459j33133j99546m13361m63295l07999J18523
2587.4F30835495p668m84619k04773k12478j58081j76506m19770n69839k15645M9439
2597.1F28435555n10445j86577j07307j23864J13793k64511k20414j48658r7695n36499
2606.7F26353378o39801l52745k33879l1166l84750q2436l31535n56031K0180j14021
$$ plain form
2539.2 641054001 640964355 640395737 640102386 640046463 640007782 640102081 639786110 639303741 639385834 639487915
2548.9 639487915 639041138 638655205 638480988 638072968 637616310 637654228 637668648 637095909 636792336 636796265
2558.5 636796265 636456528 636298370 636353874 636295052 636215286 636036072 635866623 635498772 635157547 634857597
2568.1 634857597 634308014 634164238 634377518 634417191 633972054 633591537 633473740 633137283 633003426 632723923
2577.8 632723923 632163925 631878357 632042847 632234306 632101173 631901627 631488266 631024971 630716972 630835495
2587.4 630835495 630827827 630343208 630138435 629925957 629767876 629591370 629171600 628601761 628386116 628435555
2597.1 628435555 627925110 627738533 627631226 627507362 627621155 627356644 627136230 626987572 626889877 626353378
2606.7 626353378 625713577 625360832 625126953 625095787 624711037 624628601 624297066 623741035 623761215 623647194
2616.4F23647194q5983n30854o41250l38135m45251m41628n01137M9820K29721k36931
2626F20705566n52597p74612m13666K9221l72620p47185j98974n8899n69077p08046
2635.6F16339111m74243k58522m50287n13572r7580j40381m82636l98216m54674n65490
2645.3F12503510n48668m27514j74903m7760J6784k68402n07202p87163q85010j59683
2654.9F08713989K36626l17726o44608K44980L44849n12581n09300l42903m08402p56111
2664.6F06048813o46248k85950n84755l85246R4299k43644l46337L8491k70501n16777
2674.2F02902145l69300j04142j92375p00912m98238k21329n0163l32985n79452j09978
2683.9E99743271n7259k20184n20477m90837l17917r2850o1264l54004P2098j80016
$$ plain form
2616.4 623647194 623561211 623030357 622389107 622050972 621605721 621164093 620662956 620712776 620942497 620705566
2626 620705566 620152969 619378357 618964691 618993912 618621292 617874107 617675133 617616234 617047157 616339111
2635.6 616339111 615864868 615606346 615156059 614642487 614544907 614404526 613921890 613523674 613069000 612503510
2645.3 612503510 611954842 611527328 611352425 611304665 611321449 611053047 610545845 609758682 608873672 608713989
2654.9 608713989 608950615 608632889 607988281 608233261 608578110 608065529 607556229 607213326 606804924 606048813
2664.6 606048813 605402565 605116615 604531860 604146614 604240913 603997269 603650932 603689423 603418922 602902145
2674.2 602902145 602532845 602428703 602236328 601535416 601037178 600815849 600765686 600432701 599853249 599743271
2683.9 599743271 599686012 599465828 598945351 598454514 598136597 598043747 597982483 597628479 597700577 597520561
2693.5E97520561o55632o24771l63388N4817J10474J35956l85743m12635k91252m28048
2703.1E94660339m06189o61659q5487j47362n04837k42805m75770k76641j02654m60167
2712.8E91296768o62498l30468k7427m41857r07440p38601k12136K33994J65329o91262
2722.4E87684402r09271j80511K22511j65977o50673n56374m02985j58081j69525l80211
2732.1E84333305m29077n00412l41759k3765J71852j80130l43056m46014m94385j13830
2741.7E81632729k00768n4932J4687j80817m40559q09059l22495J4267k10952m17367
2751.4E79024734o30035m73099l3416k251j63918k23999m20227k72064j22070m05960
2761E76277695n23529j68724k92588l76968J66855j21041k71568m44908q72726m45977
$$ plain form
2693.5 597520561 596864929 596240158 595876770 595931587 596042061 596178017 595792274 595379639 595088387 594660339
2703.1 594660339 594254150 593592491 593507004 593359642 592854805 592612000 592136230 591859589 591756935 591296768
2712.8 591296768 590634270 590303802 590276375 589834518 588927078 588188477 587976341 588210335 588375664 587684402
2722.4 587684402 586775131 586594620 586817131 586651154 586000481 585444107 585041122 584883041 584713516 584333305
2732.1 584333305 583904228 583403816 583062057 583038292 583210144 583030014 582686958 582240944 581746559 581632729
2741.7 581632729 581431961 581377029 581391716 581210899 580770340 579961281 579638786 579653053 579442101 579024734
2751.4 579024734 578394699 577921600 577888184 577885933 577722015 577498016 577077789 576805725 576683655 576277695
2761 576277695 575754166 575585442 575292854 574915886 575082741 574961700 574690132 574245224 573372498 572926521
2770.7E72926521n9166j14898m78936l19748k93960m67568l60336o00548l55453j87302
2780.3E69688606l39966o34956o77223k26479l07350q48503p65686K72827L014p17697
2789.9E65446587o26107o36940m23851q53691p50427p8316j01127n64156j002464n28260
2799.6E59881248l14712p08199j022300o60401k83012o41327o99310o29120l34778
2808.3E54588089m43420q26569q28629j166114j262131j151466r54018o77834o86531
2816.9E46591377r72633j298676j049728p22046j018028j485481j475792j190453j309853
2825.6E36068687j491394j158905j443061k147408k117004j753159j544762k180290
2833.3E22232704k261123j902047k377968k554931l165932l728638m068260m884605
$$ plain form
2770.7 572926521 572867355 572752457 572273521 571953773 571659813 571192245 570831909 570231361 569875908 569688606
2780.3 569688606 569348640 568713684 568036461 567809982 567502632 566654129 565888443 566161270 566164284 565446587
2789.9 565446587 564820480 564183540 563759689 562905998 562155571 562077255 561976128 561411972 560409508 559881248
2799.6 559881248 559566536 558858337 557836037 557175636 556892624 556251297 555551987 554922867 554588089
2808.3 554588089 554144669 553318100 552489471 551323357 550061226 548909760 547955742 547277908 546591377
2816.9 546591377 545618744 544320068 543270340 542548294 541530266 540044785 538568993 537378540 536068687
2825.6 536068687 534577293 533418388 531975327 529827919 527710915 525957756 524412994 522232704
2833.3 522232704 519971581 518069534 515691566 513136635 509970703 506242065 502173805 497289200
2841.1D97289200n329781n794563o733971q104286q654137q851509r648666r883232
2848.8D34289055j0029030r618645q066139o132507m134827j904068P49512K454681
2856.5C97608032L714905M801025N443650N690956N635490N938568N088234L697968
2864.2D37618828K989349K717781K310448J038551J73073r5100k49825J68953M36478
2872.9D47108536N23643O92902N80978R03740P76978O1226L852k77137m29039n36766
2882.5D49408913q00019j017723j561050j744347j968117j571769j325112k041740
2890.2D37379036j801758j997452k811432k421951j882858k285004k705002k299308
2897.9D19174271k003441k417641k796936k709160k862663l195038l384590l756065
$$ plain form
2841.1 497289200 491959419 486164856 479430885 471326599 462672462 453820953 444172287 434289055
2848.8 434289055 424260025 414641380 406575241 400442734 396307907 394403839 395153351 397608032
2856.5 397608032 401322937 406123962 411567612 417258568 422894058 428832626 433920860 437618828
2864.2 437618828 440608177 443325958 445636406 446674957 446848030 446752930 446503105 446672058 447108536
2872.9 447108536 447632179 448325081 448906059 449809799 450586777 450648003 450651855 450374718 449945679 449408913
2882.5 449408913 448608894 447591171 446030121 444285774 442317657 440745888 439420776 437379036
2890.2 437379036 435577278 433579826 430768394 428346443 426463585 424178581 421473579 419174271
2897.9 419174271 417170830 414753189 411956253 409247093 406384430 403189392 399804802 396048737
2905.7C96048737l666268l598823m266777m832497n217552n354920n466156o531753
2913.4C57113991p022782o771621p411194p399483p091980p374687o878548n824089
2921.1C01339607m719314m035988l098984j891518n37490M77027J084290K279797K468319
2929.8B93365746L319091M444752M704628N480614N886612O223507O144867O429824
2937.5C35999641O804047O431809N961685N948028O033669N104370M905929M674302
2945.2C81863480L593368L056564K790528J964531J048355J157760J011467O83709
2952.9C97169762L03764K94228Q78448O22254R44366J804466K391701K777519L044281
2961.6D10230789L387451M006234M679336M175606L974152M285469M030685L952370
$$ plain form
2905.7 396048737 392382469 388783646 384516869 379684372 374466820 369111900 363645744 357113991
2913.4 357113991 350091209 343319588 335908394 328508911 321416931 314042244 307163696 301339607
2921.1 301339607 296620293 292584305 289485321 287593803 287056313 287533340 288617630 290897427 293365746
2929.8 293365746 296684837 301129589 305834217 311314831 317201443 323424950 329569817 335999641
2937.5 335999641 342803688 349235497 355197182 361145210 367178879 372283249 377189178 381863480
2945.2 381863480 385456848 388513412 391303940 393268471 394316826 395474586 396486053 397169762
2952.9 397169762 397473526 397767754 398646202 399268456 400212822 402017288 404408989 407186508 410230789
2961.6 410230789 413618240 417624474 422303810 426479416 430453568 434739037 438769722 442722092
2969.3D42722092M369239M532853M092598L639412L354606L299751K751961K451630
2977D71214142K594910K480239K522660K296066K142487J758575J438446J763802J902542
2985.7D90113869J224823N96962J012993J039276J004829R95636M01039J52321K50588
2994.4D96792336P8468n00717n35355q16078j314354j269608j174965j062393j394958
3003.1D88802376j592179j596069j083679q51059j324730o57005j25008L36075J073990
3011.7D82982712R74006Q31223J424789J869812J475754J598053J843872J532707N70946
3020.4D95103874N2757O44875R16481J012001L29857j56250Q7967J07651L22647j75667
3030.1D98246193n38368k77977r7122m235l71170n01022l30124n53398o79360n1727
$$ plain form
2969.3 442722092 447091331 451624184 455716782 459356194 462710800 466010551 468762512 471214142
2977 471214142 473809052 476289291 478811951 481108017 483250504 485009079 486447525 488211327 490113869
2985.7 490113869 491338692 491935654 492948647 493987923 494992752 495988388 496389427 496541748 496792336
2994.4 496792336 496870804 496370087 495834732 495018654 493704300 492434692 491259727 490197334 488802376
3003.1 488802376 487210197 485614128 484530449 483679390 482354660 481697655 481572647 481908722 482982712
3011.7 482982712 483956718 484787941 486212730 488082542 489558296 491156349 493000221 494532928 495103874
3020.4 495103874 495156631 495801506 496717987 497729988 498059845 497903595 497991562 498099213 498421860 498246193
3030.1 498246193 497707825 497429848 497332726 497328491 496957321 496456299 496126175 495572777 494893417 494841690
3039.7D94841690k05193j258506j111450m92135k93502l35770p05452q34351o82373
3048.4D88922958l81927m70886j043320p66373k82173l72238n50842r14231q02650
3057.1D83338318n96123j070061j321106q27140n09262m06647l92952r81865p05414
3065.7D76527748k80342m86145m26483q16422q48236n07965m17633m48723m53529m40102
3075.4D71402168o97822n84603n89218n73997n55268p90214q16345p17545l56941n81474
3085D65138741o62766k81563l32222q32062r13429l45573q37822p78046m65469j001778
3094.7D58688011n60608m21562p37305n31234m43993q62427q30116p75223j038704
3103.4D52486839n19409p56111q41446l17039n36004n28678n02930m71459k85987k29645
$$ plain form
3039.7 494841690 494636497 493377991 492266541 491774406 491480904 491145134 490439682 489605331 488922958
3048.4 488922958 488541031 488070145 487026825 486260452 485978279 485606041 485055199 484140968 483338318
3057.1 483338318 482742195 481672134 480351028 479523888 479014626 478607979 478215027 477233162 476527748
3065.7 476527748 476247406 475761261 475334778 474518356 473670120 473162155 472744522 472295799 471842270 471402168
3075.4 471402168 470704346 470119743 469530525 468956528 468401260 467611046 466794701 466077156 465720215 465138741
3085 465138741 464475975 464194412 463862190 463030128 462116699 461771126 460933304 460155258 459689789 458688011
3094.7 458688011 458127403 457705841 456968536 456437302 455993309 455130882 454300766 453525543 452486839
3103.4 452486839 451967430 451211319 450369873 450052834 449516830 448988152 448485222 448013763 447727776 447498131
3113D47498131n27878j285439j664047q51288r0103l71399o80771r15031q61321r98420
3122.6D39252434j151314m60091l59802p99026j013718q90045p77970p73048n50842
3131.3D32476578p06253j032601o49032m62609j089058q63685o38046o63186m19693
3140D25952415q69979p61795j162262j271668l85322p73850r54056n88760l57781o17904
3149.6D18209038j044197q95806q29162o81534o71234q52204j202888r47533k69088
3158.3D10815392p94373j030464o51322r20524j016808q61702p82852q24470r57604
3167D02975273n81207p80144j182823q86955q97866o45599o15997p91893p35703o31180
3176.6C95225906o14891j083946p30438p50466r62295q56590r32885l64074q39730
$$ plain form
3113 447498131 446970253 445684814 444020767 443169479 443079376 442707977 442027206 441112175 440250854 439252434
3122.6 439252434 438101120 437641029 437281227 436482201 435468483 434578438 433800468 433027420 432476578
3131.3 432476578 431770325 430737724 430088692 429626083 428537025 427673340 427035294 426372108 425952415
3140 425952415 425082436 424320641 423158379 421886711 421501389 420727539 419773483 419184723 418826942 418209038
3149.6 418209038 417164841 416269035 415439873 414758339 414087105 413234901 412032013 411084480 410815392
3158.3 410815392 410021019 408990555 408339233 407418709 406401901 405540199 404757347 403932877 402975273
3167 402975273 402394066 401613922 400431099 399544144 398646278 398000679 397384682 396592789 395857086 395225906
3176.6 395225906 394611015 393527069 392796631 392046165 391083870 390227280 389294395 388930321 388090591
3185.3C88090591q28132k42768j115112j505813n16930j2207j088333j321984o55708
3194C80803604m61655q71505r54552l33214p62291q04443p57752j158676j009063o41022
3203.6C73049431k25601p62635r53216o30989o09322o59637p78618n68314n94139n53627
3213.3C66713333p15637q94356p69386n10826k68135q86536r67903p20596r35936p56379
3222.9C59287643o64367n82047k24266m68864j020394n56450l17840q46062o33888
3231.6C53973465k03056n46570r86633q60825n54390p92732p36237j22948r71031j368789
3241.3C46830254p56836o37169k05536o08940m11072k14233r57871r54971q20542n62553
3250.9C40700531p33910j50909q9073j199074j123886o03294k73438r97772p20406
$$ plain form
3185.3 388090591 387262459 387019691 385904579 384398766 383881836 383869629 382781296 381459312 380803604
3194 380803604 380341949 379470444 378515892 378182678 377420387 376615944 375858192 374699516 373690453 373049431
3203.6 373049431 372823830 372061195 371107979 370476990 369867668 369208031 368429413 367861099 367266960 366713333
3213.3 366713333 365997696 365103340 364333954 363823128 363554993 362668457 361700554 360979958 360044022 359287643
3222.9 359287643 358623276 358041229 357816963 357348099 356327705 355771255 355453415 354607353 353973465
3231.6 353973465 353770409 353223839 352237206 351376381 350821991 350029259 349293022 349170074 348199043 346830254
3241.3 346830254 346073418 345436249 345230713 344621773 344210701 343996468 343038597 342083626 341263084 340700531
3250.9 340700531 339966621 339815712 339726639 338527565 337403679 336800385 336526947 335529175 334808769
3259.6C34808769o21071j057548j87874o21490o25039l30391m64744m41857n32608
3268.3C29926147m73785q35304m75579q80355r66149j51367m65050o15844p87545q28514
3277.9C23446655p10983l69339n05257n17311J07460k28080l07541n38979o42490k68631
3287.5C19465504n38731p86991l44467o352r34601r58805k68097q258k5921q06065
3297.2C14787216n67055Q0452j54838q37841j088104l80326J62735J3867n47467n27744
3306.8C10940895k41165o09074o04515l19748m45041l97129o24123q86231m00714J93367
3316.5C06606522p6390j122417o86321J15413k68497n11952n47466l93391n89408m54121
3326.1C02071972l01685o69842o82602j69888K13604p63550o71405l36628p93286n34725
$$ plain form
3259.6 334808769 334187698 333130150 332942276 332320786 331695747 331365356 330900612 330458755 329926147
3268.3 329926147 329452362 328617058 328141479 327261124 326294975 326143608 325678558 325062714 324275169 323446655
3277.9 323446655 322735672 322366333 321861076 321343765 321451225 321223145 320915604 320376625 319734135 319465504
3287.5 319465504 318926773 318139782 317795315 317788963 316854362 315895557 315627460 315619202 315593281 314787216
3297.2 314787216 314220161 314300613 314145775 313307934 312219830 311839504 312002239 312016106 311468639 310940895
3306.8 310940895 310699730 310090656 309486141 309166393 308721352 308324223 307700100 306813869 306413155 306606522
3316.5 306606522 306530132 305407715 304721394 304836807 304568310 304056358 303508892 303115501 302526093 302071972
3326.1 302071972 301770287 301100445 300417843 300247955 300461559 299698009 299026604 298689976 297896690 297361965
3335.8B97361965n76477r7389r1248l89290o57920q39253o09340o83766j2016l64113
3345.4B93041153r68571p32517j2283L36055p02800o56185o94600n38082l59745o61506
3355.1B88050919l33634p86304m66614n27115r33285n07221n69248k38705j63307n50861
3364.7B82974625o16665l00007k71206o21433p62463k77271j55335p59639p94602j096821
3374.3B77319183n94139j59359n43766k33574n06458o25191n79319j58767J4705n10635
3384B73422680l73535n11189m26197m67567n02854k30121l12710l15399l54882j20334
3393.6B69807892K02541K46659m93355j037312l99856M26349p0114r35917K4071Q4705
3403.3B67855663k40268L06987j68724n48038l27473j9073j85032l12081O1627K43854
$$ plain form
3335.8 297361965 296785488 296688099 296596851 296207561 295549641 294710388 294101048 293417282 293405266 293041153
3345.4 293041153 292072582 291340065 291327782 291663837 290961037 290304852 289610252 289072170 288712425 288050919
3355.1 288050919 287717285 286930981 286464367 285937252 285003967 284496746 283927498 283688793 283525486 282974625
3364.7 282974625 282357960 282057953 281786747 281165314 280402851 280125580 279970245 279210606 278416004 277319183
3374.3 277319183 276725044 276565685 276021919 275788345 275281887 274656696 274077377 273918610 273933315 273422680
3384 273422680 273049145 272537956 272111759 271644192 271141338 270911217 270598507 270283108 269928226 269807892
3393.6 269807892 270010433 270257092 269763737 268726425 268326569 268752918 268682804 267746887 267770958 267855663
3403.3 267855663 267615395 267922382 267753658 267205620 266878147 266859074 266674042 266361961 266423588 266667442
3412.9B66667442j65329l47080j90182o50463k61535L88736K16332J42040J59493k00921
3422.6B65758533k67791N64022L81374l32374p3281M62590J06182l80631j83773K53258
3432.2B66288109J077404M01153m34169r1477K23007L20435n035K92415M11072N71823
3441.8B69054737J62163M2171Q21534K84404k937l35808M65775Q90693M62857P87563
3451.5B72633152M32720Q79059P54852L25127M8771j98841M05521J51501M33845M35830
3461.1B76301537N81092Q00934O04096J063938M82750J54056L89214O05354N66578
3469.8B81549549P90234Q34675Q0814M70142N76783L65047J071491J596546M34609
3478.5B87769890m10156N42392R32045P47280O26717J158867N09033M2477Q16593M72412
$$ plain form
3412.9 266667442 266502113 266155033 265964851 265314388 265052853 265441589 265657921 265799961 265959454 265758533
3422.6 265758533 265490742 266054764 266436138 266103764 266030483 266493073 266599255 266218624 266034851 266288109
3432.2 266288109 267365513 267766666 267332497 267241020 267464027 267784462 267779427 268071842 268482914 269054737
3441.8 269054737 269216900 269259071 270080605 270365009 270362072 270026264 270492039 271382732 271845589 272633152
3451.5 272633152 273065872 273944931 274699783 275024910 275073681 274874840 275280361 275431862 275865707 276301537
3461.1 276301537 276882629 277683563 278287659 279351597 279834347 279988403 280377617 280982971 281549549
3469.8 281549549 282339783 283174458 283255272 283725414 284302197 284667244 285738735 287335281 287769890
3478.5 287769890 287359734 287902126 288834171 289581451 290208168 291367035 291876068 291918545 292735138 293207550
3488.1B93207550R46388J238919R87072N55057N90534J018563Q01353P42912J755N87731
3497.8C00677834J120929P02477P03506L12062L87592P70588J058197Q54549J172371
3506.5C07760105R03587O23532Q87451L62358J170139J225624J272564J127110L53889
3515.1C15686359N46475O75163J166496Q97122R02099R05018J078072P08885l64761
3523.8C22200928J043129J094856J125679J066856O11191J039963J052933J159401
3531.5C30394936Q23478J373825J356545J239014J80015k15568J678199J023941J077500
3540.2C38931885J274452R68475O58799P05757J028213Q5259R38987R79538K599106
3548.9C48170471K117310M87251J056519O2790J671905J037025R30634J618958P43713
$$ plain form
3488.1 293207550 294153938 295392857 296379929 296934986 297525520 298544083 299345436 300088348 300090103 300677834
3497.8 300677834 301798763 302501240 303204746 303516808 303904400 304674988 305733185 306587734 307760105
3506.5 307760105 308663692 309287224 310174675 310537033 311707172 312932796 314205360 315332470 315686359
3515.1 315686359 316232834 316907997 318074493 318971615 319873714 320778732 321856804 322565689 322200928
3523.8 322200928 323244057 324338913 325464592 326531448 327142639 328182602 329235535 330394936
3531.5 330394936 331218414 332592239 333948784 335187798 335367813 335152245 336830444 337854385 338931885
3540.2 338931885 340206337 341174812 341833611 342539368 343567581 343652840 344591827 345571365 348170471
3548.9 348170471 350287781 350775032 351831551 351894341 353566246 354603271 355533905 357152863 357896576
3557.6C57896576J534500O08139R40514R20906J136436K66381N08499L292427l67699
3566.2C66736679J020966K157440J037025L213387J686439J778641K302742J786575
3574C81719894P66716J764298K292137O98700J826286J026612J213989K133751J943245
3582.6C95385628J467743N68008L084526R75037j428795K111626J718788L124237K859993
3591.3D09866791K706337J134491P0572J871719M35600K798653K367859N89103K706719
3600D24547844J315727J521835J984635J645050K689094K829438J144638j014862L058433
3608.7D39721832K35100N20516N888900O33812m11987L057289k0332L165893K467575
3617.4D55258598L39470K311898K53982J190605L017464K471886K130470K464218J035347
$$ plain form
3557.6 357896576 359431076 360039215 360979729 361900635 363037071 363303452 363811951 367104378 366736679
3566.2 366736679 367757645 369915085 370952110 374165497 375851936 377630577 379933319 381719894
3574 381719894 382486610 384250908 386543045 387241745 389068031 390094643 391308632 393442383 395385628
3582.6 395385628 396853371 397421379 400505905 401480942 400052147 402163773 403882561 407006798 409866791
3591.3 409866791 412573128 413707619 413778191 415649910 416085510 418884163 421252022 421841125 424547844
3600 424547844 425863571 427385406 429370041 431015091 433704185 436533623 437678261 436663399 439721832
3608.7 439721832 439956932 440477448 446366348 447000160 446588173 449645462 449625130 452791023 455258598
3617.4 455258598 455598068 457909966 458163948 459354553 462372017 464843903 466974373 469438591 470473938
3626D70473938J237450M342498j682472n414009M946671N191269M496116M26445p59086
3634.7D83258820L003501K969132J598816K04239J437759K168236J727562Q11577M79660
3643.4D97659302K300911K458229K060852k782936j089859N130768J88941j415290
3651.1E04510918J422004N128060L442383K649498L142890n592575K648392M885254
3658.8E22236824J279106J371155N6152J620484J283111J202584J398239K73208K913475
3667.5E33634338L99094j948929K41509l726387L442459O304664L988037n090942j0112114
3676.2E27131729N456581P183609L588181q18711J755791K716065J252784N70069p248
3684.9E48828850N86853K764435L503189p790375k054596O495094l207893J072998
$$ plain form
3626 470473938 471711388 476053886 474371414 468957405 473904076 479095345 483591461 484017906 483258820
3634.7 483258820 486262321 489231453 490830269 491034508 492472267 494640503 496368065 497179642 497659302
3643.4 497659302 499960213 502418442 504479294 501696358 500606499 505737267 505926208 504510918
3651.1 504510918 505932922 511060982 514503365 517152863 520295753 514703178 517351570 522236824
3658.8 522236824 523515930 524887085 524943237 526563721 527846832 529049416 530447655 530720863 533634338
3667.5 533634338 534033432 532084503 532326012 528599625 532042084 538346748 542334785 537243843 527131729
3676.2 527131729 532588310 539771919 543360100 542541389 544297180 547013245 548266029 548836098 548828850
3684.9 548828850 549415703 552180138 555683327 547892952 545838356 552333450 549125557 550198555
3692.6E50198555M516029O52008J165734J99623J75400R58862L15056K041588J061782
3701.3E61284637m498901j11198M554672J202316l75023k40249J276588J416245o817856
3709.9E57691231L104744L098983q054389M761695M273758Q23365K98614J014786K40249
3718.6E67253036k529983J309929L025665m353027j554299M075241k79502o23436j903420
3727.3E64420204J136742L109512K15149L471108m892731n763741O999054r69238o668243
3736E61057816J742057L040543J015930K262192J586647k841568K840958Q006630j0312081
3744.7E68399124j1377716R256249M256019L432732l121338p568092Q355827m842034
3752.4E66790771l503875O532402M652214K485771n145798J223641L856964n238609
$$ plain form
3692.6 550198555 554714584 555366592 556532326 556731949 556907349 557866211 558181267 560222855 561284637
3701.3 561284637 556785736 556674538 561229210 562431526 562056503 561816254 563092842 564509087 557691231
3709.9 557691231 560795975 563894958 555840569 560602264 564876022 565699387 565998001 567012787 567253036
3718.6 567253036 564723053 566032982 569058647 564705620 563151321 567226562 566947060 566323624 564420204
3727.3 564420204 565556946 568666458 568881607 572352715 567459984 561696243 568695297 567726059 561057816
3736 561057816 562799873 565840416 566856346 569118538 570705185 567863617 570704575 578711205 568399124
3744.7 568399124 557021408 566277657 570533676 573966408 570845070 563276978 571632805 566790771
3752.4 566790771 563286896 569819298 574471512 576957283 571811485 573035126 576892090 571653481
3760.1E71653481j11008K913322M51470Q94432K084389l779145k198410L448639L181763
3768.8E78538933r84383o080055K503738L014717R72443O19774p91740L72505k45209
3777.4E77920723O74934j374054m254608K253456J839409J573258J163330k495842
3785.2E77300606L04146J921615M45214m10576r78890j50451K49862L52707q8615O94313
3794.8E79639931J130600l978920k063408K329597J653710J315345o395607o332435
3802.5E67298813M807892M342384L887978K989769q145752r32808N042839R23118M4175
3811.2E80258408O03561m15039J55029L469925l386535j0602837N146408L821564K454681
3819.9E81505165Q583j2692032K640724M979668K277718J474075q52508k946816J610146
$$ plain form
3760.1 571653481 571542473 574455795 574907265 575801697 577886086 574106941 571908531 575357170 578538933
3768.8 578538933 577554550 571474495 573978233 576992950 577965393 578585167 577793427 578165932 577920723
3777.4 577920723 578595657 577221603 572966995 575220451 577059860 578633118 579796448 577300606
3785.2 577300606 577604752 579526367 579971581 579561005 578582115 578431664 578681526 579034233 578945618 579639931
3794.8 579639931 580770531 576791611 574728203 577057800 578711510 580026855 573631248 567298813
3802.5 567298813 572106705 576449089 580337067 583326836 575181084 574248276 579291115 580214233 580258408
3811.2 580258408 580861969 580446930 580601959 584071884 580685349 570082512 575228920 579050484 581505165
3819.9 581505165 581513748 568821716 571462440 576442108 578719826 580193901 579341393 576394577 578004723
3828.6E78004723K668495J573601p12128o277123L561058M926682o071358K14806N268020
3837.2E83156776p965164k746963O332054k795410Q33091M665986k415390j458359
3844.9E77606621K097854P64275n18799N58319q17795Q98171K068672p181015J363754
3853.6E76840057r675979L466758R454766n23071q68149J538009J742287J677780m785423
3862.3E78867035O8550L411598n301475k695198L401756L443413K610664p925453m374008
3871E71506882O005897N055084l33633p995720K693787L973312j59798J156807J387787
3879.7E83290405n337791k487335N514450K39601R4795K169533r632263K800789M534950
3888.3E81187134P19604K035866l465538o553307L133965L570290p36313N87730P6294
$$ plain form
3828.6 578004723 580673218 582246819 581534691 575257568 578818626 583745308 577673950 577888756 583156776
3837.2 583156776 575191612 572444649 578776703 575981293 576814384 581480370 579064980 577606621
3844.9 577606621 579704475 580468750 579949951 580508270 579690475 580588646 582657318 575476303 576840057
3853.6 576840057 567164078 570630836 580085602 579562531 578694382 580232391 581974678 583652458 578867035
3862.3 578867035 578935585 582347183 577045708 574350510 577752266 581195679 583806343 575880890 571506882
3871 571506882 577512779 582567863 582234230 574238510 576932297 580905609 580745811 581902618 583290405
3879.7 583290405 577952614 575465279 580979729 581219330 581314125 583483658 573851395 576652184 581187134
3888.3 581187134 581906738 583942604 580477066 573923759 577057724 580628014 579891701 580479431 580555725
3897E80555725J362801J47781p329636M295273k08206m427414M519310j529579o41060
3905.7E76744995N11704J121711K373734K14271L7270n85899l61557j40229k07710
3914.4E79708290Q77457R15489k684021k271385K817955j010781k180099K923546J266899
3923.1E80363350p0381j789246j119346K111206N90210o75164j496544m9858J364060
3931.7E79228287j866265p70988J108818M90112R27086O93321k25525q14590m18549
3940.4E78351707J226693R4719k884140M78324J698533N54275R0599j825600N4360
3949.1E77839470l72353r55391K063904o7940j096839O87561O70471k6818l88641j66473
3958.7E78186951q64106K53029M60511o86226Q09974O33736m59595l43399K098L52402
$$ plain form
3897 580555725 581918526 582066307 574736671 579031944 578823738 574396324 578915634 577386055 576744995
3905.7 576744995 577256699 578378410 580752144 580966415 581003685 580417786 580056229 579916000 579708290
3914.4 579708290 580585747 581501236 578817215 576545830 579363785 578353004 576172905 579096451 580363350
3923.1 580363350 580292969 578503723 577384377 579495583 580085793 579410629 577914085 577864227 579228287
3931.7 579228287 577362022 576591034 577699852 578189964 579117050 579810371 579584846 578770256 578351707
3940.4 578351707 579578400 579673119 576788979 577267303 578965836 579520111 579610710 577785110 577839470
3949.1 577839470 577467117 576511726 578575630 578507690 577410851 578098412 578768883 578742065 578353424 578186951
3958.7 578186951 577322845 577575874 578036385 577350159 578160133 578793869 578334274 577990875 577992973 578345375
3968.4E78345375n20363j022835j87835k05727j98898L70598L66478L78570L11546
3977.1E77636909L01629n9891p01981q8272Q16231K5635j061440k02751O28395M10500
3986.7E77704964m20n73349o23054J48162M91181l14293l65677j98517j86500M28962
3996.3E76511459K96669L5057R5559k38839
4000.2E76699905
$$ plain form
3968.4 578345375 577825012 576802177 576614342 576408615 576209717 576580315 576946793 577325363 577636909
3977.1 577636909 577938538 577878647 577176666 577088394 577904625 577930260 576868820 576666069 577294464 577704964
3986.7 577704964 577704544 577131195 576508141 576656303 577147484 576833191 576467514 576268997 576082497 576511459
3996.3 576511459 576808128 576843185 576938744 576699905
4000.2 576699905
##END=$$ End of the data block
