##TITLE=$$ Begin of the data block
##JCAMP-DX=5.00 $$ ACD/SpecManager v 10.08
##SPECTROMETER/DATA SYSTEM=Varian
##DATE=04 Dec 2012 13:37:12
##DATA TYPE=INFRARED SPECTRUM
##DATA CLASS=XYDATA
##ORIGIN=
##OWNER=
##NPOINTS=3735
##FIRSTX=399.26403809
##LASTX=4000.35498047
##MAXX=4000.35498047
##MINX=399.26403809
##MAXY=69.89672852
##MINY=26.81399727
##XFACTOR=1.0000000000
##YFACTOR=0.000000100000000
##FIRSTY=52.95487595
##DELTAX=0.96440572
##XUNITS=1/CM
##YUNITS=TRANSMITTANCE
##XYDATA=(X++(Y..Y))
399.3E29548759j4801597J7128754J1733551N954132o818161j1046067J418190L954048
407E37071609L707085j608581J63116M81415p539444k358170L140717l3455p899361
415.7E25124931r796180o738511j128883L093071R736672R685821L370895N718194
423.4E39066010J528511j1646729j0030594J964226L232155j053162l78341L33557
431.1E23015633o40564l023987l64838M54598k465096N165596K203331n425567k123223
439.8E16795883L747063L013878l271485k128334M154511M295502q45871O70433J3122
448.4E26444702o37131M161835q78143J50184K677613n277558l533210k408028o934128
457.1E13766136j319008O689606K015114n77927j249466K623444J514168K36244j612129
$$ y = [529548759, 514747162, 531875916, 543609467, 549563599, 542745438, 531699371, 533117561, 537071609, 540778694, 539170113, 539333229, 539814644, 532275200, 529917030, 533057747, 533024292, 525124931, 515328751, 508590240, 507461357, 510554428, 520291100, 529976921, 533347816, 539066010, 540594521, 528947792, 518917198, 520881424, 524113579, 523060417, 522682076, 523015633, 522375069, 519351082, 518986244, 519440842, 516975746, 522141342, 524344673, 518919106, 516795883, 520542946, 523556824, 520285339, 518157005, 522311516, 526607018, 525761147, 526431580, 526444702, 525807571, 529969406, 529091263, 529241447, 531919060, 526641502, 523108292, 520700264, 513766136, 512447128, 519136734, 521151848, 520573921, 519324455, 521947899, 523462067, 523698311, 522086182]
465.8E22086182n072785J919174j820297j762962M534340k401581m124298O67267M494133
474.5E18519173N3405n109252j715546j599274N63927L83568m28238q44651k330741
483.2E07492371o99425K196998j02691k769585J408653K090950J829796l72734l922233
491.8E07152100j6861J254768j838760k830086O01997m88128k559815r89609j4457
500.5E00271149L40461j124115j161766j405296j39275l011322l291168J869812j61094
509.2D92187386O5460k510529j699981N89027j508942R4185j189651l256150l159370
517.9D79611435o9122N55725k372437l507118r70306L793792J687966o86608j145820
526.6D76897507j52283j96953p82013J452751O75049K38304J51291M20761N37110j28021
$$ y = [522086182, 517013397, 518932571, 517112274, 515349312, 519883652, 517482071, 513357773, 514025040, 518519173, 518572578, 513463326, 511747780, 510148506, 510712433, 511096001, 510667763, 509823112, 507492371, 506792946, 508989944, 508887253, 506117668, 507526321, 509617271, 511447067, 511074333, 507152100, 507135239, 508390007, 506551247, 503721161, 504323158, 503835030, 501275215, 500285606, 500271149, 500611610, 499487495, 498325729, 496920433, 496781158, 493769836, 490478668, 492348480, 492187386, 492252846, 489742317, 488042336, 488631363, 487122421, 487216606, 486026955, 482770805, 479611435, 479542313, 480098038, 477725601, 474218483, 473248177, 477041969, 478729935, 478043327, 476897507, 476745224, 476548271, 475766258, 477219009, 477894058, 478132362, 478283653, 478704414, 479241524, 479113503]
536.2D79113503M97169N1117J228828Q85125M71382K015686K561722J501884p25059
544.9D87601357k26136l46908j098290j023292j181145p88651o04057J287537J054954
553.6D84675369P8202J417656J224555q32901k371788j803512j299858k056542j916160
562.3D77115021R60083N71327j140671l03993r65996j663246k793121j835289n52483
570.9D69391632j831207j742211l56826L07731O11725K291489P97806o09246q47816
579.6D68013077m73557R38797N99747J320763K446594L308525K690010K690086K038689
588.3D83572731o39038o12717n01137r49592k23312J276016J683578J000519J883469
597D86490517P08427o33736j159935k287178j826439m06494J007386L09486O10275
$$ y = [479113503, 479610672, 479661789, 480890617, 481775742, 482247124, 484262810, 486824532, 488326416, 487601357, 487375221, 487028313, 485930023, 484906731, 483725586, 482936935, 482332878, 483620415, 484675369, 484753571, 486171227, 487395782, 486562881, 484191093, 482387581, 481087723, 479031181, 477115021, 478075104, 478646431, 477505760, 477201767, 476235771, 474572525, 471779404, 469944115, 469391632, 467560425, 465818214, 465461388, 465769119, 466380844, 468672333, 469470139, 468860893, 468013077, 467539520, 468478317, 469078064, 470398827, 472845421, 476153946, 478843956, 481534042, 483572731, 482933693, 482320976, 481819839, 480870247, 480646935, 481922951, 483606529, 484607048, 486490517, 487198944, 486565208, 485405273, 483118095, 481291656, 480885162, 481892548, 482202034, 482812309]
605.6D82812309K478676J656494J75438r8953q92716o08520k54326j001205N03997
614.3D84771194K323952K546997J828537J600647J963539J298104J13411J27487J006698
623D97580566J73226K5368K012367K850036K053261J849251J732559O65665R26857
631.7E09869156j74561p57217J43394M24500J830482J496773J570816J179123J8654
640.4E15601120J31378p83424m16527k6436j86958L01971J194344J949539J599312
649E19364319J596260L68729j60256k58789r08775l41492m30069m00314K07176J904793
658.7E20941582K407570M31366q82645j428299q92029j052017n46341J145821k187615
667.4E17937393q284225Q093681N679703K011185N88302o55975j918183j362266o20041
$$ y = [482812309, 485290985, 486947479, 487122917, 487023964, 486131248, 485522728, 485268402, 484267197, 484771194, 487095146, 489642143, 491470680, 493071327, 495034866, 496332970, 496446381, 496573868, 497580566, 497753792, 497779160, 499791527, 502641563, 504694824, 506544075, 508276634, 508942299, 509869156, 509694595, 508937378, 509080772, 509505272, 511335754, 512832527, 514403343, 515582466, 515601120, 515732498, 514949074, 514532547, 514506111, 514319153, 514621124, 515815468, 517765007, 519364319, 520960579, 521329308, 521169052, 520910263, 520001488, 519659996, 519229927, 518829613, 519036789, 520941582, 523349152, 523780518, 522897873, 521469574, 520577545, 519525528, 518979187, 520125008, 517937393, 509653168, 517746849, 523426552, 525437737, 526026039, 525370064, 523451881, 522089615, 521469574]
676.1E21469574o790N19218J852684K179871J761093K008934j2779o83747k96821j939583
685.7E26851654j789322m83856J241150K594948J600914L01742O0845N32455l21617
694.4E30588913j682854j915283j269493m43420p54662J57471J340866R08775O46973
703.1E27577286j373329k519570p49130l46108j070480n63621O99920R60350J216774
711.7E23832092J795388Q92028k65274J82038K99530q06465l91732L15399L24135J821366
721.4E27998505L477058K905502J146737P87696K41890M16031J706734J591606J745453
730.1E42017212K458420K611847L031463K602082J275863J431580Q61511l08952K16293
738.7E56197319P31888O78177O73904J199036J557350J765327J416741K76375N8593
$$ y = [521469574, 521462784, 521982002, 523834686, 526014557, 527775650, 529784584, 529771805, 529088058, 528791237, 526851654, 525062332, 524578476, 525819626, 528414574, 530015488, 530317230, 530378075, 530910530, 530588913, 528906059, 526990776, 525721283, 525277863, 524523201, 524680672, 526021538, 526930313, 527577286, 526203957, 523684387, 522935257, 522589149, 521518669, 520955048, 521654968, 522615318, 523832092, 525627480, 526519508, 526254234, 526436272, 526735802, 525929337, 525537605, 525853004, 526177139, 527998505, 531475563, 534381065, 535527802, 536315498, 536557388, 536973419, 538680153, 540271759, 542017212, 544475632, 547087479, 550118942, 552721024, 553996887, 555428467, 556289978, 555981026, 556197319, 556929207, 557607384, 558281288, 559480324, 561037674, 562803001, 564219742, 564496117, 564554710]
747.4E64554710j024131k249298j595307j000900P1106O75812J56555P34939l38630
756.1E59984856j647034j26610m01649k371521k026978k46887M61769P69806J984024
764.8E56379776K287178J283302O58303J03378J4458N26962K51007N32875J788292
773.5E63825531K946777L844033K636032J315765J477356J211243N64842m98467j09558
782.1E77213554J020241J980324K365303K343712K500229J084861Q84858J2359j079559
790.8E88325882l88489n78689R23004K011566J520271J598091K315598K459755R25636
799.5E99112625L2616m49219k54707O7482O07795J419945J456986K266960K767105
808.2F07027588J617851O8321l08647j064911j020469J26228r9335O37207J798592
$$ y = [564554710, 563530579, 561281281, 559685974, 558685074, 558756180, 559431992, 559588547, 560323486, 559984856, 558337822, 558211212, 557809563, 555438042, 553411064, 553164177, 553625946, 554395752, 556379776, 558666954, 559950256, 560608559, 560711937, 560726395, 561253357, 561504364, 562037239, 563825531, 566772308, 570616341, 573252373, 574568138, 576045494, 577256737, 577821579, 577323112, 577213554, 578233795, 580214119, 582579422, 584923134, 587423363, 588508224, 589393082, 589405441, 588325882, 587937393, 587358704, 588281708, 590293274, 591813545, 593411636, 595727234, 598186989, 599112625, 599145241, 598696022, 598441315, 598508797, 599116592, 600536537, 601993523, 604260483, 607027588, 608645439, 608713760, 608405113, 607340202, 606319733, 606445961, 606346626, 606983833, 608782425]
816.9F08782425J439667Q14018R96399N41572q85162k159958k695617j818619n53551
825.5F04461174J57700K27317J184426L39241j402893j514015k577134k812652k965660
834.2E95097504k173195n39398K39601M86221Q8615M96865r44786k398262k595520
842.9E87757645l104554k052230j243439j317902n56602M81033M63982R89113P69271
851.6E82186317m62074j026802k012863o45180M79965p4882N17921J067734J290016
860.3E81320152J619263J988335L52935m10080L45688l4675Q13369J578141K425308
868.9E89998436M047890M495353L815194L027534J337242k44026J07346j69411O06422
877.6F07021980J077156J410370J267548l79563M62532J27488r25331k382203l350105
$$ y = [608782425, 610222092, 611036110, 612032509, 612574081, 611688919, 609528961, 606833344, 605014725, 604461174, 604618874, 604846191, 606030617, 606369858, 604966965, 603452950, 600875816, 598063164, 595097504, 592924309, 592384911, 592624512, 593110733, 593199348, 593696213, 592751427, 590353165, 587757645, 584653091, 582600861, 581357422, 580039520, 579482918, 579963951, 580427933, 581417046, 582186317, 581724243, 580697441, 578684578, 578039398, 578519363, 578444481, 578962402, 580030136, 581320152, 582939415, 584927750, 585280685, 584870605, 585216293, 585181618, 585994987, 587573128, 589998436, 594046326, 598541679, 602356873, 605384407, 606721649, 606477623, 606584969, 606415558, 607021980, 608099136, 609509506, 610777054, 610397491, 610860023, 610987511, 610062180, 607679977, 604329872]
886.3F04329872k463989k478447j555176p94830m55208o74515j217651j326065k195320
895E91168671k631226k316246k065735k405968j686325o15768k25830J44729l23791
903.7E79042511j813202l269844l216286l351822l247375k100716j526336j452332
911.4E59064598j320686j162987j608047j993905k411155l165512l609848l062897
919.1E40729561k142525k209968j397248L07617P67060J72920n73883k28348j79252
927.8E35245934j136322n75867r7771m5090O04477O60820R43985O76880M94995O05316
937.4E37377357j144j7319q09250j098175M18129J462288J988945J618843P33643J08337
947.1E41781654n83076j680565k601624k094688j747169j759339j957588k211952j840401
$$ y = [604329872, 601865883, 599387436, 597832260, 597037430, 596582222, 595907707, 594690056, 593363991, 591168671, 588537445, 586221199, 584155464, 581749496, 580063171, 579447403, 579221573, 579366302, 579042511, 577229309, 573959465, 570743179, 567391357, 564143982, 562043266, 560516930, 559064598, 557743912, 556580925, 554972878, 552978973, 550567818, 547402306, 543792458, 540729561, 538587036, 536377068, 534979820, 535287437, 536054497, 536227417, 535653534, 535425186, 535245934, 534109612, 533533745, 533435974, 533390884, 533995361, 534656181, 535600166, 536277046, 536772041, 537377357, 537376213, 537358894, 536549644, 535451469, 535869598, 537331886, 539320831, 540939674, 541673317, 541781654, 541198578, 539518013, 536916389, 534821701, 533074532, 531315193, 529357605, 527145653, 525305252]
955.7E25305252k043304k774201l278465l654442l984833m184074m283257m028587
963.4D97074089l901596l531036l865662m457169m175758m841881n244941o408120
971.2D60647926o997566o153526o064606n899811n854835n928421o679764n731201
978.9D11338196n809670o933632p119751p201118n128937n050392n243874m940528
986.6C63910294l793183k964783l425788k298775k329445k032928k068711q67271o89125
995.3C43440285j159134j02081l68767J54495j96495K38533o42052k77786K34680j172409
1004.9C40149269J98860k28424O14891l49121j592331p30591j010475r67216k183342
1013.6C33901520r13391j534310p16247J004562j80168n4321j003991l07006l46642
$$ y = [525305252, 523261948, 520487747, 517209282, 513554840, 509570007, 505385933, 501102676, 497074089, 493172493, 489641457, 485775795, 481318626, 477142868, 472300987, 467056046, 460647926, 453650360, 447496834, 441432228, 435532417, 429677582, 423749161, 417069397, 411338196, 405528526, 398594894, 391475143, 384274025, 379145088, 374094696, 368850822, 363910294, 360117111, 357152328, 353726540, 351427765, 349098320, 347065392, 344996681, 344129410, 343440285, 342281151, 342179070, 341810303, 341964798, 341768303, 342006836, 341364784, 341086998, 341321678, 340149269, 340348129, 340119705, 340734596, 340385475, 338793144, 338062553, 337052078, 336084862, 333901520, 332988129, 331453819, 330737572, 331742134, 331561966, 331507645, 330503654, 330196648, 329850006]
1022.3C29850006J54991m28009r47151O05698M78477J091576n8594K85110L243N2834
1031.9C31088181K15377k58255O93093j419144o91681q51135J24969J169052q23669
1040.6C29246788q69751j274300P05567J45340j30387l06854j59378L36685j358108
1049.3C26335602M66461q1825J233482J228752Q57926K016945J101341K019462O22216
1058C35800362K634124K648888K125893K189293J455764L924599J825256J615563J401634
1066.6C55621376R89113M68712p74613n08537k121201j559219k738533k331238k211227
1075.3C44834633j764412p32498j835518K56042o91528Q03604K33994p0381K078323
1084C43112259J202431K533989J448211K394982J717262R81445K018471J958733K282638
$$ y = [329850006, 330004997, 329576988, 328629837, 329235535, 329714012, 330805588, 330746994, 331032104, 331035347, 331088181, 331303558, 331045303, 331738396, 330319252, 329627571, 328776436, 328901405, 330070457, 329246788, 328377037, 327102737, 327808304, 327953644, 327823257, 327516403, 327357025, 327693710, 326335602, 326802063, 326720238, 327953720, 329182472, 330040398, 332057343, 333158684, 335178146, 335800362, 338434486, 341083374, 343209267, 345398560, 346854324, 350778923, 352604179, 354219742, 355621376, 356610489, 357079201, 356304588, 355796051, 353674850, 352115631, 349377098, 347045860, 344834633, 343070221, 342337723, 340502205, 340758247, 340066719, 340870323, 341104317, 341033936, 343112259, 344314690, 346848679, 348296890, 350691872, 352409134, 353390579, 355409050, 357367783, 359650421]
1092.7C59650421J430054K743454O82564O46858R95140M88396J200294m96864P19223
1101.4C68059540q3580L86963P13310P57332J409530Q16918J809730K58675J782036
1110C75910454J620254O76804O10924J69220J646156L82309J157150n9280N32760J630516
1119.7C84277267K84615J128349Q51708K361679N50308L50380J478577J099891J741448
1128.4C94124222K29530J137962P69234J150971R43336l31268P5455r93271m68178
1137C96637993p35359q40493j786041j788101r08585j361541j145249k282676j554299
1145.7C84235649j599159j101303j224251j958771j534462k159805o11458j248932
1153.4C72797508o97975q86269j297912j14784l43933Q26644k74963J244202J572265
$$ y = [359650421, 361080475, 363823929, 364506493, 365153351, 366148491, 366636887, 367837181, 367340317, 368059540, 367975960, 368362923, 369076233, 369833565, 371243095, 372060013, 373869743, 374128418, 375910454, 377530708, 378207512, 378818436, 378987656, 380633812, 381016121, 382173271, 382113991, 382646751, 384277267, 384561882, 385690231, 386541939, 388903618, 389453926, 389804306, 391282883, 392382774, 394124222, 394353752, 395491714, 396260948, 397411919, 398355255, 398023987, 398099442, 397106171, 396637993, 395902634, 395062141, 393276100, 391487999, 390579414, 389217873, 388072624, 385789948, 384235649, 382636490, 381535187, 380310936, 378352165, 376817703, 374657898, 374046440, 372797508, 372099533, 371213264, 369915352, 369800568, 369456635, 370283279, 370008316, 371252518, 372824783]
1162.1C72824783R67636K034417K038269L309936K879067L889503L816414L710251
1169.8C95470276L720360L563080M539146M084358M716606M066620M586182M610328
1177.5D29356956M177323M702721L816032L812866L296738L365593K876739L129387
1185.3D58534355L414879K734680L341522K515145K388305J856461J541290J619835
1193D77946472L21160N73005J111412J690254J441041P11555M91447O37436Q80890
1201.6D85804672L71475J86501k96326K48299P91168O60668O90002N90553J613541
1210.3D90660553J785622J286926M95872J34240L96995L82309M92554L14178Q05550
1219D96754799K32468k48795K25716k05918o79970j194305r68780j255951r85184m74396
$$ y = [372824783, 373792419, 375826836, 377865105, 381175041, 384054108, 387943611, 391760025, 395470276, 399190636, 402753716, 407292862, 411377220, 416093826, 420160446, 424746628, 429356956, 433534279, 438237000, 442053032, 445865898, 449162636, 452528229, 455404968, 458534355, 461949234, 464683914, 468025436, 470540581, 472928886, 474785347, 476326637, 477946472, 478267632, 478840637, 479952049, 481642303, 483083344, 483794899, 484286346, 484923782, 485804672, 486176147, 486362648, 486066322, 486314621, 487105789, 487766457, 488456459, 489047012, 490660553, 492446175, 493733101, 494228973, 494363213, 494760208, 495142517, 495635071, 495949249, 496754799, 496987267, 496738472, 496964188, 496758270, 496078300, 494883995, 493915215, 492659264, 491674080, 491199684]
1228.6D91199684j018791m72412p50504j127891q94966q61283j206512j115990l43933
1237.3D83407402m08440r6397L31573M90609N8136J07498L24745M5204K97127N78194
1247D85135651J487541J496963J746941J833763Q50449J032867J036759Q17260N20516
1255.7D95958710K85110K69699M13666J184654J697884J607361Q90732P34291P14950
1264.3E03757057J56632q1787L02047R37081O80504O50672J090661J089401J379699
1273E09961967J474572N81665l9025J13755J00135K72866P61375R10950R30519J121483
1282.7E16190262J127434R36508N93834K03094J62392M33960R21974R65195P56607
1291.3E22291260N31997K76337K30484m8294k82021n84373p20978l44810l39890j80130
$$ y = [491199684, 490180893, 489708481, 488957977, 487830086, 486935120, 486073837, 484867325, 483751335, 483407402, 482998962, 482902565, 483234138, 483724747, 483782883, 483890381, 484215126, 484260330, 484557457, 485135651, 486623192, 488120155, 489867096, 491700859, 492551308, 493584175, 494620934, 495438194, 495958710, 496243820, 496513519, 496927185, 498111839, 499809723, 501417084, 502307816, 503042107, 503757057, 503913689, 503831902, 504133949, 505071030, 505751534, 506402206, 507492867, 508582268, 509961967, 511436539, 512018204, 511979179, 512092934, 512193069, 512465935, 513227310, 514138260, 515068779, 516190262, 517317696, 518254204, 518848038, 519051132, 519213524, 519647484, 520569458, 521534653, 522291260, 522823257, 523099594, 523330078, 523281784, 522999763, 522415390, 521694412, 521349602, 521009712, 520829582]
1301E20829582L82576j7814k89765K51427L4942m54750l12423Q6517J33476k83241
1310.6E20360527o24847n77889k97851k91405k41432m57917p65457q58726j242180
1319.3E15002823m02260K85950l45421l77579k0103K27394k9183l15704j13487m08364
1328.9E13504066p32269n93147k33498l76243n12925j89514o96907j160888r36318
1337.6E08072357r68551j419602k83775J612968J042977K94494M3373o3705p5150J42708
1347.3E08398094J38588m22325k91710k8686J7738N531j84593m77715n20858m55132
1356.9E06178932p14798k75955m82826j610298j602250j122207l89481J69564j95008
1365.6D99955673p69958r34639j169358n2604J044388k17858r65919j478462k125702
$$ y = [520829582, 521212158, 521194344, 520904579, 521156006, 521190948, 520736198, 520423775, 520510292, 520643768, 520360527, 519735680, 519157791, 518859940, 518568535, 518327103, 517869186, 517103729, 516245003, 515002823, 514600563, 514886513, 514541092, 514163513, 514143410, 514370804, 514341621, 514025917, 513912430, 513504066, 512771797, 512178650, 511945152, 511568909, 511055984, 510866470, 510169563, 509008675, 508072357, 507103806, 505684204, 505400429, 507013397, 508056374, 508350868, 508394241, 508330536, 508255386, 508398094, 508536682, 508114357, 507822647, 507793961, 507811699, 507817230, 507632637, 507154922, 506634064, 506178932, 505464134, 505188179, 504705353, 503095055, 501492805, 500370598, 499981117, 500150681, 499955673, 499185715, 498251076, 497081718, 497029114, 498073502, 497855644, 496889725, 495411263, 493285561]
1374.3D93285561p93534N05600j87950j290855K61764J239891J475678R20372L83262
1382.9D95799789Q51670N52292N77316J63650P40776J914292J537781J052932J119233
1391.6E04309731P76519m54483j706657j461830R14535k3193j605759m32281J346702
1400.3E01663284J173630L53966M20761l51448r95445O76460M43153k67830o59523
1409E02457008l62587j73874k00195m00505k26669p9842q82644j561890j694603j046486
1418.6D95827713q61740K853279L080330J026955m34609l3836J956825J012878p99903
1427.3E03627892r08394j379242j055374M98733P15447k95830j77574j38703j140022
1436D99746933k544518K74086J766778j12458n19256k60697m3983N81512m81071j62812
$$ y = [493285561, 492492027, 492997627, 492809677, 491518822, 491780586, 493020477, 494496155, 495416527, 495799789, 496651459, 497203751, 497781067, 497944717, 498685493, 500599785, 502137566, 503190498, 504309731, 505086250, 504631767, 502925110, 501463280, 502377815, 502354622, 500748863, 500316582, 501663284, 502836914, 503190880, 503611641, 503260193, 502264748, 502941208, 503384361, 503116531, 502457008, 502094421, 501920547, 501720352, 501319847, 501093178, 501013336, 500130692, 498568802, 496874199, 495827713, 494965973, 497819252, 500899582, 501926537, 501491928, 501458092, 503414917, 504427795, 503627892, 502719498, 501340256, 500284882, 500783615, 501499062, 501203232, 501025658, 500886955, 499746933, 497202415, 497476501, 499243279, 499130821, 498611565, 498350868, 498306885, 498888397, 498407326, 498244514]
1445.6D98244514j012191j638298j389885N36194K86369k052078j666603j951371j480980
1454.3D87875671l010444k870789k734108k478828M521484K212296K542343K46658
1462D86304283K84805N06134k393302L031807K456398M565277M834137P201500O601333
1470.7E13392372L346863O572075O918030R237518M636764M690285O094399M373970
1478.4E59262276L262138J569557K172547K022209K533684J698799J125869P13425
1486.1E74360504r93156O49681M8561k431145R41506L541488J691361m74625q59222
1494.8E76474953k240067l086243J793862K3613p87201R25751r94606j493492p57828
1503.5E69858742j721535m733124j3611107l083076N675735L080025Q76961M78058
$$ y = [498244514, 497232323, 495594025, 494204140, 494740334, 495026703, 492974625, 491308022, 489356651, 487875671, 484865227, 481994438, 479260330, 476781502, 481302986, 483515282, 486057625, 486304283, 486589088, 487095222, 484701920, 487733727, 490190125, 494755402, 499589539, 506791039, 513392372, 516739235, 523311310, 530229340, 539466858, 544103622, 548793907, 554888306, 559262276, 562524414, 564093971, 566266518, 568288727, 570822411, 572521210, 573647079, 574360504, 573367348, 574017029, 574065590, 571634445, 572575951, 576117439, 577808800, 577334175, 576474953, 574234886, 571148643, 572942505, 572966118, 572178917, 573104668, 572110062, 570616570, 569858742, 568137207, 563404083, 549792976, 546709900, 552385635, 555465660, 556342621, 556820679]
1511.2E56820679k090416k753067r16252l517571l069496l161621M03595L428535K49977
1519.9E45394363m465599k274742K385597K344399L9215k332191L29589O37360L5095
1528.6E42093086J614456Q88939j442222j706238l542862k606544K999420J364784
1536.3E39662819n17998j868629q950539m474106O073303K144967R92126J873741L08800
1545E35244484J807060K656403J157837l40920j358719J710587L541489J759796n35393
1553.6E45642624j349030K138138K371369j479302r947395k181130J1553841Q438110
1561.4E55187225M275971K361259P28798N97153J679230J291999N4589k505532q82263
1570E62788429M598809K744064O66008Q888n60303k912483k742691L757057K763138
$$ y = [556820679, 554730263, 551977196, 551060944, 547543373, 544473877, 541312256, 541715851, 545144386, 545394363, 540928764, 538654022, 541039619, 543384018, 543423233, 541091042, 541420631, 542057991, 542093086, 543707542, 544596481, 543154259, 541448021, 537905159, 535298615, 538298035, 539662819, 539144821, 537276192, 528325653, 523851547, 529924850, 532069817, 533061943, 534935684, 535244484, 537051544, 539707947, 540865784, 540524864, 539166145, 540876732, 544418221, 546178017, 545642624, 544293594, 546431732, 548803101, 547323799, 537376404, 535195274, 546749115, 555187225, 559463196, 561824455, 562553253, 563150406, 564829636, 566121635, 566176224, 563670692, 562788429, 567387238, 570131302, 570797310, 570806198, 570245895, 567333412, 564590721, 568347778, 571110916]
1578.7E71110916P79190M85001l60947o48308k98767k88353l01513j216202j012993
1587.4E68248024j162720j335373j353187q97751j040955j327514j651078j945419
1595.1E57534027p12204j287880j611290j996803j884613k304917k366142j430626
1602.8E43939552k317772j353836k130775k632332k888069l031502k988624k502213
1610.5E24094429j147919l280830k839394l624916l051185m129753q851662J575203
1618.2D98743973r29032k203788l894234l209038m400215n659523L0022k165833k093849
1626.9D74218483m790802k871933j971970l434791k771607l447456j393814l463326
1634.6D50072784p335777k834091L11623L54766m17747M18930k070503l60756j482048
$$ y = [571110916, 571890106, 572375107, 572014160, 571365852, 571067085, 570778732, 570477219, 569261017, 568248024, 567085304, 565749931, 564396744, 563498993, 562458038, 561130524, 559479446, 557534027, 556821823, 555533943, 553922653, 551925850, 550041237, 547736320, 545370178, 543939552, 541621780, 540267944, 538137169, 535504837, 532616768, 529585266, 526596642, 524094429, 522946510, 519665680, 516826286, 513201370, 510150185, 506020432, 497168770, 498743973, 497814941, 495611153, 491716919, 488507881, 484107666, 478448143, 478478165, 476312332, 474218483, 469427681, 466555748, 464583778, 461148987, 458377380, 454929924, 453536110, 450072784, 442737007, 439902916, 440214539, 440569305, 440151558, 440570488, 438499985, 438139229, 436657181]
1643.3D36657181j62316q65631n641708j071739r85260M570656Q19015N10597j022720
1652D32808075j3100090L678207O093674N908737J644287K034340J149636J610412
1659.7D41827278J393585j28593J724052J757126M227677K423477K494468K103844
1667.4D57822914O33888J097184J445999M217567K052384L322105K665710P54815L164596
1676.1D77177162L774452L743401J339722J716270K149429L694611J581459n198059
1683.8D89978447M617767O217385N762786K381402K060737L673363L058891L806191
1691.5E21556969K730064K492523J757851L82194j385307N332489N296097L603249
1699.3E41766129K889976k112465M908180L553849J046943J01776L61519O56929K328453
$$ y = [436657181, 436494865, 435629234, 429987526, 428915787, 427930527, 432501183, 433320198, 433830795, 432808075, 419707985, 423386192, 429479866, 435388603, 437032890, 439067230, 440216866, 441827278, 443220863, 443092270, 444816322, 446573448, 450801125, 453224602, 455719070, 457822914, 458456802, 459553986, 460999985, 465217552, 467269936, 470592041, 473257751, 474012566, 477177162, 480951614, 484695015, 486034737, 487751007, 489900436, 493595047, 495176506, 489978447, 494596214, 500813599, 506576385, 508957787, 511018524, 514691887, 517750778, 521556969, 524287033, 526779556, 528537407, 528919601, 527534294, 532866783, 538162880, 541766129, 544656105, 542543640, 547451820, 551005669, 552052612, 552154388, 552515907, 553172836, 555501289]
1707.9E55501289K086296m84123L8147J179276M77371l82271j959114K22015J672783
1716.6E58351669j234092j823960O448746L767319J439590M23203j148072m58526k09198
1725.3E65556679j076470j864471j929360k224006n484429l573150j709213l867379
1733E43828201r142799q765297L38135k666321n107765n543289q716660p036171j953621
1741.7D95234413k902107n760727p75948j43928R21440J611366L538208Q402138O300926
1750.4E06425781J1293755J1580276J1680374J1247101J0271797J0027314R492531
1757.1E82018929J1753921Q791313Q214455N986748M725265P684250O105156N202598
1764.8F40482635L403855L267441J911850J021652L414764J356201j767425m32739
$$ y = [555501289, 557587585, 557103462, 557141609, 558320885, 558798256, 558415985, 556456871, 556678886, 558351669, 557117577, 555293617, 561742363, 565509682, 566949272, 567372475, 566224403, 565765877, 565556679, 564480209, 562615738, 560686378, 558462372, 552977943, 549404793, 547695580, 543828201, 534685402, 525920105, 526258240, 523591919, 518484154, 512940865, 504224205, 497188034, 495234413, 492332306, 486571579, 485795631, 485651703, 486573143, 488184509, 491722717, 500124855, 506425781, 517719536, 529299812, 540980186, 552227287, 562499084, 572526398, 582018929, 593772850, 602564163, 610778618, 616765366, 621490631, 629174881, 635280037, 640482635, 643886490, 647153931, 649065781, 650087433, 653502197, 654858398, 653090973, 652658234]
1772.5F52658234M597702M580917K267990J298523K370529Q08182M59290L69644j51139
1781.2F69259872K378769K042923N70526k92587J054382J750031K63138L57742N32761
1789.9F77917557q53119j052933j217880J897201L037339L51333j63498J818161Q94013
1798.6F82628174r11942l65219J363678J28861R29794J689835K20260O81915N30243
1807.3F86895599p0800L88488l01971q98819Q75473J403198O81153O25152M11759L54843
1816.9F90364075n7984M71878N92118j83030j08032r17129L41186K44370j757660J467972
1826.5F90457764J740493n3710k265625j683808K763367K024994J51214L14484M28772
1835.2F93877945q0872k96554K87247J160583K61002j31836q08182p44934j420746
$$ y = [652658234, 657255936, 661836853, 664104843, 665403366, 667773895, 668582077, 669041367, 669411011, 669259872, 671638641, 673681564, 674252090, 673959503, 675013885, 676763916, 677027054, 677384796, 677917557, 677064438, 676011505, 674793625, 676690826, 679728165, 680079498, 679916000, 681734161, 682628174, 681716232, 681351013, 682714691, 682843552, 683773346, 685463181, 685683441, 686365356, 686895599, 686824799, 687213287, 686911316, 686012497, 686887970, 688291168, 688972321, 689597473, 690009232, 690364075, 690306091, 690777969, 691370087, 691187057, 691079025, 690161896, 690503082, 690747452, 688989792, 690457764, 692198257, 692144547, 689878922, 688195114, 690958481, 692983475, 693134689, 693449173, 693877945, 693797073, 693500519, 693787766, 694948349, 695209351, 695077515, 694269333, 693524399, 692103653]
1843.9F92103653k570496L210602J867294q11462M36935J267014P29523j35041o179
1852.6F96091843j72882J02386L52860j6327R307l87496K93502L32184j39847o103
1862.2F96459427J47858J7623m79049o47812r64966n49240q63724L53775J844330J360779
1871.9F96679001Q48846p3013m50974k12936K95792L28369n0583P4081M37165K78015
1881.5F98153763m68216m0360l02505l64533J51368j55869L15781n95551l21884J668472
1891.2F98040466O93283p10449n86166p31507m03366Q87146M88587K77710M44870M36172
1900.8F98836746J30539m40521l45078p57217o2027P6828m74853j52131j85318K78168
1910.4F96905136O81000P73849j89056m36020k19116k74429l15018k079315L31115
$$ y = [692103653, 689533157, 692743759, 694611053, 693799591, 694236526, 695503540, 696233063, 696098022, 696091843, 695918961, 696021347, 696374207, 696357880, 696367187, 695979691, 696273193, 696605377, 696465530, 696459427, 696607285, 696624908, 696145859, 695498047, 694533081, 693983841, 693120117, 693473892, 695318222, 696679001, 697527847, 697454834, 697003860, 696790924, 697086716, 697415085, 697364502, 697438583, 697875748, 698153763, 697685547, 697645187, 697342682, 696978149, 697129517, 696973648, 697289429, 696693878, 696371994, 698040466, 698733749, 698023300, 697437134, 696705627, 696302261, 697189407, 697677994, 697955704, 698400574, 698836746, 698967285, 698526764, 698181686, 697424469, 697362442, 697439270, 696964417, 696812286, 696626968, 696905136, 697586136, 698359985, 698170929, 697734909, 697515793, 697241364, 696926346, 694847031, 695178146]
1919.1F95178146J425095K28729j64413j236954L10440J378708L13644l87039l63998
1927.8F96682358k78855k61459J1063N78155O40793j04217N8975n5466k19421k07520
1937.5F96844406m80041l88794l61634K25983j186295q50372J515274L57971K0295
1946.1F95696793L2730o0807J90888j45187M9591L04946o8359l79257J88599L52478
1955.8F96162415J00631j16043j96380l38822p31582j03837K32544K87934L28140R5139
1965.4F95720139j37787p54547j73874K92587q6136r9564n2719O638K51846L57132
1975.1F95323715K42310J47095L1280k01797o69022n77545l06320j27869J04065j03302
1984.7F93862610J93786M86222K45437n42984n70221N04532k33764j509400l33023
$$ y = [695178146, 696603241, 696831970, 696667557, 695430603, 695741043, 697119751, 697433395, 697046356, 696682358, 696403503, 696142044, 696153107, 696731262, 697372055, 697267838, 697326813, 697271347, 697051926, 696844406, 696364365, 695975571, 695613937, 695839920, 694653625, 693803253, 695318527, 695676498, 695696793, 695729523, 695668716, 695859604, 695714417, 695764008, 696068954, 696000595, 695621338, 695809937, 696162415, 696263046, 696147003, 695950623, 695611801, 694880219, 694776382, 695008926, 695296860, 695625000, 695720139, 695582352, 694827805, 694653931, 694946518, 694860382, 694760818, 694708099, 694714737, 694966583, 695323715, 695566025, 695713120, 695744400, 695542603, 694873581, 694296036, 693989716, 693861847, 693965912, 693862610, 694056396, 694542618, 694788055, 694245071, 693674850, 694179382, 693945618, 692436218, 692103195]
1993.4F92103195N92423L17230J76315K4033L13263O49109l75061p27768n22919l91007
2003F92158813l69186l36456L61099L69720J34736q164q9569k78397n93032l36533
2012.7F91013031n49316o35453j05362k136O1112M19845K90833J10321m0894p39517
2022.3F89822464j107864p77359o5689j59760j04980L44619L11966L49350j79291j82800
2032F88250656m43039p62710k98615m13437q9569p9498j9760N53970L24020l14331
2041.6F86707687m46319o49643q50067p5684k65579k81983K01340L78418O32706K03857
2051.2F85554733K75040l52554p39670m25034n43976l00903j87683N37796O85501N32150
2060.9F85035400J64643k35443L0822p99789j048508o16073M1198L58811K35367Q09326
$$ y = [692103195, 692695618, 693012848, 693189163, 693213196, 693526459, 694175568, 693800507, 693072739, 692549820, 692158813, 691789627, 691453171, 691814270, 692183990, 692318726, 692310562, 692220993, 691942596, 691349564, 691013031, 690463715, 689828262, 689722900, 689720764, 689781876, 690201721, 690492554, 690602875, 690561981, 689822464, 688714600, 687937241, 687871552, 687711792, 687606812, 687951431, 688263397, 688612747, 688433456, 688250656, 687807617, 687044907, 686746292, 686332855, 686243286, 686163788, 686144028, 686697998, 687022018, 686707687, 686261368, 685611725, 684761658, 684685974, 684420395, 684138412, 684339752, 684718170, 685350876, 685554733, 685829773, 685477219, 684737549, 684312515, 683768539, 683467636, 683279953, 683817749, 684503250, 685035400, 685200043, 684964600, 684995422, 684195633, 683147125, 682531052, 682572250, 682931061, 683166428, 683975754]
2070.5F83975754P17468K63596k40708k71835n62668o81534j63879l13797R7504J39389
2080.2F82959290K42691R04464O58799M7073m02374o05317p88803p84530m50516K12784
2089.8F81993561M72564P60956Q52661J79444n9738l78495m48532o17828n41306k33535
2099.5F81979752k20185N65033P61185O52389L23716j57090l39660o80771m05502j39847
2109.1F82339020n6992j36719J03226N10483N98297L75137r6893k67410q74787o22634
2118.7F81870728j63804j85928K01035K90146N91659L75671J59226O0806m04129m26330
2128.4F82369080l92456n25895n02929K77404N25971K47345J15967O9427J76010j55410
2138F82204514k03553l80020m54101j53733J36338K72445K63443N78995R537m43878
$$ y = [683975754, 684693222, 684956818, 684716110, 684444275, 683881607, 683200073, 683036194, 682722397, 682819901, 682959290, 683201981, 684106445, 684765244, 684812317, 684409943, 683804626, 683015823, 682231293, 681780777, 681993561, 682466125, 683227081, 684079742, 684259186, 684199448, 683820953, 683372421, 682754593, 682213287, 681979752, 681759567, 682324600, 683085785, 683738174, 684061890, 683904800, 683565140, 682884369, 682478867, 682339020, 682282028, 682145309, 682248535, 682759018, 683357315, 683732452, 683635559, 683368149, 682493362, 681870728, 681706924, 681520996, 681722031, 682012177, 682603836, 682979507, 683138733, 683199539, 682795410, 682369080, 681976624, 681450729, 680947800, 681225204, 681751175, 681998520, 682114487, 682183914, 682359924, 682204514, 682000961, 681620941, 681166840, 681013107, 681149445, 681421890, 681685333, 682264328, 682273865, 681829987]
2147.7F81829987o0044r7198l99323l05557j68610j60827K87552M65240O56662K11105
2157.3F82258987j85546J52435k78626l52020m75235l86810L45383O30569J91650L968
2167F81904755M65850J12153N188j41449j15433J5182l86505J68228K04163J77994
2176.6F82410126L50723L28827K91824j60980j06735o9885j81580m36325r7885K68249
2186.3F82596359L56369O66962J30234R5672K48871q4305k96325k91672k40402r7351
2195.9F83084412K26211L06854O30570L54462M61807K37884o74820k31247k70233k41852
2205.5F83884048J9227K38494M00315J26266L07770K47726K14768K1973K6321l41797
2215.2F85145111p68433n7373K30942K17285M32282P56454K2354m01306L8529p2785
$$ y = [681829987, 681769943, 681672745, 681273422, 680967865, 680799255, 680638428, 680925980, 681391220, 682047882, 682258987, 682073441, 682225876, 681947250, 681595230, 681119995, 680733185, 681078568, 681709137, 681900787, 681904755, 682370605, 682482758, 682487946, 682346497, 682231064, 682246246, 681859741, 682027969, 682232132, 682410126, 682760849, 683089676, 683381500, 683220520, 683113785, 683043900, 682862320, 682425995, 682328110, 682596359, 682952728, 683619690, 683749924, 683845596, 684094467, 684010162, 683713837, 683422165, 683181763, 683084412, 683310623, 683617477, 684248047, 684602509, 685064316, 685302200, 684627380, 684396133, 684125900, 683884048, 683903275, 684141769, 684542084, 684668350, 684976120, 685223846, 685438614, 685460587, 685486908, 685145111, 684376678, 684319305, 684550247, 684767532, 685199814, 685956268, 685978622, 685577316, 685615845, 685543060]
2224.8F85543060j46026l37067Q8806Q774J4343K76184j2664J88674J54572K61230
2234.5F86039886l80096n57327k46430k36740P1259j7548O26984K87628N1651M2648
2244.1F85681915n12466l60108n20401J64719J4038q9340L76892J0605K89764J83411
2253.8F85239029j76544m51279k32468k62603l17002K4338Q8501M60205R1324K00195
2263.4F84663696K14997p5150J30539k17819k75727k91290k00500j25962J25962J58615
2273F84107361K62909M02756j10093k58255p10601k15455O7139j79062q240j53656
2282.7F83204803K80915O6528K74735K10495l88337l43399l42788j20774m30374J39008
2292.3F82550812K4261l10211R1705j1596J78680l48205k16752l35693k08435k11334
$$ y = [685543060, 685397034, 685059967, 685148773, 685157547, 685171890, 685448074, 685435410, 685624084, 685778656, 686039886, 685659790, 685102463, 684856033, 684619293, 684690552, 684673004, 685299988, 685587616, 685639267, 685681915, 685169449, 684809341, 684288940, 684453659, 684467697, 684378357, 684755249, 684765854, 685055618, 685239029, 685062485, 684611206, 684378738, 684116135, 683799133, 683823471, 683911972, 684372177, 684463501, 684663696, 684878693, 684803543, 684934082, 684716263, 684440536, 684149246, 683948746, 683822784, 683948746, 684107361, 684370270, 684773026, 684662933, 684404678, 683694077, 683478622, 683545761, 683366699, 683358459, 683204803, 683485718, 683552246, 683826981, 684037476, 683649139, 683305740, 682962952, 682842178, 682411804, 682550812, 682575073, 682264862, 682356567, 682344971, 682523651, 682175446, 681958694, 681623001, 681414566, 681203232]
2302F81203232q18558j78986m52194L15399J21155o68182J2359k03170o5537n61752
2311.6F78703766q6746J44043p01294k79007K04162M6082r93118q69065o15463q74634
2321.3F74678726o37817J75171o87o08444N71442j19629o06842l71170m30146j099701
2330.9F71550903r24759Q58155l22113J63879L25546M30603O86112j083756n9051o12869
2340.6F71012650j023636j6404P81937R01337l9826J19477l33481J022949J259842
2349.2F73684845m21066j378556j578216q69827q25959j027221p41349j37329M71268
2357.9F67176590j308441j794205N23453J907577R0180j385040J0757N83725j13602
2366.6F65690994L87345N01937L57209J190643J702118P64389p88727j11160M32587
$$ y = [681203232, 680384674, 680205688, 679753494, 680068893, 680190048, 679521866, 679534225, 679331055, 679265518, 678703766, 678617020, 678761063, 678059769, 677780762, 677984924, 678031006, 677037888, 676168823, 675553360, 674678726, 674040909, 674216080, 674215393, 673606949, 674178391, 674058762, 673451920, 673080750, 672650604, 671550903, 670626144, 671484299, 671162186, 671326065, 671651611, 672082214, 672768326, 671684570, 671625519, 671012650, 669989014, 669972610, 670754547, 671655884, 671616058, 671735535, 671402054, 672425003, 673684845, 673263779, 671885223, 670307007, 669437180, 668611221, 667584000, 666842651, 666705322, 667176590, 665868149, 664073944, 664597397, 666504974, 666595154, 665210114, 665220871, 665804596, 665690994, 666078339, 666580276, 666937485, 668128128, 669830246, 670594635, 669805908, 669694748, 670127335]
2375.3F70127335J61056O96564P94830P07092J91040m3258M22516N30319R3613J77841
2384.9F73858948K61001n36956k58484J65405n0507M2115K8076p4692j08109m6386
2394.6F73280411l84369k70691j07269k41318k10877q4304K47497l58429o3858K35596
2404.2F72042389n19867l90167l73459k32544l51029l16696l2119Q239L24250R1629
2413.8F70250626K4032l36227p03202m69589l07998j49002k00806j78375j56479J44882
2423.5F67917862K45285J01166j36872q33969j083526n98679K55356L48434L3341j05591
2433.1F66142807n8136K3575m95529n59311l40424k55432l40881l29743k2964k07749
2442.8F63556213l01818J73187M13284l72696n62363k42156m80195l74679l47366q9570
$$ y = [670127335, 670288391, 670984955, 671779785, 672486877, 672677917, 672634659, 673057175, 673587494, 673681107, 673858948, 674119949, 673582993, 673324509, 673489914, 673439407, 673481522, 673509598, 673434906, 673326797, 673280411, 672896042, 672625351, 672518082, 672276764, 672065887, 671981583, 672229080, 671870651, 671806793, 672042389, 671522522, 671132355, 670758896, 670526352, 670175323, 669858627, 669826508, 669834747, 670158997, 670250626, 670274658, 669938431, 669235229, 668765640, 668457642, 668308640, 668107834, 667929459, 667772980, 667917862, 668163147, 668264313, 668127441, 667293472, 666209946, 665611267, 665866623, 666215057, 666248398, 666142807, 666084671, 666108246, 665612717, 665053406, 664712982, 664457550, 664116669, 663786926, 663763962, 663556213, 663254395, 663427582, 663840866, 663468170, 662905807, 662663651, 662183456, 661808777, 661461411, 661371841]
2452.4F61371841J59760R8038k67029n62134k73437k76947P400j47934p54700m20990
2462.1F58933868L6469k0218j55716j27411o8970Q9188j92795k62222k26135m74625
2471.7F57531433j59759j18485o1951R8343j91040o73828n29785J59912o87k60620
2481.3F55793533l26156n85099m74166J96762K88467l11050l00446q926k29m31671
2491F53841019k78168j63574m22440n8975J06659L19061M120k63748k32849l22800
2500.6F52528305j42746m32587k16980j9760R9640n1422l58505L07922J58386k74887
2510.3F51597366m58450m43344m24957n15290o7215p8277Q6975K20184M0207p7667
2519.9F49879532l34854l97949l89023k83203k97394J18026K97699o6299l15933p11670
$$ y = [661371841, 661531601, 661629639, 661362610, 660800476, 660527039, 660250092, 660257492, 660109558, 659354858, 658933868, 658970337, 658950119, 658794403, 658666992, 658598022, 658687210, 658494415, 658232193, 658006058, 657531433, 657371674, 657253189, 657191238, 657289581, 657098541, 656424713, 655894928, 656054840, 656054153, 655793533, 655467377, 654882278, 654408112, 654604874, 654893341, 654582291, 654281845, 654272919, 654272690, 653841019, 653562851, 653399277, 652976837, 652917862, 653024521, 653343582, 653347702, 653083954, 652851105, 652528305, 652385559, 651952972, 651735992, 651716232, 651815872, 651764450, 651405945, 651713867, 651872253, 651597366, 651138916, 650695572, 650270615, 649755325, 649688110, 649609833, 649696808, 649916992, 649957199, 649879532, 649544678, 649146729, 648757706, 648474503, 648177109, 648295135, 648592834, 648526535, 648210602, 647498932]
2529.6F47498932l76816J76239j21918o26907l01132R0103o180p7591k51694l23486
2539.2F45679550n78842k40479M03519N264o46362n76782j65024j21765n6686j12381
2548.9F43590012N8136j79978o92825k20795k48947j89362j6708j37405J77612j49612
2558.5F41990128n63355m48151k45819M0207N8365l00979l32261k55966k48375l17116
2568.1F39376678l42636J14518j60141j45226j12762n49469j52893m24271k80914j10932
2577.8F37211952n79986j58005k0790k16141k67601Q9645K45095m14315p07931j45912
2587.4F35036011J9722l95127j20506j6403j01509k29912m82674k05040j63002l10325
2597.1F33031235k48184j62774m41932k42119J76582k30446m98809k94953J01090l14408
$$ y = [647498932, 647122116, 647298355, 647176437, 646549530, 646248398, 646338501, 646332321, 646254730, 646003036, 645679550, 645100708, 644860229, 645263748, 645269012, 644622650, 644045868, 643880844, 643759079, 643702393, 643590012, 643648148, 643468170, 642775345, 642554550, 642305603, 642116241, 642099533, 641962128, 642139740, 641990128, 641426773, 640978622, 640732803, 640773010, 640831375, 640530396, 640198135, 639942169, 639693794, 639376678, 639034042, 639148560, 638988419, 638843193, 638730431, 638180962, 638028069, 637603798, 637322884, 637211952, 636631966, 636473961, 636453171, 636237030, 635969429, 636059074, 636304169, 635889854, 635181923, 635036011, 635055733, 634660606, 634540100, 634523697, 634422188, 634192276, 633709602, 633504562, 633341560, 633031235, 632783051, 632620277, 632178345, 631936226, 632112808, 631882362, 631383553, 631088600, 631189690, 630875282]
2606.7F30875282o65092l86887l32794j17836k64053k64740k54898k83699R7961L967
2616.4F28407211n07202q20045k06147K55394k61955o51436m70733k68517l13492l70025
2626F24793053m00620l21197n31464m06227k21024m61158k18544k75650n30587n82008
2635.6F20844574n10216k07519k64054o98280n90286j03188k36969j50108l32832o32096
2645.3F17119026k47612l56293m42810m11338j49346J70708k22778n91202p57561o49033
2654.9F13461761j28822k212m56887l12004j57280m18091l53050l20740l47862m96940
2664.6F10467873l65487m03251n79186l02581k54403l08189l42255p7362k2812l10859
2674.2F07501488m58336k00195o6758p49435n42183l04489j76506J83906l80325l58353
$$ y = [630875282, 630210190, 629823303, 629490509, 629372673, 629108620, 628843880, 628588982, 628305283, 628403244, 628407211, 627900009, 627079964, 626873817, 627129211, 626867256, 626215820, 625745087, 625476570, 625163078, 624793053, 624392433, 624071236, 623539772, 623133545, 622912521, 622451363, 622232819, 621957169, 621426582, 620844574, 620334358, 620126839, 619862785, 619164505, 618574219, 618471031, 618234062, 618083954, 617751122, 617119026, 616871414, 616515121, 616072311, 615660973, 615511627, 615682335, 615459557, 614868355, 614110794, 613461761, 613332939, 613330727, 612873840, 612561836, 612404556, 611986465, 611633415, 611312675, 610964813, 610467873, 610102386, 609699135, 609119949, 608817368, 608562965, 608254776, 607912521, 607835159, 607812347, 607501488, 607043152, 606842957, 606776199, 606026764, 605484581, 605180092, 605003586, 605187492, 604807167, 604448814]
2683.9F04448814j28707m654k43264p79915n61981n17235l30886L7803J91727r9831
2693.5F02011871n97229l68309k44178m55971k72789k40746k33993J43509l07503m53720
2703.1E98980942j18256n13267l05596m68101o90460L1623o8130m29421j84326k04735
2712.8E96030273n60684o62575n11970l56789l83453l91426l71742l0823J00746r41734
2722.4E91919823j013108Q7586L47442j38092l06243k39907p34215o64901j66588k13890
2732.1E88877907m84543m02794j26953o7139Q8043l67164m28162k10800n31502k07176
2741.7E86139717j00174q1329j03073k59018j00785m20303n93643k18048p5646m48112
2751.4E83739586o70548m96406k14386k4223j08986m01001l70293j60904n36156l74832
$$ y = [604448814, 604320107, 604315453, 604072189, 603292274, 602730293, 602213058, 601882172, 601919975, 602111702, 602011871, 601414642, 601046333, 600802155, 600346184, 600073395, 599832649, 599598656, 599742165, 599434662, 598980942, 598862686, 598349419, 598043823, 597575722, 596885262, 596916885, 596848755, 596419334, 596235008, 596030273, 595469589, 594807014, 594295044, 593938255, 593554802, 593163376, 592791634, 592760811, 592861557, 591919823, 590906715, 590994301, 591341743, 591203651, 590897408, 590657501, 589923286, 589258385, 589091797, 588877907, 588393364, 587990570, 587863617, 587796478, 587884521, 587517357, 587089195, 586878395, 586346893, 586139717, 586039543, 585958214, 585855141, 585596123, 585495338, 585075035, 584481392, 584263344, 584187698, 583739586, 583069038, 582572632, 582358246, 582334023, 582225037, 581824036, 581453743, 581292839, 580756683, 580381851]
2761E80381851n3139j12037j82457m85535k76832k74582j36872j97029o06766k02293
2770.7E77854309j29623l52173n76668k45438j19896o27365o13899m56009R0142j565
2780.3E74821815l22189l95393p99484o23665n52101o11535k98614p4196o08215q20923
2789.9E69715500l85361l95126m59404o85501m73938l72925m35677m84924r84917m24347
2799.6E64613380j87263o60057p33185p15446o65055r56306q05245n41687p07473o38199
2809.2E58003464o24810j001052j021309o89926p88651p94029p23305r65881j372566
2817.9E50021935j339226r30939q63914q32100j016541j413269j708946j569977j228752
2826.6E39118271j233940j489258k211418k374764j609535j423073k231331k465591
$$ y = [580381851, 580328712, 580216675, 580034218, 579548683, 579271851, 578997269, 578860397, 578663368, 578056602, 577854309, 577724686, 577372513, 576795845, 576550407, 576430511, 575803146, 575189247, 574733238, 574823380, 574821815, 574499626, 574104233, 573304749, 572681084, 572128983, 571517448, 571218834, 571144638, 570536423, 569715500, 569330139, 568935013, 568475609, 567790108, 567316170, 566943245, 566507568, 566022644, 565037727, 564613380, 564426117, 563766060, 563032875, 562317429, 561652374, 560696068, 559890823, 559349136, 558641663, 558003464, 557378654, 556377602, 555356293, 554666367, 553877716, 553083687, 552360382, 551394501, 550021935, 548682709, 547751770, 546887856, 546055756, 545039215, 543625946, 541917000, 540347023, 539118271, 537884331, 536395073, 534183655, 531808891, 530199356, 528776283, 526544952, 524079361]
2834.3E24079361j992836k122536k573776l348465l740654m011459m721108n156021
2842D96412506o203995p093467p677460q669739r265137r786338r927941r851837r461365
2850.7D18475227p934036n862656l920555k068977L43361K270508L651008M822235
2858.4D09776115N594063N900192N581322N498886M914894M182434L787575K736664
2866.1D47972145J631851J000939J68228m78401l90816j63574L40614R13391J049347
2874.8D52043724P24831M17785N12390M79775K38838m72221q07190m03900m60434j141091
2884.4D51132507j691017j653824j677055j616249j644859j837006k202492k738533
2892.2D36071472k382164k229805k250404k020874j949082k098579k688675k484245
$$ y = [524079361, 522086525, 519963989, 517390213, 514041748, 510301094, 506289635, 501568527, 496412506, 490208511, 483115044, 475437584, 466767845, 457502708, 447716370, 437788429, 427936592, 418475227, 410541191, 404678535, 400757980, 398689003, 399032364, 401302872, 404953880, 409776115, 415370178, 421270370, 426851692, 432350578, 437265472, 441447906, 445235481, 447972145, 449603996, 450604935, 450773163, 450294762, 449903946, 449740372, 450080986, 450994377, 452043724, 452768555, 453186340, 453698730, 454178505, 454417343, 453945122, 453137932, 452734032, 452273598, 451132507, 449441490, 447787666, 446110611, 444494362, 442849503, 441012497, 438810005, 436071472, 433689308, 431459503, 429209099, 427188225, 425239143, 423140564, 420451889, 417967644]
2899.9D17967644k520485k973862l096199l364868l458481l640060l365631l537026
2907.6C92011032m263801m739838n305100n769538o173707o208076o660156o746063
2915.3C46144753o954995p853126p478447p341423p053509o078587n069160l835812
2923B94479694k523155j505241q69656M69532J428089K168103K779464L610936M430141
2931.7C04467907M637814N531253N754032N992852O328087O285896O554375O426467
2939.4C51978683O145478N950966N935440N083122M412003M846344M321632L140488
2947.1C91814156K638473K494621J577721P31506Q40569M53911j2741K67448N54810
2955.8D01360474Q95004J308746K014733K807769K768402L043557L502617L716392
$$ y = [417967644, 415447159, 412473297, 409377098, 406012230, 402553749, 398913689, 395548058, 392011032, 387747231, 383007393, 377702293, 371932755, 365759048, 359550972, 352890816, 346144753, 339189758, 331336632, 323858185, 316516762, 309463253, 303384666, 298315506, 294479694, 291956539, 290451298, 289581642, 290051174, 291479263, 293647366, 296426830, 300037766, 304467907, 309105721, 314636974, 320391006, 326383858, 332711945, 338997841, 345552216, 351978683, 358124161, 364075127, 370010567, 375093689, 379505692, 384352036, 388673668, 391814156, 394452629, 396947250, 398524971, 399256477, 400097046, 400550957, 400538216, 400805664, 401360474, 402255478, 403564224, 405578957, 408386726, 411155128, 414198685, 417701302, 421417694]
2963.5D21417694M413757M288178M075775M530296M290085L921128M183578M193611
2971.2D55314102L873787L889847L924637L385658K831306K814217K383156K055931
2979D80472641K244110K560387K691459J989251J727600J787071J555557J096993Q24470
2987.6D96949539J237984J350670J077232K35939P5913L92799r2964J8616R5939l33404
2997.3E01008263j040039j488419j204376j103707j279983j411781j380463j673775
3005D90425720j369171q37212j024436l90358J3160J04752J003837J229363Q24356
3013.7D89980011J280746J971817J865006J579628J227722J037293R46006P40357J000252
3022.4E01628838J101226M79050J22147J20544o2218L47710M13971k98500o62460r28383
$$ y = [421417694, 425831451, 430119629, 434195404, 438725700, 443015785, 446936913, 451120491, 455314102, 459187889, 463077736, 467002373, 470388031, 473219337, 476033554, 478416710, 480472641, 482716751, 485277138, 487968597, 489957848, 491685448, 493472519, 495028076, 496125069, 496949539, 498187523, 499538193, 500615425, 500851364, 500927277, 501320076, 501227112, 501245728, 501341667, 501008263, 499968224, 498479805, 497275429, 496171722, 494891739, 493479958, 492099495, 490425720, 489056549, 488219337, 487194901, 486804543, 486817703, 486922455, 487926292, 489155655, 489980011, 491260757, 493232574, 495097580, 496677208, 497904930, 498942223, 499888229, 500628586, 501628838, 502730064, 503209114, 503331261, 503451805, 503389587, 503737297, 504151268, 503852768, 503190308, 502261925]
3032E02261925o97632O4392K31590m09775l83605k70691o59981k24648m86717r61609
3041.6D98463249l09028l39699o60897n86051q02269o12221k14157o74248j070442
3050.3D93194237r53408p08274l52364l43513q03414j062469n84488l30162q06504
3059D87249641j195678p32003m27055q62884o01960k98957l27797m61388q18787p32689
3068.6D80790443p03620o06499n95207n87693m58793o58379o49567p23190o85196m88014
3078.3D74634285n45120m46167l41721n08346r16634j039772m47617j58615p12089
3087D69518204q34542o50863m74320l62816q09974q88939p60574p87964q12760n37643
3096.6D62597809J449r7999o38657r02595n57938r17320j057930k46582n39932q17299
$$ y = [502261925, 501564293, 501628685, 501860275, 501450500, 501066895, 500796204, 500136223, 499911575, 499424858, 498463249, 498154221, 497814522, 497153625, 496567574, 495765305, 495153084, 494938927, 494264679, 493194237, 492240829, 491532555, 491180191, 490836678, 490033264, 488970795, 488386307, 488056145, 487249641, 486053963, 485321960, 484894905, 484032021, 483430061, 483131104, 482803307, 482341919, 481523132, 480790443, 480086823, 479480324, 478885117, 478297424, 477838631, 477180252, 476530685, 475807495, 475122299, 474634285, 474089165, 473642998, 473301277, 472792931, 471876297, 470836525, 470388908, 470230293, 469518204, 468683662, 468032799, 467558479, 467195663, 466385689, 465496750, 464736176, 463948212, 463135452, 462597809, 462599258, 462501259, 461862602, 460960007, 460402069, 459484749, 458426819, 458180237, 457640305, 456823006]
3106.2D56823006n89333o75392p54395p33490p85827o08940m34723q33206p46384j029816
3115.9D49631500j061477k46354k93884m20341p04155j024514j169395r26933o54679
3124.6D43129768j045494r33342o82258l13187k15797n54695j164208j749649p84607
3133.3D35686531N7144l29208j060295j006813n52788p50885p53098r33265q35877
3141.9D29521446p70683o62994o53916j454964r35821l05786n71556q14286j076889
3150.6D22274551r28382q27561q02917n65377k34642p62748j526680j330834q72307
3159.3D14423103l74374n44815r32274q01849o43502o82029j263543j106300l76129
3168D07698288p94716j263428j060981n64766k81983p10068r13543j108666j098709
$$ y = [456823006, 456233673, 455558281, 454803886, 454070396, 453284569, 452675629, 452240906, 451407700, 450661316, 449631500, 448570023, 448323669, 448029785, 447609444, 446905289, 445880775, 444711380, 443784447, 443129768, 442084274, 441150932, 440468674, 440155487, 439939690, 439384995, 438220787, 436471138, 435686531, 435743675, 435414467, 434354172, 433347359, 432794571, 432043686, 431290588, 430357323, 429521446, 428750763, 428087769, 427433853, 425978889, 425043068, 424737282, 424165726, 423351440, 422274551, 421346169, 420518608, 419715691, 419150314, 418915672, 418152924, 416626244, 415295410, 414423103, 414048729, 413503914, 412571640, 411769791, 411126289, 410444260, 409180717, 408074417, 407698288, 406903572, 405640144, 404579163, 404014397, 403732414, 403022346, 402108803, 401000137, 399901428]
3176.6C99901428p57255j047554o32553j59150o83441j204910j249504q08678r16138
3185.3C92442245r71946l94631m98619q53119o45713n85671q81882j169967r84803
3194C85455894n63659p44553o03905p34977j021118n33410p54394q45795p79533n53360
3203.6C78321190l87154q69941p38144q09822o58036p82089j131477n88494n62400
3212.3C71793633n69649j020699j237221l41377L8338m65889j099205r85832p58858
3221C65353241p70798o54945m42467m18205m35753n56374r10797o60591m88548n79071
3230.7C59435692p81937p73582n37110p84683q51440j020165p86629l41453n58586
3239.3C53000107r91059j022033m69666k83088k08893n45769p22923j030617j612434
$$ y = [399901428, 399144173, 398096619, 397464066, 397304916, 396621475, 395416565, 394167061, 393358383, 392442245, 391470299, 391075668, 390577049, 389723930, 389078217, 388492546, 387610664, 386440697, 385455894, 384892235, 384147682, 383543777, 382808800, 381787682, 381254272, 380499878, 379654083, 378874550, 378321190, 377934036, 377064095, 376325951, 375516129, 374858093, 374076004, 372944527, 372356033, 371793633, 371223984, 370203285, 368966064, 368624687, 368663025, 368197136, 367097931, 366112099, 365353241, 364582443, 363927498, 363485031, 363066826, 362631073, 362074699, 361163902, 360503311, 360014763, 359435692, 358653755, 357880173, 357343063, 356558380, 355706940, 354686775, 353900146, 353558693, 353000107, 352009048, 350987015, 350517349, 350234261, 350025368, 349479599, 348756676, 347726059, 346113625]
3248C46113625n92003k05880o01043m73290k25410l41187r20181o41937n79338q24280
3257.7C40709076p85942o61926o88134p67555m69284o81877m83551l63045p30209o04859
3267.3C34472694p39555p73888m41818l83529q74062o08368k8114n27802r23462q18443
3276.9C28353653o09016n25856k22283k22893m62303m97627o50101o26335p16705m06380
3286.6C23414154n47638j102104o39114k61193k47192n15289o35605j59836J43261
3295.3C19449444m72412r77764m30298l7174N2776l01457n50785k91156j73722j46866
3304.9C16120586n58300n44681n10559q23193n75161o26278l51944m1465p26433q81367
3314.6C10481205m66137l12500k35195k67296k43301l50323n00488m08326o01825o84834
$$ y = [346113625, 345521622, 345315742, 344714699, 344241409, 344015999, 343674812, 342754631, 342112694, 341533356, 340709076, 339923134, 339261208, 338573074, 337805519, 337336235, 336654358, 336170807, 335807762, 335077553, 334472694, 333733139, 332959251, 332517433, 332133904, 331259842, 330651474, 330623360, 330095558, 329172096, 328353653, 327744637, 327218781, 326996498, 326773605, 326311302, 325813675, 325163574, 324537239, 323820534, 323414154, 322866516, 321764412, 321125298, 320864105, 320616913, 320101624, 319466019, 319306183, 319449444, 318977032, 317999268, 317568970, 317531796, 317584572, 317283115, 316732330, 316441174, 316267452, 316120586, 315562286, 315017605, 314507046, 313683853, 313108692, 312482414, 312130470, 312089005, 311362572, 310481205, 310015068, 309702568, 309467373, 309200077, 308956776, 308606453, 308105965, 307697639, 307095814, 306410980]
3324.2C06410980q5487j90182j081638p05204l04814n78098l29723n86167r30824p80792
3333.8C00838051R4871M03004r91955j119785l82805m34055m25053l80115l38002l03974
3343.5B96960182m27990o39839n79872l60069k43359k95734k82879n74112p78790m10175
3353.1B92367363n90916n34095n71366q26626n85651o08521m78801o29502o60267m40006
3362.8B86441612l35693l79753n13420J34868J3180r56936j377392q31871n09948o22483
3372.4B81062164p6446k67925m88167m00505m03538m90933o91032l44753p34062p29886
3382.1B76434917j71871l96671n49126l80039k52933j74008j17912m49085l8395J1291
3391.7B73916168o50310n36499l20492N6972k33535l94421l83492m71744J92013J4667
$$ y = [306410980, 306325493, 306135311, 305053673, 304348469, 304043655, 303465557, 303135834, 302549667, 301618843, 300838051, 300932922, 301335926, 300343971, 299224186, 298841381, 298407326, 297982273, 297602158, 297264156, 296960182, 296532192, 295892353, 295312481, 294952412, 294709053, 294413319, 294130440, 293556328, 292777538, 292367363, 291776447, 291242352, 290670986, 289844360, 289258709, 288650188, 288171387, 287541885, 286881618, 286441612, 286105919, 285726166, 285212746, 285347614, 285360794, 284403858, 283026466, 282194595, 281684647, 281062164, 280985718, 280717793, 280229626, 279829121, 279425583, 278934650, 278243618, 277898865, 277164803, 276434917, 276263046, 275866375, 275317249, 274937210, 274684277, 274510269, 274392357, 273943272, 273904877, 273916168, 273265858, 272729359, 272408867, 272465839, 272232304, 271837883, 271454391, 270982647, 271174660, 271189327]
3401.3B71189327m35409l50914K0389o5574k24228J60503j16196o87885m89712M01211
3411B69401512L17936l20492l11393L09257J96838p36560k19212K86999M81815k2316
3420.6B69384384o93264j61705l88298j144L81393K20413O1951k10457M5338L14255
3430.3B68952866N42183j08376J74007O61812L1395K81315L14369J82915o7692k63729
3439.9B70701065K93064L85933J42365O60038O50749K56424M44526j13182M29612M86087
3449.6B74336681j57413N25169P43809J015797N22823J75381N13515L17440N78079
3458.2B78571281M64211M0970j6175R10893J044540O07052Q41980N34096L54557K28920
3467.9B83582325P29179N02701L54099J015034O00548O90002O05412N92766P00054
$$ y = [271189327, 270753918, 270403004, 270423393, 270357819, 270133591, 270294094, 270177898, 269490013, 269000301, 269401512, 269719448, 269398956, 269087563, 269396820, 269593658, 268857098, 268637886, 268924885, 269406700, 269384384, 268691120, 268529415, 268141117, 268139973, 268521366, 268741779, 268803730, 268593273, 268638611, 268952866, 269495049, 269386673, 269560680, 270222492, 270253887, 270535202, 270849571, 271032486, 270964794, 270701065, 270994129, 271380062, 271522427, 272182465, 272833214, 273089638, 273534164, 273420982, 273850594, 274336681, 274179268, 274704437, 275448246, 276464043, 276986866, 277162247, 277675762, 277993202, 278571281, 279035492, 279076462, 279060287, 279971180, 281015720, 281622772, 282464752, 282998848, 283353405, 283582325, 284311504, 284814205, 285168304, 286183338, 286783886, 287473888, 288079300, 288672066, 289372120]
3476.6B89372120N81970O03581L52077M81205K09999L42541R47609J471138J282177
3485.2B95644417N02376M01822K71167Q18501J017380R60807P03392J97659O55804
3493.9C01173325R99374J044216N74551O70280Q87528Q31871J167011O01730K27585
3502.6C08177471N86796R43088J191750J040382M28963O23703O10733L87650J624145
3511.3C15614681J261196O69957M51240M93660J427593R44405Q30078J166611J071586
3520C23931007P91703P46612Q09212j0529N73655J933937J752891q0185k26822O81000
3529.6C30902481J308060J530227J143494J864166J106606P30362O24237N06859K012291
3538.3C41728783J073799N76706R32769J257744J260567N56908N55076P28760J318932
$$ y = [289372120, 289954090, 290557671, 290909748, 291390953, 291600952, 291943493, 292891102, 294362240, 295644417, 296146793, 296548615, 296819782, 297638283, 298655663, 299616470, 300319862, 300517521, 301173325, 302172699, 303216915, 303791466, 304461746, 305349274, 306181145, 307348156, 307949886, 308177471, 308764267, 309707355, 310899105, 311939487, 312368450, 312992153, 313602886, 313990536, 315614681, 316875877, 317545834, 317997074, 318490734, 319918327, 320862732, 321692810, 322859421, 323931007, 324722710, 325469322, 326278534, 326268005, 326841660, 328775597, 330528488, 330448303, 330221481, 330902481, 332210541, 333740768, 334884262, 336748428, 337855034, 338585396, 339209633, 339716492, 341728783, 342802582, 343379288, 344312057, 345569801, 346830368, 347387276, 347942352, 348671112, 349990044]
3547C49990044J04599J719627K613678J146317R98230J48658J648140J422158Q77265
3555.6C60668716J096116N00183J124801O88057J374665J119766J493454R44214O64978
3564.3C69674950L301277K56843L357P17430J405182M078560K036781J258927J586113
3573C84319420J973839J537552J679687K003288O30684K104302J655159J423378K053985
3581.7C99381294J413956J433182J212082L027687R16977o84929J585808L67507L557511
3590.4D12211075L378639K333679J012192N29137K229194J49956K779884K765923M30336
3599D27820015K680016J423873J118432K317504K094002K326737K348442O12068p06101
3607.7D42034988L528710K20794P73888N727806Q6022r90181K837562N71594M668313
$$ y = [349990044, 350094643, 351814270, 354427948, 355574265, 356572495, 356721153, 358369293, 359791451, 360668716, 361764832, 362265015, 363389816, 364077873, 365452538, 366572304, 368065758, 369009972, 369674950, 372976227, 373233070, 373236427, 373953857, 375359039, 379437599, 381474380, 382733307, 384319420, 386293259, 387830811, 389510498, 391513786, 392144470, 394248772, 395903931, 397327309, 399381294, 400795250, 402228432, 403440514, 406468201, 407385178, 406700249, 408286057, 408653564, 412211075, 415589714, 417923393, 418935585, 419464722, 421693916, 421843872, 424623756, 427389679, 427820015, 430500031, 431923904, 433042336, 435359840, 437453842, 439780579, 442129021, 442741089, 442034988, 445563698, 445784492, 446558380, 452286186, 452372208, 451382027, 454219589, 454791183, 459459496]
3616.4D59459496L682861n34287K270699Q90121L95127L123092K860299J310386J518631
3625.1D74976425J163674J630210M363137l328629n815811N966148N615998N042724
3632.8D89613876J083069N0354L021889K556152J626511M49066J283531J605072J969261
3641.5E03258781J336060L41415J516800K191773L178787k681274j365242M685745
3649.2E12462845j307945j217614J705552N614700L785400L153725L399429o246109
3656.9E21349983K594033N068702J293450J153564Q60634J861114N92614J194801J065750
3665.6E37034645K01950L085671K81028j861267J79978l630638L673858O855164M154968
3674.3E49975357o185112j0697136O308174Q313637L994980j780663R02214K701798
$$ y = [459459496, 463142357, 462608070, 464878769, 465768890, 466164017, 469287109, 472147408, 473457794, 474976425, 476140099, 477770309, 482133446, 478804817, 472989006, 478955154, 484571152, 489613876, 490696945, 490747299, 493769188, 496325340, 497951851, 498400917, 499684448, 501289520, 503258781, 504594841, 504936256, 506453056, 508644829, 511823616, 509142342, 507777100, 512462845, 511154900, 509937286, 511642838, 517257538, 521042938, 524196663, 527596092, 521349983, 523944016, 529012718, 530306168, 531459732, 532320366, 534181480, 534774094, 535968895, 537034645, 537236595, 540322266, 540603294, 538742027, 538922005, 535291367, 538965225, 545820389, 549975357, 543790245, 533093109, 539401283, 547714920, 551709900, 549929237, 550831451, 553533249]
3682E53533249J263885N74837J16387l6812K210998L396683p050095j285171O016731
3690.6E58740692k656212J564026M024620Q41828J662597K2278P4730J167412L0060
3699.3E65472031J633262J038666m539032q0986M506493R11407p49817m043K521209
3708E70709190K365952p320137K280464K436867q328324M693566M302597P32612L39127
3716.7E72211914J283608K74009k409668J601830L778610m315376l047867L646240
3724.4E73023300J08566Q8654k298698K47383L554001J361770L472023n293388l901596
3733.1E70362015P706375k728119p547913K026749K394791J121063K866936J510086
3740.8E77711983k781716L474617P574959j3089638r638023J0007019M387779L496437
$$ y = [553533249, 554797134, 555371971, 555488358, 555451546, 557662544, 561059227, 554009132, 552723961, 558740692, 556084480, 557648506, 561673126, 562514954, 564177551, 564199829, 564274559, 565441971, 565472031, 567105293, 568143959, 563604927, 563523941, 568030434, 568941841, 568192024, 568187981, 570709190, 573075142, 565755005, 568035469, 570472336, 562144012, 566837578, 571140175, 571872787, 572211914, 573495522, 573769531, 571359863, 572961693, 576740303, 572424927, 569377060, 573023300, 573131866, 573220520, 570921822, 571169205, 574723206, 576084976, 579556999, 574263611, 570362015, 578068390, 575340271, 567792358, 569819107, 572213898, 573334961, 576201897, 577711983, 574930267, 578404884, 585979843, 572890205, 563252182, 573259201, 577646980, 581143417]
3748.5E81143417n237236q540001R303780k822380k204514N634346L527375K024727
3756.2E82829514m318009J799622L658714n582542n03617L183785Q20198P81631K210923
3764.9E84880219l434258k072525L169403K950058q73566o259956K061424K549248
3772.6E82970047P29790Q92639K78702P22809m39225J818314j199265n473900K518616
3781.3E82818527J710549Q68072M71535k831307J38627J976699J189804K68212l42674
3790E86268044L20320J43776l52478p13540P66030Q02192m473686j460952K644233
3798.7E83943939K069092J712265p331848n345535N578918L672104L726158L146401
3806.4E91171494q934670j655693N175705J866836L96843j80397l65142J080131K869415
$$ y = [581143417, 575906181, 567366180, 576669960, 573847580, 571643066, 577277412, 580804787, 582829514, 578511505, 580311127, 583969841, 578387299, 577883682, 581067467, 581887665, 582669296, 584880219, 581445961, 579373436, 582542839, 585492897, 584619331, 578359375, 580420799, 582970047, 583699837, 584592476, 584871178, 585593987, 585154762, 586973076, 585773811, 580299911, 582818527, 584529076, 585397148, 585868683, 583037376, 583176003, 585152702, 586342506, 586610718, 586268044, 586588364, 586732140, 586379662, 585666122, 586432152, 587234344, 582760658, 581299706, 583943939, 586013031, 587725296, 580393448, 575047913, 580626831, 584298935, 588025093, 591171494, 582236824, 580581131, 585756836, 587623672, 588020515, 587840118, 587474976, 588555107, 591424522]
3815.1E91424522n181503r812050O116600M816857L019447q33092j3864975L726349
3822.8E79412155N538864K195778J529656k068863l544312J837998K300300K045861
3830.5E89247437m80500o711845L420296M599952p476768l67546O549453o779327k518005
3839.2E79483147O211433l208656J078949M612465k856484j431122K862740J197891
3846.9E87950363M6196N83840k342873Q67157L302002n694504K459488j1441917K148399
3855.6E77878151Q817100o40907l20167K014694J583710J064720m443207M68712L344116
3864.2E89766922n469093k588120M005165L889771K499351q908043n673828N597077
3871.9E83119202N582122J612587p047615P73392L407707L56255J171760J657906o226921
$$ y = [591424522, 586243019, 576430969, 582547569, 587364426, 590383873, 589550781, 575685806, 579412155, 584951019, 587146797, 588676453, 586607590, 583063278, 584901276, 587201576, 589247437, 588766937, 582055092, 585475388, 590075340, 582598572, 582231026, 588780479, 582001152, 579483147, 585694580, 582485924, 583564873, 588177338, 585320854, 583889732, 586752472, 587950363, 587996559, 588580399, 586237526, 587104683, 590406685, 584712181, 587171669, 575729752, 577878151, 586695251, 586054344, 585734177, 587748871, 589332581, 590397301, 585954094, 586422806, 589766922, 584297829, 581709709, 585714874, 589604645, 592103996, 583195953, 577522125, 583119202, 588701324, 590313911, 583266296, 584039688, 587447395, 587803650, 588975410, 590633316, 584406395]
3880.6E84406395l370514O060257N73311R96437L209610j0189552K107315M019889
3888.3E87813148P11175K821731k798042o528397K677651K914085o84776J038398r6893
3897E87868080O78215j8349o597137M742546O4736m607201M039268k464637q06542
3905.7E82898979J278305K119866K466316o35567P0076j37062l47366m09241m21066
3914.4E86883240J050300N69840l004646j847229L551177m60014k713127K401047O40526
3923.1E87071114l1701j183357j195907J751709K1858k09427p90443k04010J573562
3931.7E86803398j666412n17655Q83980k25906R67254R63784J21803k51541m91257
3940.4E86587448O49414p56912l391228J232682J897201J67580K66266k017060J38245
$$ y = [584406395, 581035881, 587096138, 587669449, 588665886, 591875496, 581685944, 583793259, 587813148, 588524323, 591346054, 588548012, 582019615, 584697266, 587611351, 586926575, 587964973, 587868080, 588546295, 588527946, 581930809, 586673355, 586738091, 582130890, 586170158, 583705521, 582898979, 584177284, 586297150, 588763466, 588127899, 588197975, 588060913, 587713547, 587304306, 586883240, 587933540, 588503380, 585498734, 583651505, 587202682, 586742668, 584029541, 586430588, 587071114, 587039413, 585856056, 584660149, 586411858, 586433716, 586224289, 585433846, 585229836, 586803398, 585136986, 584619331, 585503311, 585277405, 586244659, 587208443, 587330246, 587078705, 586587448, 587236862, 586479950, 583088722, 584321404, 586218605, 586386185, 586652451, 584635391, 584773636]
3949.1E84773636j5793j464806K057343K38037r71031P14683M23546l8147k6207O78902
3958.7E86370163l98254n20668q14476j365777J196709R81445k5482M25644j64375
3967.4E85684929k61955n84641n13763L82118k15683l42941K45094R2049J12457J66664
3977.1E84764328N14832j603l57399J94359m82864p00531J74293P28112J81274j55373
3986.7E84859428K42997L2844n67093j112060J3046N06973Q6746L29171l26195L74603
3996.3E84440460Q00972o58874o69518J30501
4000.2E84043541
$$ y = [584773636, 584757843, 583293037, 585350380, 585588417, 584617386, 585332069, 585755615, 585717468, 585691261, 586370163, 585971909, 585451241, 584636765, 583270988, 584467697, 585449142, 585423660, 585849304, 585684929, 585422974, 584838333, 584324570, 584706688, 584491005, 584148064, 584393158, 584485207, 584597664, 584764328, 585279160, 585277557, 584920158, 585114517, 584631653, 583931122, 584105415, 584833527, 585014801, 584859428, 585102425, 585135269, 584568176, 583456116, 583469162, 583976135, 584062881, 584392052, 584065857, 584440460, 585241432, 584582558, 583913040, 584043541]
##END=$$ End of the data block
