##TITLE=$$ Begin of the data block
##JCAMP-DX=5.00 $$ ACD/SpecManager v 10.08
##SPECTROMETER/DATA SYSTEM=Varian
##DATE=04 Dec 2012 13:37:04
##DATA TYPE=INFRARED SPECTRUM
##DATA CLASS=XYDATA
##ORIGIN=
##OWNER=
##NPOINTS=3735
##FIRSTX=399.26403809
##LASTX=4000.35498047
##MAXX=4000.35498047
##MINX=399.26403809
##MAXY=70.28293610
##MINY=27.18198586
##XFACTOR=1.0000000000
##YFACTOR=0.000000100000000
##FIRSTY=52.23627853
##DELTAX=0.96440572
##XUNITS=1/CM
##YUNITS=TRANSMITTANCE
##XYDATA=(X++(Y..Y))
$$ plain form
399.3 522362785 528991280 540637856 540851402 534800758 533746414 527707214 531425934 529812241
407 529812241 531163292 538592720 539160271 537398262 538916931 542590523 533580780 524553375 522810402
415.7 522810402 526350288 525430946 522460899 529832802 522704659 527452774 528328667 530486603 535940399
424.3 535940399 532166328 530759392 530035515 530120201 528807297 529507866 531107407 532019958 533222466
433 533222466 528717499 526692276 525734673 524336395 522909317 523929482 525208778 523117256 522502289
441.7 522502289 518088608 522683029 532498207 533899765 530022049 525108109 526841774 529247475
449.4 529247475 532193642 533008308 529986191 526404686 527690392 529807243 524255028 523972130 530494537
458.1 530494537 527405701 521241493 519644890 524601669 524356689 525105705 528844490 526737061 518395195
$$ packed form
399.3E22362785O628495J1646576K13546o050644j054344o039200L718720j613693
407E29812241J351051P429428N67551j762009J518669L673592r009743r027405j742973
415.7E22810402L539886r19342k970047P371903p128143M748115Q75893K157936N453796
424.3E35940399l774071j406936p23877Q4686j312904P00569J599541R12551J202508
433E33222466m504967k025223r57603j398278j427078J020165J279296k091522o14967
441.7E22502289m413681M594421R815178J401558l877716m913940J733665K405701
449.4E29247475K946167Q14666l022117l581505J285706K116851n552215k82898O522407
458.1E30494537l088836o164208j596603M956779k44980P49016L738785k107429q341866
$$ plain form
466.8 518395195 512330284 510735855 514139671 521205406 517837296 508137932 510665855 514641342
474.5 514641342 513568268 515173531 514875183 510085640 512304039 511486168 507655067 508459625 513261642
483.2 513261642 516623344 511130066 507491379 508418770 510042038 508304520 509412270 511779137 509110413
491.8 509110413 510452652 511892433 510611267 508296776 506360359 504270325 503509750 505399513 502726822
500.5 502726822 500652313 500403786 498306694 496702766 495733757 495908813 494689255 493237038 493864746
509.2 493864746 494010811 491701050 492422600 492557106 488744392 486458206 486266632 486713600 484280739
517.9 484280739 483941650 483517799 481072044 480861778 480486031 481265945 481501656 480470924 478179741
526.6 478179741 477647247 479081230 477965965 476635170 476732407 478143196 479146652 479971008 481307030
$$ packed form
466.8E18395195o064911j594429L403816P065735l368110r699364K527923L975487
474.5E14641342j073074J605263k98348m789543K218399q17871l831101Q04558M802017
483.2E13261642L361702n493278l638687R27391J623268j737518J107750K366867k668724
491.8E09110413J342239J439781j281166k314491j936417k090034p60575J889763k672691
500.5E02726822k074509k48527k097092j603928r69009J75056j219558j452217O27708
509.2D93864746J46065k309761P21550J34506l812714k286186j91574M46968k432861
517.9D84280739l39089m23851k445755k10266l75747P79914K35711j030732k291183
526.6D78179741n32494J433983j115265j330795R7237J410789J003456Q24356J336022
$$ plain form
535.2 481307030 482800560 484037819 482953796 482105446 482831573 484753456 485705795 486374321 489080467
543.9 489080467 489981499 489122849 488702240 489312744 488746185 486647835 484818497 482557068 483660355
552.6 483660355 486039619 486524506 487417603 488017693 488236351 487134018 484300575 481697578 480116959
561.3 480116959 479984627 480989151 481445045 482052536 482121468 481175613 478281746 473017197 470198593
570 470198593 468907738 468616486 468255463 466473656 466577110 467723045 470114861 471046219 470415230
578.6 470415230 469209366 468581581 470309486 472180557 474143753 475269318 477737122 481129303 483122635
587.3 483122635 482790871 481689377 482878075 482754936 482337494 482651062 483172836 485587425 486939926
596 486939926 487752953 488346672 487860374 486676826 485158310 484533348 485025978 485753479 485206680 484418373
$$ packed form
535.2D81307030J493530J237259j084023q48350P26127J921883R52339O68526K706146
543.9D89080467R01032q58650m20609O10504n66559k098350j829338k261429J103287
552.6D83660355K379264M84887Q93097O00090K18658j102333k833443k602997j580619
561.3D80116959j32332J004524M55894O07491O8932r45855k893867n264549k818604
570D70198593j290855k91252l61023j781807J03454J145935K391816R31358o30989
578.6D70415230j205864o27785J727905J871071J963196J125565K467804L392181J993332
587.3D83122635l31764j101494J188698j23139m17442L13568N21774K414589J352501
596D86939926Q13027N93719m86298j183548j518516o24962M92630P27501n46799p88307
$$ plain form
605.6 484418373 485940552 488985558 489647293 489256592 488976440 488329315 488420258 488581657 489374161 489315796
615.3 489315796 490337639 493313560 495643959 497704773 498178024 498042488 497909889 498848152 500790405
624 500790405 502178955 503921013 505985298 508441849 509637871 511256676 513138885 512969704 511867485
632.7 511867485 510365791 511190491 512973862 514080391 516149979 518348236 519358711 518873024 518439064
641.3 518439064 517758331 517145386 517281647 516959801 517234039 519166679 521270332 522003822 523130264
650 523130264 524190140 524460258 524417381 522844429 521426315 521002388 521114845 522912483 525275459
658.7 525275459 525841904 525996246 526337738 525115967 523751106 523388977 523572617 523729095 521356926
667.4 521356926 516415176 522865715 527310028 529170265 529516869 527841988 526157227 525890007 525056953
$$ packed form
605.6D84418373J522179L045006O61735l90701k80152o47125R0943J61399P92504n8365
615.3D89315796J021843K975921K330399K060814M73251j35536j32599R38263J942253
624E00790405J388550J742058K064285K456551J196022J618805J882209j69181j102219
632.7E11867485j501694Q24700J783371J106529K069588K198257J010475m85687m33960
641.3E18439064o80733o12945J36261l21846K74238J932640K103653P33490J126442
650E23130264J059876K70118m2877j572952j418114m23927J12457J797638K362976
658.7E25275459N66445J54342L41492j221771j364861l62129J83640J56478k372169
667.4E21356926m941750O450539M444313J860237L46604j674881j684761k67220q33054
$$ plain form
676.1 525056953 524678955 525596962 527516289 528414040 529051590 530994377 531989784 532295837 531660233
684.7 531660233 530004845 528845215 528036957 528662338 531272697 532781334 533186760 534151535 533897514
693.4 533897514 532686844 531431999 530746689 529714050 527282257 526934204 528682098 530423584 531055069
702.1 531055069 530828171 529956207 527821884 526499863 525553017 524060783 523881874 525232162 526180420
710.8 526180420 527483864 529951096 531288643 531243210 530411758 530331192 530433044 529891167 529820900 529515610
720.4 529515610 531457062 535015678 537273140 538957062 541045189 542373886 542449112 542719536 543267136
729.1 543267136 545699005 548472252 550152969 553467102 556491470 558522072 559616966 559589043 559975433
737.8 559975433 559861870 559661446 559900513 561385803 563535805 565109329 567468376 568645477 567438011
$$ packed form
676.1E25056953l77998R18007J919327Q97751O37550J942787R95407L06053o35604
684.7E31660233j655388j159630q08258O25381K610359J508637M05426R64775k54021
693.4E33897514j210670j254845o85310j032639k431793l48053J747894J741486O31485
702.1E31055069k26898q71964k134323j322021r46846j492234j78909J350288R48258
710.8E26180420J303444K467232J337547m5433q31452q0566J01852n41877p0267l05290
720.4E29515610J941452L558616K257462J683922K088127J328697P5226K70424N47600
729.1E43267136K431869K773247J680717L314133L024368K030602J094894k7923L86390
737.8E59975433j13563k00424K39067J485290K150002J573524K359047J177101j207466
$$ plain form
746.5 567438011 566422005 565526390 563482742 561959991 561880264 562684975 563284302 563050461 563411903
755.1 563411903 563360329 562210274 560585861 559023628 558103943 557313499 557012863 556501846 556907196
763.8 556907196 559271088 561603088 562827301 563278122 563755150 563616829 563248215 563516273 564627342
772.5 564627342 567066689 570171890 573533936 576296310 578089523 579411011 580222244 580515137 580733757
781.2 580733757 581266785 581822319 583778610 586411552 588627243 590904617 592496147 593084984 591926422
789.9 591926422 590943146 590639725 590362740 591551666 593059311 594220085 596061058 598975410 601159134
798.5 601159134 601914902 602142677 601843796 601455040 600952301 601184425 602598152 605468178 608522491
807.2 608522491 609728165 609973297 611090584 612068291 610815849 609901848 609874763 609861679 609993439 611490173
$$ packed form
746.5E67438011j016006q95615k043648j522751p9727Q04711N99327k33841L61442
755.1E63411903n1574j150055j624413j562233r19685p90444l00636n11017M05350
763.8E56907196K363892K332000J224213M50821M77028j38321l68614K68058J111069
772.5E64627342K439347L105201L362046K762374J793213J321488Q11233K92893K18620
781.2E80733757N33028N55534J956291K632942K215691K277374J591530N88837j158562
789.9E91926422r83276l03421k76985J188926J507645J160774J840973K914352K183724
798.5F01159134P55768K27775k98881l88756n02739K32124J413727K870026L054313
807.2F08522491J205674K45132J117287R77707j252442r14001k7085j3084J31760J496734
$$ plain form
816.9 611490173 614141579 614677773 615743942 616058350 614512177 613020134 609985199 607844658 606851234
825.5 606851234 606679840 607349739 608171196 608316765 607189941 605832672 603359833 600591888 597965584
834.2 597965584 596000061 594955177 594918518 595503731 595458260 595319366 593713684 591987915 590216827
842.9 590216827 587195015 584539604 582618141 581875305 582132645 583628998 584849739 585360603 584839630
851.6 584839630 582825813 581886864 581176567 580357895 579404144 579356308 580868416 581948814 583553963
860.3 583553963 585227394 586101265 586638641 586918030 586491394 586417427 587512169 588923721 592453423
868.9 592453423 596875038 600806580 604862404 607565842 608257065 608020363 608169708 608081970 608774986
877.6 608774986 609143257 609719009 612004471 613261528 613454933 613000603 611973267 609124603 605599327
$$ packed form
816.9F11490173K651406N36194J066169L14408j546173j492043l034935k140541r93424
825.5F06851234j71394O69899Q21457J45569j126824j357269k472839k767945k626304
834.2E97965584j965523j044884l6659N85213m5471j38894j605682j725769j771088
842.9E90216827l021812k655411j921463p42836K57340J496353J220741N10864n20973
851.6E84839630k013817r38949p10297q18672r53751m7836J512108J080398J605149
860.3E83553963J673431Q73871N37376K79389m26636p3967J094742J411552L529702
868.9E92453423M421615L931542M055824K703438O91223k36702J49345q7738O93016
877.6F08774986L68271N75752K285462J257057J93405m54330j027336k848664l525276
$$ plain form
886.3 605599327 602960777 600541306 598848038 597623062 597416191 596894341 596133080 595302620 592677383
895 592677383 589188538 586634789 585530472 583724136 582048759 581513023 581170769 580915184 579813652
903.7 579813652 577736473 574824829 572032890 568755188 565234680 562886772 560836983 559710579
911.4 559710579 559167671 557861519 556170769 553714485 550908966 548452873 545556946 542720070 539962959
920 539962959 537311096 536142273 535647049 535468483 536461601 537235336 536865730 535982323 534492722 533682137
929.7 533682137 534163361 534864922 535357361 535320587 535666885 536444855 537398491 538271561 538246956 537808800
939.3 537808800 537243652 537246819 537419548 538113861 539899940 540874596 541455688 541881714 541812630 540642433
949 540642433 537978401 535796051 533627052 531465263 529917908 528094673 525972595 523801918 520965958
$$ packed form
886.3F05599327k638550k419471j693268j224976k06871n21850p61261q30460k625237
895E92677383l488845k553749j104317j806336j675377n35736l42254k55585j101532
903.7E79813652k077179k911644k791939l277702l520508k347908k049789j126404
911.4E59710579n42908j306152j690750k456284k805519k456093k895927k836876k757111
920E39962959k651863j168823m95224j78566R93118P73735l69606q83407j489601q10585
929.7E33682137M81224P01561M92439l6774L46298P77970R53636Q73070k4605m38156
939.3E37808800n65148L167J72729O94313J786079R74656N81092M26026o9084j170197
949E40642433k664032k182350k168999k161789j547355j823235k122078k170677k835960
$$ plain form
957.7 520965958 517498245 513920860 509723549 505879326 501878510 497628822 494108505 490507927
965.4 490507927 486499252 481746178 476877480 472082214 467112160 460901146 453940125 447724304
973.1 447724304 441595192 435739441 430156097 424176559 417406082 411660767 405655937 398542252
980.8 398542252 391749954 385303993 380055351 374363174 369374199 365171547 361736145 358491631
988.5 358491631 354560623 351827469 349126511 347590675 346131859 344900436 344095917 343390121 343265038
997.2 343265038 342804527 343670845 343442917 343228455 342928009 341714783 341113892 340508423 340963326 340652275
1006.8 340652275 340688705 340349236 339628983 339352303 338418350 337341537 335248260 334023476 332124977
1015.5 332124977 331375237 331797409 331352348 331243744 330618172 331472549 331049194 330245934 329829521 329929314
$$ packed form
957.7E20965958l467713l577385m197311l844223m000816m249688l520317l600578
965.4D90507927m008675m753074m868698m795266m970054o211014o961021o215821
973.1D47724304o129112n855751n583344n979538o770477n745315o004830p113685
980.8C98542252o792298o445961n248642n692177m988975m202652l435402l244514
988.5C58491631l931008k733154k700958j535836j458816j231423q04519p05796j25083
997.2C43265038m60511Q66318k27928k14462l00446j213226o00891o05469M54903l11051
1006.8C40652275L6430l39469p20253k76680r33953j076813k093277j224784j898499
1015.5C32124977p49740M22172m45061j08604o25572Q54377m23355q03260m16413R9793
$$ plain form
1025.2 329929314 331146851 331147804 331554832 331193123 331848297 331955490 332145386 333100548 332539940 332640877
1034.8 332640877 331562271 331204147 330525856 330191078 329763069 328987808 329710426 328555870 329115257
1043.5 329115257 328821945 328385506 328244324 327114487 327516327 326866608 327326241 327071342 328443413
1052.2 328443413 330514526 331356735 332851448 333492737 335453568 336781120 339811516 342245636 344017067
1060.9 344017067 347105751 349118042 352006149 353542557 355418968 356443291 357213669 358059883 357455902
1069.5 357455902 356779289 354266396 352417603 349703369 347710724 345782242 343557434 342700615 340751839
1078.2 340751839 341057892 341271439 342416763 342792549 343187981 345648918 346872139 348878975 349266548
1086.9 349266548 350974998 353040237 354990540 357688255 358731918 360434036 361387100 363351898
$$ packed form
1025.2C29929314J217537R53M07028l61709O55174J07193J89896R55162n60608J00937
1034.8C32640877j078606l58124o78291l34778m28009p75261P22618j154556N59387
1043.5C29115257k93312m36439j41182j129837M01840o49719M59633k54899J372071
1052.2C28443413K071113Q42209J494713O41289J960831J327552L030396K434120J771431
1060.9C44017067L088684K012291K888107J536408J876411J024323P70378Q46214o03981
1069.5C57455902o76613k512893j848793k714234j992645j928482k224808q56819j948776
1078.2C40751839L06053K13547J145324L75786L95432K460937J223221K006836L87573
1086.9C49266548J708450K065239J950303K697715J043663J702118R53064J964798
$$ plain form
1094.6 363351898 364957047 366010399 366809235 367462959 368865891 368380661 368792801 369113312 369790154
1103.3 369790154 370425415 370920334 372562561 373338814 374247398 374758987 376585808 378038902 379326935
1112 379326935 380424194 380059204 380680962 381151581 382563820 383411942 384535294 385428085 385705338
1120.6 385705338 386963043 387348366 388933372 389646378 390576439 392124519 393475914 395158386 395627060
1129.3 395627060 396427689 396625595 398161278 399175644 399094772 399307518 398282204 397735901 396521797
1138 396521797 396050415 394866905 393249550 392161293 390304222 389315872 387359695 385725479 384031029
1146.7 384031029 382594261 381207848 379895477 378914871 376450768 375313759 373800621 373048897 372134819
1155.4 372134819 371141090 371902199 371986008 373106918 373171387 373519135 374223633 375715866 378602371
$$ packed form
1094.6C63351898J605149J053352P98836O53724J402932m85230M12140L20511O76842
1103.3C69790154O35261M94919J642227P76253R08584N11589J826821J453094J288033
1112C79326935J097259l64990O21758M70619J412239Q48122J123352Q92791K77253
1120.6C85705338J257705L85323J585006P13006R30061J548080J351395J682472M68674
1129.3C95627060Q00629J97906J535683J014366q0872K12746j025314n46303j214104
1138C96521797m71382j183510j617355j088257j857071r88350j956177j634216j694450
1146.7C84031029j436768j386413j312371r80606k464103j137009j513138p51724r14078
1155.4C72134819r93729P61109Q3809J120910O4469L47748P04498J492233K886505
$$ plain form
1164 378602371 380602913 383553352 386624146 390531845 393805504 396851654 400569725 404454269 408884239
1172.7 408884239 412572289 417036552 421476517 426297531 430824013 434592972 438890610 443289528
1180.4 443289528 447525291 450679550 453812675 456487694 459576836 463155861 466164551 468999977
1188.1 468999977 471080246 473744431 475731506 477002144 478675156 479980125 480819092 481238976 482324715
1196.8 482324715 483317490 484216385 485105057 485921288 486811676 486955109 487230797 487411423 487673340 488048096
1206.5 488048096 488516998 489464378 490543633 491743469 492736549 494135704 494891472 495115623 495734863
1215.1 495734863 496233673 496725273 496852341 497254753 497686653 497798004 497822609 497614021 496878319 495513496
1224.8 495513496 494395866 493056183 492561913 492750320 491825981 490550232 489334450 488363724 487416534
$$ packed form
1164C78602371K000542K950439L070794L907699L273659L046150L718071L884544M429970
1172.7D08884239L688050M464263M439965M821014M526482L768959M297638M398918
1180.4D43289528M235763L154259L133125K675019L089142L579025L008690K835426
1188.1D68999977K080269K664185J987075J270638J673012J304969Q38967M19884J085739
1196.8D82324715R92775Q98895Q88672Q16231Q90388J43433K75688J80626K61917L74756
1206.5D88048096M68902R47380J079255J199836R93080J399155P55768K24151O19240
1215.1D95734863M98810M91600J27068M02412M31900J11351K4605k08588p35702j364823
1224.8D95513496j117630j339683m94270J88407r24339j275749j215782r70726r47190
$$ plain form
1233.5 487416534 486569023 485477371 484660530 484230042 483450890 483451653 483927383 484531860 484951248 485365372
1243.1 485365372 485523300 485578575 485899734 486128654 487481155 489054947 490700722 492150688 493274918
1251.8 493274918 494654999 495571899 496261444 496392136 497063255 497744255 498050232 499184875 500381622
1260.5 500381622 501882744 503012276 503846169 504474831 504701653 504980850 505177956 506111526 507087021
1269.2 507087021 507811394 508814735 510115204 511666183 512606888 512719078 512771339 513246803 513616905
1277.8 513616905 513875160 514128838 514735184 516193314 517401543 518099098 518898697 519845886 520651588
1286.5 520651588 521099014 521327171 521659050 522265167 522846565 523268166 523667488 524021301 524135666 523888779
1296.2 523888779 523587685 523180466 522653008 522362175 522234764 522312813 522449188 522726364 523230667 523203201
$$ packed form
1233.5D87416534q47511j091652q16841m30488p79152P63M75730O04477M19388M14124
1243.1D85365372J57928N5275L21159K28920J352501J573792J645775J449966J124230
1251.8D93274918J380081R16900O89545J30692O71119O81000L05977J134643J196747
1260.5E00381622J501122J129532Q33893O28662K26822K79197J97106R33570R75495
1269.2E07087021P24373J003341J300469J550979R40705J12190N2261M75464L70102
1277.8E13616905K58255K53678O06346J458130J208229O97555P99599R47189Q05702
1286.5E20651588M47426K28157L31879O06117N81398M21601L99322L53813J14365k46887
1296.2E23888779l01094m07219n27458k90833j27411P8049J36375K77176N04303k7466
$$ plain form
1305.8 523203201 522666321 522283897 521799622 521190300 521030197 520820885 520446625 520515251 520385017 519567604
1315.4 519567604 518501053 517806740 517372932 516639099 515997620 515772934 515519791 515167274 515158081 515585175
1325.1 515585175 515852318 515774269 515469437 514931564 514344063 513591919 513102570 513019638 512902641 512701263
1334.7 512701263 511729279 510372124 509698410 508922119 507256470 506922569 508635521 509445610 509411354
1343.4 509411354 509278755 509272919 509534264 510020256 510274849 509614716 509292641 509358330 509216042 509225998
1353.1 509225998 508972778 508492241 508143997 508006897 507632980 507126312 506455803 505087128 503699493
1361.7 503699493 501940918 500898209 501547050 501539879 500782127 499746399 498441010 498446999 499245605 499140625
1371.4 499140625 498688698 497274857 494673309 493669891 494085236 494071007 493611565 494192276 494898682
$$ packed form
1305.8E23203201n36880l82424m84275o09322j60103k09312l74260O8626j30234q17413
1315.4E19567604j066551o94313m33808p33833o41479k24686k53143l52517r193M27094
1325.1E15585175K67143p8049l04832n37873n87501p52144m89349q2932j16997k01378
1334.7E12701263r71984j357155o73714p76291j665649l33901J712952Q10089l4256
1343.4E09411354j32599n836K61345M85992K54593o60133l22075O5689j42288R956
1353.1E09225998k53220m80537l48244j37100l73917n06668o70509j368675j387635
1361.7E03699493j758575j042709O48841p171p57752j035728j305389N989P98606j04980
1371.4D99140625m51927j413841k601548j003418M15345j4229m59442N80711P06406
$$ plain form
1380.1 494898682 495906944 496882401 497542267 498512230 499029388 499488983 499597015 500035172 502172356
1388.7 502172356 504133682 504895782 505502167 506124077 505623131 503563957 502221184 503378563 503381805
1397.4 503381805 501786308 500706749 502513123 504516945 505082817 505751534 505371361 504218903 504940948
1406.1 504940948 505348930 505089760 504261131 503736725 503439598 503232040 503348694 503358688 502702065 501492424
1415.7 501492424 500186653 498535538 497214203 496078148 499433060 502636948 503386536 503001823 503453293
1424.4 503453293 505388527 506134224 505622177 504926491 503225555 502201538 502807693 503569946 503302689
1433.1 503302689 503102455 502930374 501250267 497795448 498278618 500457649 500759239 500422821 500227280
1441.8 500227280 500125999 500643730 500278854 500433426 499893608 498609848 496930809 496954002 496844635
$$ packed form
1380.1D94898682J008262R75457O59866R69963N17158M59595J08032M38157K137184
1388.7E02172356J961326P62100O06385O21910n00946k059174j342773J157379L242
1397.4E03381805j595497j079559J806374K003822N65872O68717l80173j152458P22045
1406.1E04940948M07982k59170q28629n24406k97127k07558J16654R994o56623j209641
1415.7E01492424j305771j651115j321335j136055L354912L203888P49588l84713M51470
1424.4E03453293J935234P45697n12047o95686j700936j024017O06155P62253k67257
1433.1E03302689k00234j72081j680107l454819M83170K179031L01590l36418j95541
1441.8E00227280j01281N17731l64876J54572n39818j283760j679039K3193j09367
$$ plain form
1450.5 496844635 494529839 492891693 491178246 489742050 486343079 482780952 478615189 477165527
1458.2 477165527 483211288 485165939 487597313 488189583 488773270 489446335 486914444 490127144 492681732
1466.8 492681732 497131233 501870346 509019470 515629807 518698044 524982376 532047348 541589088
1474.6 541589088 546279297 550702286 556781921 561193886 564596329 565954781 567783356 569962540
1482.3 569962540 572476387 574116096 575449982 576417236 575341530 575838432 575672951 572788239 573758316
1491 573758316 577223244 579098663 578996239 578439484 575952797 572032433 574045868 573655968 572803307
1499.6 572803307 574215240 573348732 571799164 570893860 569436226 565223007 550975723 547874527
1507.3 547874527 554307480 557053642 557267036 557578697 555379066 552564697 551896820 549171944 546286583
$$ packed form
1450.5D96844635k314796j638146j713447j436196l398971l562127m165763j449662
1458.2D77165527O045761J954651K431374N92270N83687O73065k531891L212700K554588
1466.8D92681732M449501M739113P149124O610337L068237O284332P064972R541740
1474.6E41589088M690209M422989O079635M411965L402443J358452J828575K179184
1482.3E69962540K513847J639709J333886R67254j075706M96902j65481k884712R70077
1491E73758316L464928J875419j02424n56755k486687l920364K013435l89900q52661
1499.6E72803307J411933q66508j549568r05304j457634m213219j4247284l101196
1507.3E47874527O432953K746162K13394L11661k199631k814369o67877k724876k885361
$$ plain form
1516 546286583 541995544 543266029 547220345 547248383 541499596 537957077 541500511 544489441 544866905
1524.7 544866905 543140717 543626137 544154701 544064713 545927124 546954269 545109825 542942772 539854584
1533.4 539854584 538183136 540727730 541812592 541466408 539399986 530237503 526472168 532778702
1541.1 532778702 534889717 534775314 536810074 537465401 539277267 542125359 543529472 543779678 542286110
1549.8 542286110 543374405 547169342 549034462 548953133 547511063 548939209 551587753 550929375 540792122
1558.5 540792122 536237068 549590454 558412094 562859039 565370674 565831871 566031456 567886696
1566.2 567886696 569571228 569638405 566917343 565407448 569804993 573071938 574244804 574418564 574053535
1574.9 574053535 570794640 566551628 570873299 574250374 574972572 574999695 574544411 574265327 574199753
$$ packed form
1516E46286583m291039J270485L954316K8038n748787l542519L543434K988930L77464
1524.7E44866905j726188M85420N28564q9988J862411J027145j844444k167053l088188
1533.4E39854584j671448K544594J084862l46184k066422r162483l765335O306534
1541.1E32778702K111015j14403K034760O55327J811866K848092J404113K50206j493568
1549.8E42286110J088295L794937J865120q1329j442070J428146K648544o58378j0137253
1558.5E40792122m555054J3353386Q821640M446945K511635M61197J99585J855240
1566.2E67886696J684532O7177k721062j509895M397545L266945J172866J73760l65029
1574.9E74053535l258895m243012M321671L377075P22198K7123m55284k79084o5574
$$ plain form
1583.5 574199753 573947372 573592377 572567482 571487846 569737892 568563881 567387619 566110840 565208397
1592.2 565208397 564342041 562705460 560447540 559623451 558249016 556901779 554973335 552772217 550678749
1600.9 550678749 548444061 546984825 544742126 543370934 541308136 538685417 535899963 533215370
1608.6 533215370 530275269 527114906 525689659 522625580 519943199 516490784 513492928 509493217
1616.3 509493217 500971909 502260551 500954742 498644409 495095406 492095757 487313576 481249771
1624 481249771 481776772 480116577 478033752 472511597 469363441 467745972 464695091 462209511 458454933
1632.7 458454933 456694832 453264961 446021080 443315544 443848038 444486885 443839188 444008560 441741562
1641.4 441741562 441270485 440114250 439858055 438972549 433125381 431582794 431753159 436277924 436817856
$$ packed form
1583.5E74199753k52381l54995j024895j079636j749954j174011j176262j276779r02443
1592.2E65208397q66356j636581k257920q24089j374435j347237j928444k201118k093468
1600.9E50678749k234688j459236k242699j371192k062798k622719k785454k684593
1608.6E33215370k940101l160363j425247l064079k682381l452415k997856l999711
1616.3E09493217q521308J288642j305809k310333l549003k999649m782181o063805
1624D81249771N27001j660195k082825n522155l148156j617469l050881k485580l754578
1632.7D58454933j760101l429871p243881k705536N32494O38847o47697J69372k266998
1641.4D41741562m71077j156235k56195q85506n847168j542587J70365M524765N39932
$$ plain form
1650.1 436817856 437456093 437375259 428712349 427977905 432577362 438208923 439809341 441982765 443244705
1658.8 443244705 444793472 446002731 446182289 448197403 449511871 453766251 456125412 458373604
1666.5 458373604 460313187 460676117 462182541 463797035 467534752 469976387 473990097 476630554
1674.2 476630554 476416779 479316483 483357124 487317085 488991928 490904732 492796402 495972252
1681.9 495972252 497379799 491803474 494384537 501412926 507840614 511039124 513470840 516383476
1689.6 516383476 518878746 522746544 525861664 528379021 529867630 531185303 530898476 534795952
1697.3 534795952 538709488 540376778 539385338 541075745 547859650 551569099 551909332 551335716 551636505
1706 551636505 552898483 555853996 558054352 557358551 557633591 559086456 559547539 559324417 557118225
$$ packed form
1650.1D36817856O38237q0834q662910p34444M599457N631561J600418K173424J261940
1658.8D43244705J548767J209259J79558K015114J314468M254380K359161K248192
1666.5D58373604J939583L62930J506424J614494L737717K441635M013710K640457
1674.2D76630554k13775K899704M040641L959961J674843J912804J891670L175850
1681.9D95972252J407547n576325K581063P028389O427688L198510K431716K912636
1689.6E16383476K495270L867798L115120K517357J488609J317673k86827L897476
1697.3E34795952L913536J667290r91440J690407O783905L709449L40233n73616L00789
1706E51636505J261978K955513K200356o95801K75040J452865M61083k23122k206192
$$ plain form
1714.7 557118225 557213440 559264221 558936157 557666359 563330383 567048340 568349838 568452911 567470665
1723.4 567470665 567420197 567335625 566349258 564890556 562979469 560420380 554867325 551492882 550327187
1732 550327187 547150879 537029419 527340469 528855324 526775703 522015953 517120628 509552078
1739.8 509552078 502770157 500653496 497724915 491620445 490988045 491188469 492072334 494104958 497583237
1748.4 497583237 505073051 511197968 522499847 534177513 545883980 557086143 567199326 577172546
1756.2 577172546 586313515 597802200 606711540 614631691 620375824 624786644 632234764 638442154
1763.9 638442154 643772430 647351227 650703659 652787781 653594360 656880417 658356857 656376190
1771.6 656376190 655694351 660473022 665271683 667047729 668120728 671119080 672391052 673089676 673093262
$$ packed form
1714.7E57118225R5215K050781l28064j269798N664024L717957J301498J03073r82246
1723.4E67470665n0468q4572r86367j458702j911087k559089n553055l374443j165695
1732E50327187l176308j0121460r688950J514855k079621m759750m895325p568550
1739.8E09552078o781921k116661k928581o104470o32400K00424Q83865K032624L478279
1748.4D97583237P489814O124917J1301879J1677666J1706467J1202163J0113183R973220
1756.2E77172546R140969J1488685Q909340P920151N744133M410820P448120O207390
1763.9F38442154N330276L578797L352432K084122Q06579L286057J476440j980667
1771.6F56376190o81839M778671M798661J776046J072999K998352J271972O98624L586
$$ plain form
1780.3 673093262 672636795 675167542 677118912 677613525 677200851 678390045 680368195 680538864 680705490
1788.9 680705490 681087723 679985962 678641357 677723694 680246658 683367233 683773041 683731613 685504074
1797.6 685504074 686388931 685266724 684787598 686346207 686670990 687782135 689423447 689707413 690289154
1806.3 690289154 690366898 690231781 690884781 690667343 689321594 690088425 691737442 692605896 693364105
1815 693364105 693571625 693962555 694115829 694680099 695451889 695126343 694902420 694073792 694452591 694664764
1824.6 694664764 692502441 693893738 695890045 695877304 693411636 691589661 694519424 696797791 697064743
1833.3 697064743 697284012 697574310 697507172 697069550 697135315 698304367 698630295 698742981 698073959 697526855
1842.9 697526855 696247253 692832184 696047974 698347015 697979202 698481216 699453735 700076141 699745560
$$ packed form
1780.3F73093262m56467K530747J951370M94613m12674J189194J978150J70669J66626
1788.9F80705490L82233j101761j344605r17663K522964L120575M05808m1428J772461
1797.6F85504074Q84857j122207m79126J558609L24783J111145J641312K83966N81741
1806.3F90289154P7744j35117O53000k17438j345749P66831J649017Q68454P58209
1815F93364105K07520L90930J53274N64270P71790l25546k23923q28628L78799K12173
1824.6F94664764k162323J391297J996307j2741k465668j821975K929763K278367K66952
1833.3F97064743K19269K90298o7138m37622O5765J169052L25928J12686o69022n47104
1842.9F97526855j279602l415069L215790K299041l67813N02014R72519O22406l30581
$$ plain form
1851.6 699745560 699526978 699420013 699543839 699858627 700108109 700377426 700022659 700322723 700724564 700882797
1861.3 700882797 700864716 700537033 700314407 699916000 699286575 698159714 697322769 695994415 696551514
1869.9 696551514 698956146 700539932 701277695 701143265 700876846 700730820 700944443 701136322 701310883
1878.6 701310883 701741180 702033920 702197418 701881714 701797638 701067886 700780487 701342316 701122742 701406403
1888.3 701406403 700683441 699999466 701459503 702353134 702323914 701888046 700537720 699874954 701153717
1896.9 701153717 701761475 701977692 702293472 702568970 702829361 702214813 701810455 701353989 701369095 701392517
1906.6 701392517 700678864 700406876 700378418 700909958 701943741 702676315 702171249 701773529 701488342 701190643
1916.2 701190643 701188202 698945465 699171677 700842667 701068802 700714951 699415741 699717712 701076508
$$ packed form
1851.6F99745560k18582j06965J23826L14788K49482K69317l54767L00064M01841J58233
1861.3G00882797j8081l27683k22626l98407o29425j126861q36945j328354N57099
1869.9F96551514K404632J583786P37763j34430k66419j46026K13623J91879J74561
1878.6G01310883M30297K92740J63498l15704q4076p29752k87399N61829k19574K83661
1888.3G01406403p22962o83975J460037Q93631k9220m35868j350326o62766J278763
1896.9G01153717O07758K16217L15780K75498K60391o14548m04358m56466J5106K3422
1906.6G01392517p13653k71988k8458N31540J033783P32574n05066l97720k85187k97699
1916.2G01190643k441k242737K26212J670990K26135l53851j299210L01971J358796
$$ plain form
1924.9 701076508 701702805 701479645 700968018 700601273 700461960 700657959 700967026 701204224 700900040 701060715
1934.6 701060715 701093216 700688324 700440063 700165634 700100861 699629288 699532471 698172226 697532043 699923325
1944.2 699923325 700696335 700164032 699835892 699921494 699920349 699578171 699765320 699882965 699848022 699649963
1953.8 699649963 699565430 699825058 700418854 700649109 700026245 699445267 699051361 699104767 699189835 699306030
1963.5 699306030 699655075 699817123 699541321 698861465 699090958 699419403 699273987 699226379 699007568 698750992
1973.1 698750992 698894806 699395523 699619064 699545898 699501801 699557190 699301987 698713226 698160934 697825851
1982.8 697825851 698002090 698234329 698473434 698732834 698897171 698689499 698248978 698290253 697425690 695817261
1992.4 695817261 696000061 696996536 697545853 697629623 697526321 697812119 698248596 697919922 697384338 696893005
$$ packed form
1924.9G01076508O26297k23160n11627l66745j39313J95999L09067K37198l04184J60675
1934.6G01060715L2501m04892k48261k74429o4773m71573r6817j360245o40183K391282
1944.2F99923325P73010n32303l28140Q5602j145l42178J87149J17645l4943j98059
1953.8F99649963q4533K59628N93796K30255o22864n80978l93906N3406Q5068J16195
1963.5F99306030L49045J62048k75802o79856K29493L28445j45416m7608k18811k56576
1973.1F98750992J43814N00717K23541p3166m4097N5389k55203n88761n52292l35083
1982.8F97825851J76239K32239K39105K59400J64337k07672m40521M1275q64563j608429
1992.4F95817261J82800R96475N49317Q3770j03302K85798M36477l28674n35584m91333
$$ plain form
2002.1 696893005 696380234 695944748 695754318 696190491 696805725 697376404 697431870 696953812 696434097 695950012
2011.7 695950012 695519409 694868851 694252701 693927002 693746262 693651505 693959351 694462357 694638443 694410095
2021.3 694410095 693742142 693143387 692635422 692216644 691988678 692184601 692652359 692924728 693195038 692987518
2031 692987518 692619858 691990280 691148987 690852737 690364456 690010223 690333328 690839081 691166153 691305466
2040.6 691305466 691033020 690615768 690016632 689153137 688923950 688643723 688659439 688944626 689317474 690192337
2050.3 690192337 690428696 690378189 689731903 688871460 688203812 687636795 687796707 687804794 688290024 688804932
2059.9 688804932 689080200 689587479 689726257 689731674 688854218 687740097 687277679 687218933 687507095 687927628
2069.6 687927628 688491516 689068069 689342346 689087677 689063110 688689041 687984772 687638626 687308884 687556458
$$ packed form
2002.1F96893005n12771m35486j90430M36173O15234N70679N5466m78058n19715m84085
2011.7F95950012m30603o50558o16150l25699j80740r4757L07846N03006J76086k28348
2021.3F94410095o67953n98755n07965m18778k27966J95923M67758K72369K70310k07520
2031F92987518l67660o29578q41293k96250m88281l54233L23105N05753L27072J39313
2040.6F91305466k72446m17252n99136q63495k29187k80227J5716K85187L72848Q74863
2050.3F90192337K36359n0507o46286q60443o67648n67017J59912Q087M85230N14908
2059.9F88804932K75268N07279J38778N417q77456j114121m62418n8746K88162M20533
2069.6F87927628N63888N76553K74277k54669k4567l74069p04269l46146l29742K47574
$$ plain form
2079.2 687556458 687898788 688186264 688677521 689042358 688905563 688337250 687779236 687114334 686715851 686729355
2088.9 686729355 687123032 687280807 687616653 688394852 688808060 689131470 688746414 688200073 687561569 686834259
2098.5 686834259 686697159 686650009 687305222 687984085 688328629 688476868 688293304 688113480 687590256 687209091
2108.1 687209091 686762009 686348190 686607132 687154694 687417450 687737579 688459015 688493652 687914886 687343597
2117.8 687343597 686811600 686444244 686333160 686380920 686828537 687740860 688277283 688139801 687640152 687621002
2127.4 687621002 687496033 686817169 686308517 686029968 686244888 686432648 686936264 687358246 687309341 687450104
2137.1 687450104 687199783 686768036 685990753 685479889 685501251 685882645 686523819 686527786 686741867 686868973
2146.7 686868973 686798172 686800690 686323853 685817947 685532455 685379791 685215607 685567474 686216583 686773300
$$ packed form
2079.2F87556458L42330K87476M91257L64837j36795n68313n58014o64902l98483J3504
2088.9F86729355L93677J57775L35846P78199M13208L23410l85056n46341o38504p27310
2098.5F86834259j37100m7150O55213O78863L44544J48239j83564j79824n23224l81165
2108.1F87209091m47082m13819K58942N47562K62756L20129P21436L4637n78766n71289
2117.8F87343597n31997l67356j11084M7760M47617R12323N36423j37482m99649j9150
2127.4F87621002j24969o78864n08652k78549K14920J87760N03616M21982m8905J40763
2137.1F87450104k50321m31747p77283n10864K1362L81394O41174L967K14081J27106
2146.7F86868973p0801K518m76837n05906k85492j52664j64184L51867O49109N56717
$$ plain form
2156.4 686773300 686910782 686708221 686836395 686631165 686202698 685758438 685607147 685942841 686489792 686968307
2166 686968307 687229919 687683792 687562714 687056122 686656876 686755142 686946259 686496277 686705856 687121887
2175.6 687121887 687524643 688079758 688337173 688399811 688176956 687841492 687437439 687513809 687500839 687479630
2185.3 687479630 687854156 688219833 688812180 689048843 689125900 689056778 688779526 688457413 688212585 688244476
2194.9 688244476 688178635 688499451 688996735 689402008 689798050 690077972 689833832 689291611 689229813 689073181
2204.6 689073181 689058533 689065399 689133072 689551315 689962387 690188904 690254822 690688324 690310974 689695435
2214.2 689695435 689577866 689215927 689491425 690044708 690211182 690198593 690413513 690607376 690800858 690718155
2223.9 690718155 690230713 690250397 690042267 689987793 690148468 690200119 690735931 691105270 690901031 690788193
$$ packed form
2156.4F86773300J37482k02561J28174k05230m28467m44260j51291L35694N46951M78515
2166F86968307K61612M53873j21078n06592l99246R8266J91117m49982K09579M16031
2175.6F87121887M02756N55115K57415O2638k22855l35464m04053P6370j2970k1209
2185.3F87479630L74526L65677N92347K36663P7057o9122k77252l22113k44828L1891
2194.9F88244476o5841L20816M97284M05273L96042K79922k44140n42221o1798j56632
2204.6F89073181j4648O866O7673M18243M11072K26517O5918M33502l77350o15539
2214.2F89695435j17569l61939K75498N53283J66474j2589K14920J93863J93482q2703
2223.9F90718155m87442J9684k08130n4474J60675N1651N35812L69339k04239j12838
$$ plain form
2233.5 690788193 691128006 690701447 690128555 689853439 689698334 689958954 690106277 690760269 691033478 690920868
2243.2 690920868 690542145 689857178 689820328 689817886 689957809 689514465 689283142 689802017 690041122 690397415
2252.8 690397415 690455780 690213013 689681854 689313660 689083710 688798523 688822021 688937759 688945312 688882904
2262.4 688882904 689690247 690170441 689926987 690016556 689918442 689359131 688749847 688747559 688750229 689180756 689530563
2273 689530563 689260254 689390106 689590454 689713974 689260941 688884354 688628922 688337631 688415604 688674011
2282.7 688674011 689129868 688873062 688841324 688872528 688596802 688462448 688110809 688041763 687852707 688060989
2292.3 688060989 687858047 687362976 687583084 687882309 688117599 687735596 687311096 686481934 686243210 686321793
2302 686321793 685563278 685623322 685684509 685795135 685640945 684962616 684396515 684201736 684068375 683268127
$$ packed form
2233.5F90788193L39813m26559n72892k75116j55105K60620J47323O53992K73209j12610
2243.2F90920868l78723o84967l6850k442J39923m43344k31323N18875K39105L56293
2252.8F90397415N8365k42767n31159l68194k29950k85187K3498J15738P553o2408
2262.4F88882904Q07343M80194k43454Q9569r8114n59311o09284k288K670M30527L49807
2273F89530563k70309J29852K00348J23520m53033l76587k55432k91291P7973K58407
2282.7F88674011M55857k56806l1738L1204k75726j34354l51639o9046j89056K08282
2292.3F88060989k02942m95071K20108K99225K35290l82003m24500q29162k38724P8583
2302F86321793p58515O0044O1187J10626j54190o78329n66101j94779j33361q00248
$$ plain form
2311.6 683268127 683433990 683181152 682570496 682539139 682722549 682989502 682293091 681972275 681446152 680907135
2321.3 680907135 679832764 679072876 679632721 678921280 678868942 678760147 678628540 678575363 677983093 677407913
2330.9 677407913 676430969 676941833 676887741 676367569 676020432 676005554 676540604 676345520 676458664 675991974
2340.6 675991974 675639496 675634537 675848618 675723648 675530930 676012344 676403961 677679062 678523865 678944244
2350.2 678944244 678180695 675591965 674024200 673316650 672332230 670640335 669851913 669440994 669765167
2358.9 669765167 671244278 670866623 670972824 671299973 670641327 669253235 669140091 670440445 670732422
2367.6 670732422 670816116 671250153 672475739 673206253 673491364 674410477 675263824 675412903 675473022 676184921
2377.2 676184921 677069702 677812424 677900238 678144226 678715668 678947906 679051285 678977814 679136353 679128418
$$ packed form
2311.6F83268127J65863k52838o10656l1357J83410K66953o96411l20816n26123n39017
2321.3F80907135j074371p59888N59845p11441n2338j08795j31607n3177n92270n75180
2330.9F77407913r76944N10864n4092n20172l47137j4878N35050j95084J13144m66690
2340.6F75991974l52478m959K14081j24970j92718M81414L91617J275101Q44803M20379
2350.2F78944244p63549k588730j567765p07550r84420j691895p88422m10919L24173
2358.9F69765167J479111l77655J06201L27149o58646j388092j13144J300354K91977
2367.6F70732422Q3694M34037J225586P30514K85111R19113Q53347J49079O0119P11899
2377.2F76184921Q84781P42722Q7814K43988N71442K32238J03379p3471J58539p935
$$ plain form
2386.8 679128418 679071350 679092789 678785858 678728104 678902130 679064941 678952942 678589630 677943344 677558975
2396.5 677558975 677748108 677669296 677421417 677409897 677620621 677394714 676949234 676535797 676146088 676025314
2406.1 676025314 675790710 675781631 675420380 675028152 675067520 675066528 675528488 675639725 675288315 674837952 674282074
2416.7 674282074 673877335 673639374 673617630 673403168 673323517 673601151 673821182 673657455 673370819 673140182
2426.4 673140182 672646637 671952133 671285324 671069641 670752258 670565796 670876617 670906219 670881577 670653076
2436 670653076 670325470 670078201 669674149 669173965 668698502 668733292 668780670 668395462 668427582 668849716
2445.7 668849716 668650589 668068390 667509384 666983414 666776199 666732101 666666870 666587372 666761551 666564636
2455.3 666564636 666154480 666184845 665619202 665051117 665113373 664832077 664296875 664276047 664483414 664374161
$$ packed form
2386.8F79128418n7068K1439l06931n7754J74026J62811j11999l63312o46286l84369
2396.5F77558975J89133p8812k47879j1520K10724k25907m45480m13437l89709j20774
2406.1F76025314k34604r079l61251l92228L9368r92M61960J11237l51410m50363n55878
2416.7F74282074m04739k37961k1744k14462p9651K77634K20031j63727k86636k30637
2426.4F73140182m93545o94504o66809k15683l17383j86462L10821K9602k4642k28501
2436F70653076l27606k47269m04052n00184m75463L4790M7378l85208L2120M22134
2445.7F68849716j99127n82199n59006n25970k07215m4098o5231p9498J74179j96915
2455.3F66564636m10156L0365n65643n68085O2256k81296n35202k0828K07367j09253
$$ plain form
2465 664374161 664183273 664131393 664057922 663475113 663122177 662974243 662413483 662372589 662504883 662414856 662501297
2475.6 662501297 662509613 661898804 661233063 661096573 660858459 660694122 660635910 660492249 660213928 660051346
2485.2 660051346 660203857 660255966 660267410 660047379 659709625 659162140 658677292 658584824 658335495 658198776
2494.8 658198776 658291245 658545914 658505630 658237000 658060760 657702789 657443466 657144012 656805191 656561050
2504.5 656561050 656741104 656832047 656479187 656859283 657255783 656810379 656228409 655940170 655781021 655681686
2514.1 655681686 655507202 655105438 654938049 654939499 654883194 654952850 655055161 654601517 654061127 653942871
2523.8 653942871 653675842 653631516 653736496 653585434 653334885 653105240 652842178 652875595 653050079 652405243
2533.4 652405243 651837387 651655121 651499100 651369858 651198502 651074448 650489807 650307236 650314636 649925766
$$ packed form
2465F64374161j90888n1880p3471n82809l52936j47934n60760m0894J32294r0027Q6441
2475.6F62501297Q316o10809o65741j36490k38114j64337n8212j43661k78321j62582
2485.2F60051346J52511N2109J1444k20031l37754n47485m84848r2468k49329j36719
2494.8F58198776R2469K54669m0284k68630j76240l57971k59323k99454l38821k44141
2504.5F56561050J80054R0943l52860L80096L96500m45404n81970k88239j59149r9335
2514.1F55681686j74484m01764j67389J450n6305O9656J02311m53644n40390j18256
2523.8F53942871k67029m4326J04980j51062k50549k29645k63062L3417J74484o44836
2533.4F52405243n67856j82266j56021j29242j71356j24054n84641j82571P400l88870
$$ plain form
2543.1 649925766 649714127 649732819 649605713 648977814 648988495 649106750 648957672 648864517 648312531 648074112
2552.7 648074112 647929077 647757492 647316055 646819305 646937637 646930542 646752777 646540985 646255798 645942764
2562.4 645942764 645939560 645876389 645596390 645426865 645245285 644969482 644099045 643963089 644364929 644133148
2572 644133148 643992691 643769836 643468094 642925034 642495270 642040176 641615906 641892471 641861496 641691742
2581.6 641691742 641545715 641317139 641279373 641142273 640764236 640450821 640429840 640109711 639937401 639921188
2591.3 639921188 639573479 639279518 639036407 638824348 638437119 638210335 638316154 638149338 637805595 637737007
2600.9 637737007 637645760 637326431 637117462 637117996 637088928 636467552 635769310 635375404 635248528 635170441 634397163
2611.5 634397163 633769302 633502693 633623123 633958168 633485260 633053322 632797890 632309494 631898270 631461487
$$ packed form
2543.1F49925766k11639J8692j27106o27899J0681J18255j49078r3155n51986k38419
2552.7F48074112j45035j71585m41437m96750J18332p095j77765k11792k85187l13034
2562.4F45942764l204o3171k79999j69525j81580k75803q70437j35956M01840k31781
2572F44133148j40457k22855l01742n43060m29764m55094m24270K76565l0975j69754
2581.6F41691742j46027k28576l7766j37100l78037l13415k0981l20129j72310j6213
2591.3F39921188l47709k93961k43111k12059l87229k26784J05819j66816l43743o8588
2600.9F37737007r1247l19329k08969N34k9068o21376o98242l93906j26876p8087p73278
2611.5F34397163o27861k66609J20430L35045m72908m31938k55432m88396m11224m36783
$$ plain form
2621.2 631461487 631289368 631216812 630802155 630595016 630448608 629913788 629419899 628902397 628527870 628240929
2630.8 628240929 627872086 627694054 627419128 626916161 626451836 626188965 625560570 624882698 624613304 624362602
2640.5 624362602 624008980 623591156 623481750 623076591 622731819 622580299 622134743 622046432 621688004 621270943
2650.1 621270943 620935211 620582504 620341454 619762535 619560051 619595947 619158211 618401413 618111458 618013802
2659.8 618013802 617875900 617588959 616664352 616290169 615918465 615364456 615153732 614764252 614506035 614007301
2669.4 614007301 613575478 613540535 613669662 613399582 612739906 612462540 612393417 612324486 611768570 611420174
2679 611420174 611426239 611221390 610822716 609914055 609546700 609732590 609564514 609156036 609046021 608970070
2688.7 608970070 608498497 608027153 607711868 607960396 607792473 607078743 606823311 606512833 606093674 605929642
$$ packed form
2621.2F31461487j72119p2556m14657k07139j46408n34820m93889n17502l74527k86941
2630.8F28240929l68843j78032k74926n02967m64325k62871o28395o77872k69394k50702
2640.5F24362602l53622m17824j09406m05159l44772j51520m45556q8311l58428m17061
2650.1F21270943l35732l52707k41050n78919k02484L5896m37736p56798k89955r7656
2659.8F18013802j37902k86941r24607l74183l71704n54009k10724l89480k58217m98734
2669.4F14007301m31823l4943J29127k70080o59676k77366o9123o8931n55916l48396
2679F11420174O065k04849l98674r08661l67355J85890j68076m08478j10015p5951
2688.7F08970070m71573m71344l15285K48528j67923p13730k55432l10478m19159j64032
$$ plain form
2698.3 605929642 605932465 605465965 605096474 604963799 604653282 604483261 604033203 603579063 603064651 602741013
2708 602741013 602731781 602356491 601826363 601388359 601308479 601270638 601003151 600300751 599455566 599032593 598750801
2718.6 598750801 598343430 598120422 598474998 597998505 597074890 596885452 596628647 596332169 595763206 595352631
2728.2 595352631 595471382 595451393 595201569 594873009 594220963 593647919 593955078 594090195 593873520 593462486
2737.9 593462486 592908325 592500343 591757851 591674156 592040710 592034492 591680527 591185074 590901108 590509872
2747.5 590509872 590189171 589953270 589941673 589428482 588498840 588297501 588196793 587971573 587656822 587607193
2757.2 587607193 587385712 586895790 586890411 586622849 586405563 586226158 585755844 585307159 584974747 584948883
2766.8 584948883 584892387 584895821 584466629 583569069 583085365 582680664 582325630 582325935 582125664 581382256 580771599
$$ packed form
2698.3F05929642K823m66500l69491j32675l10517j70021m50058m54140n14412l23638
2708F02741013r232l75290n30128m38004p9880l7841k67487p02400q45185m22973k81792
2718.6E98750801m07371k23008L54576m76493r23615j89438k56805k96478n68963m10575
2728.2E95352631J18751j9989k49824l28560o52046n73044L07159J35117k16675m11034
2737.9E93462486n54161m07982p42492q3695L66554o218l53965m95453k83966l91236
2747.5E90509872l20701k35901j1597n13191r29642k01339j00708k25220l14751m9629
2757.2E87607193k21481m89922n379k67562k17286j79405m70314m48685l32412k5864
2766.8E84948883n6496L434m29192q97560m83704m04701l55034L05k00271p43408o10657
$$ plain form
2777.4 580771599 580739250 580654144 580198822 579979248 579688835 578793030 578035583 577604446 576981964 576468735
2787 576468735 576532478 576345177 575644684 575182991 574742546 574102020 573445816 572909393 572311859 571924553
2796.7 571924553 571807251 571153793 570274773 569658432 569258537 568704605 568015518 567451057 566574097 565817184
2806.3 565817184 565294800 564602470 563922462 563111877 562157478 561207390 560222282 559189949 558241310
2815 558241310 557437248 556644859 555643539 554674377 554004707 552974968 551627083 550476685 549219780
2823.7 549219780 547885208 546352119 544460754 542908669 541491470 539567375 537508774 535791283
2831.4 535791283 534281349 532354088 530094833 527587204 524894028 522549706 519568825 515537987
2839.1 515537987 511323853 506911430 501904297 495793304 488609810 480623894 472029343 463090401
$$ packed form
2777.4E80771599l2349q5106m55322k19574k90413q95805p57447m31137o22482n13229
2787E76468735O3743j87301p00493m61693m40445o40526o56204n36423n97534l87306
2796.7E71924553j17302o53458q79020o16341l99895n53932o89087n64461q76960p56913
2806.3E65817184n22384o92330o80008q10585r54399r50088r85108j032333r48639
2815E58241310q04062p92389j001320r69162o69670j029739j347885j150398j256905
2823.7E49219780j334572j533089j891365j552085j417199j924095k058601j717491
2831.4E35791283j509934j927261k259255k507629k693176k344322k980881m030838
2839.1E15537987m214134m412423n007133o110993p183494p985916q594551q938942
$$ plain form
2846.8 463090401 453319740 442941513 432704010 423365898 415844917 409810295 405319443 402975349
2854.6 402975349 403073120 405557594 409607544 414479790 419946632 425546875 431259651 436937103 441863899
2863.2 441863899 446157570 449575005 452379761 454498444 455220413 455399513 455447159 455111961 454641075
2871.9 454641075 454797668 455608025 456208649 456990204 457987785 458408203 458466797 458538475 458448792 457884102
2881.6 457884102 457119484 456521568 455443153 454044533 452724304 450948219 448963127 446822014 444814644
2890.2 444814644 442942696 440434303 438256683 436598358 434530182 432256393 429930916 427513695
2897.9 427513695 424936523 422145805 419394341 416744347 413910103 410700912 406850891 402832870
2905.7 402832870 399341049 395651474 391494217 386953773 381782074 376192093 370252457 364000626
$$ packed form
2846.8D63090401r770661j0378227j0237503r338112p520981o034622m490852k344094
2854.6D02975349R7771K484474M049950M872246N466842N600243N712776N677452M926796
2863.2D41863899M293671L417435K804756K118683P21969J79100M7646l35198m70886
2871.9D54641075J56593Q10357O00624P81555R97581M20418N8594P1678q9683n64690
2881.6D57884102p64618n97916j078415j398620j320229j776085j985092k141113k007370
2890.2D44814644j871948k508393k177620j658325k068176k273789k325477k417221
2897.9D27513695k577172k790718k751464k649994k834244l209191l850021m018021
2905.7D02832870l491821l689575m157257m540444n171699n589981n939636o251831
$$ plain form
2913.4 364000626 357300491 350031815 342588272 335280266 327823601 320544510 314045467 308061886
2921.1 308061886 302825794 298458328 295551548 293939514 293150711 293467350 294536324 296896191 299790897
2929.8 299790897 303365917 307878380 312601967 318104172 323774567 329789696 336147652 342606659
2937.5 342606659 349182129 355309982 361310616 367745399 374217186 379642677 384363632 388628006
2945.2 388628006 392523499 396213722 399084969 401057587 402426300 403473473 404072227 404830551 405454674
2953.9 405454674 405640030 406355247 407107353 408393326 410528717 412716904 415287399 418651543 422509384
2962.6 422509384 426400146 430208893 434082909 438717232 443329735 447561836 452131424 456292000
2970.3 456292000 460097122 463929443 467890053 471960831 475340271 478201637 480949402 483265648
$$ packed form
2913.4C64000626o700135p268676p443543p308006p456665p279091o499043n983581
2921.1C08061886n236092m367466k906780j612034p88803L16639J068974K359867K894706
2929.8B99790897L575020M512463M723587N502205N670395O015129O357956O459007
2937.5C42606659O575470O127853O000634O434783O471787N425491M720955M264374
2945.2C88628006L895493L690223K871247J972618J368713J047173N98754P58324O24123
2953.9D05454674J85356P15217P52106J285973K135391K188187K570495L364144L857841
2962.6D22509384L890762L808747L874016M634323M612503M232101M569588M160576
2970.3D56292000L805122L832321L960610M070778L379440K861366K747765K316246
$$ plain form
2978 483265648 485697136 488192940 490339088 492869987 495079765 496574936 498325272 500124664 501550064
2986.7 501550064 502520218 503340378 504351273 505456429 506504555 506985779 507064667 507152252 507073936 507192001
2996.3 507192001 506818085 505447159 504251595 503542442 502841072 501390762 499775848 498484421 496857796
3005 496857796 495584908 494342995 493281136 493259430 493028603 492630501 493433495 494805412 495936699
3013.7 495936699 497631378 499384155 500804291 502507324 504185829 505710144 506451302 506824036 507634010
3022.4 507634010 508834305 509770966 509924316 510316200 510514069 510427818 510293961 509660530 509327736 509396324
3032 509396324 509374084 508866882 508452454 508326607 507789574 507069206 506459045 506180420 505914078 505483856
3041.6 505483856 504971237 504622231 504468613 503847084 502809029 501711540 501046410 500651703 500105057
$$ packed form
2978D83265648K431488K495804K146148K530899K209778J495171J750336J799392J425400
2986.7E01550064R70154Q20160J010895J105156J048126M81224P8888Q7585p8316J18065
2996.3E07192001l73916j370926j195564p09153p01370j450310j614914j291427j626625
3005D96857796j272888j241913j061859k1706k30827l98102Q02994J371917J131287
3013.7D95936699J694679J752777J420136J703033J678505J524315P41158L72734Q09974
3022.4E07634010J200295R36661J53350L91884J97869q6251j33857o33431l32794O8588
3032E09396324k2240n07202m14428j25847n37033p20368o10161k78625k66342m30222
3041.6E05483856n12619l49006j53618o21529j038055j097489o65130l94707n46646
$$ plain form
3050.3 500105057 499395142 498581123 498090820 497489204 496515160 495641937 495141602 494682961 493941803 493300133
3060 493300133 492699432 492067337 491389847 490503120 489928551 489895287 489460678 488398705 487575874 487026787
3069.6 487026787 486672821 486166992 485177650 484593201 484322319 483625565 482970390 482414055 481796112 481099854
3079.2 481099854 480187225 479919319 479713898 478724594 477905006 477361641 476806870 476343155 476133499 475617638
3088.9 475617638 474880180 474304810 473160133 472042084 471376457 471044922 470753746 470377083 470280838
3097.6 470280838 469644318 468704453 467856026 467040482 466380806 465464706 464623833 463967667 463486481 463146095
3107.2 463146095 462559547 461776581 461011200 460238533 459708366 459467850 458797989 457648964 456506958
3115.9 456506958 456102524 455604057 454436569 453976555 453661003 452973747 451939468 450722427 449867325
$$ packed form
3050.3E00105057p09915q14019m90303o01616r74044q73223n00335m58641p41158o41670
3060D93300133o00701o32095o77490q86727n74569l3264m34609j061973q22831n49087
3069.6D87026787l53966n05829r89342n84449k70882o96754o55175n56335o17943o96258
3079.2D81099854r12629k67906k05421r89304q19588n43365n54771m63715k09656n15861
3088.9D75617638p37458n75370j144677j118049o65627l31535k91176l76663r6245
3097.6D70280838o36520r39865q48427q15544o59676r16100q40873o56166m81186l40386
3107.2D63146095n86548p82966p65381p72667n30167k40516o69861j149025j142006
3115.9D56506958m04434m98467j167488m60014l15552o87256j034279j217041q55102
$$ plain form
3124.6 449867325 449003754 448289566 447494736 446963577 446605034 445631752 444895172 444155006 443106117
3133.3 443106117 442527695 441979065 440964050 439975624 439391632 438989258 438308411 437202225 436010170
3141.9 436010170 435242615 434820290 433997726 433090897 432236786 431085434 430140038 429534264 429128113
3150.6 429128113 428558846 427878532 427024040 425745773 424663506 423854599 423223457 422595596 421676064
3159.3 421676064 420652885 419714890 418637276 417587051 417078400 416822357 416397705 415396957 414296188
3168 414296188 413409233 412510567 411815338 410955963 410138893 409306183 408573875 407980614 407061729 406227493
3177.6 406227493 405064812 403814049 403037148 402473030 401793137 401138000 400623055 399588356 398638725
3186.3 398638725 397802544 396674004 395727654 395148544 394722290 393894920 392903709 391856117 390881729
$$ packed form
3124.6D49867325q63571p14188p94830n31159l58543r73282p36580p40166j048889
3133.3D43106117n78422n48630j015015r88426n83992m02374o80847j106186j192055
3141.9D36010170p67555m22325q22564r06829q54111j151352r45396o05774m06151
3150.6D29128113n69267o80314q54492j278267j082267q08907o31142o27861r19532
3159.3D21676064j023179r37995j077614j050225n08651k56043m24652j000748j100769
3168D14296188q86955q98666o95229q59375q17070q32710p32308n93261r18885q34236
3177.6D06227493j162681j250763p76901n64118o79893o55137n14945j034699r49631
3186.3C98638725q36181j128540r46350n79110m26254q27370r91211j047592r74388
$$ plain form
3195 390881729 390080032 389504623 389126930 388497543 387557526 386193771 385420265 385132675 384792023 384325600
3204.6 384325600 382970467 381923256 381472664 380842018 379822235 378825417 378400269 378011589 377513771
3213.3 377513771 376324310 375048714 374500656 374128265 373634491 372680321 371787338 371334534 371041374
3222 371041374 370432587 369494667 368538399 367558365 366885643 366657562 366472511 365700378 365122414 364882126
3231.6 364882126 364083061 363037491 361851578 360856514 360127258 359658051 359303894 358527069 357734337
3240.3 357734337 356786385 355792351 355375900 354874687 354108047 353694839 353198547 352559166 351929779 351268616
3249.9 351268616 350821648 350399742 350049782 349239311 348459511 348045807 346751823 345206146 344312325
3258.6 344312325 344316597 344328728 343617935 342761536 341920624 341184425 340233078 339845505 339619370 338613853
$$ packed form
3195C90881729q01697n75409l77693o29387r40017j363755p73506k87590l40652m66423
3204.6C84325600j355133j047211m50592o30646j019783r96818m25148l88680m97818
3213.3C77513771j189461j275596n48058l72391m93774r54170q92983m52804k93160
3222C71041374o08787r37920r56268r80034o72722k28081j85051p72133n77964k40288
3231.6C64882126p99065j045570j185913r95064p29256m69207l54157p76825p92732
3240.3C57734337r47952r94034m16451n01213p66640m13208m96292o39381o29387o61163
3249.9C51268616m46968m21906l49960q10471p79800m13704j293984j545677q93821
3258.6C44312325M272J2131p10793q56399q40912p36199r51347l87573k26135j005517
$$ plain form
3268.3 338613853 338037834 337983818 337583618 336357422 335231438 334834633 334570541 334233856 333537598
3276.9 333537598 332633934 331774712 331048851 330658417 330582924 330391464 330011177 329496307 328867912 328395767
3286.6 328395767 327885170 327399178 326857796 326615486 326430244 325653381 325095978 324836159 324710197 324433250
3296.2 324433250 323869514 323045387 322222252 321884766 321516533 321030388 320379562 320202942 320094109 319358215
3305.9 319358215 318877621 318268490 318002396 317972755 317445621 316905880 316361656 315970650 315347805 314503765
3315.5 314503765 314121971 313875542 313359489 313123074 312864189 312477818 312181225 311493702 311216011 310773220
3325.2 310773220 309981480 309778709 309520035 308780785 307669125 307107563 306951466 306899776 306442928 305248966
3334.8 305248966 304767761 304605656 304275799 303518105 302675457 302414360 301786995 301472569 301409016 300479679
$$ packed form
3268.3C38613853n76019n4016m00200j226196j125984l96805k64092l36685o96258
3276.9C33537598r03664q59222p25861l90434p5493j91460l80287n14870o28395m72145
3286.6C28395767n10597m85992n41382k42310j85242p76863n57403k59819j25962k76947
3296.2C24433250n63736q24127q23135l37486l68233m86145o50826j76620j08833p35894
3305.9C19358215m80594o09131k66094k9641n27134n39741n44224l91006o22845q44040
3315.5C14503765l81794k46429n16053k36415k58885l86371k96593o87523k77691m42791
3325.2C10773220p91740k02771k58674p39250j111660n61562j56097n1690m56848j193962
3334.8C05248966m81205j62105l29857p57694q42648k61097o27365l14426o3553r29337
$$ plain form
3344.4 300479679 299723854 299652252 299386196 299130993 299063549 298453655 297513103 296796703 296146126 295529346
3354.1 295529346 295164566 294545135 293938198 293528423 292993546 292552853 291836910 291401558 291052208 290436573
3363.7 290436573 289963322 289584312 289300900 288498497 287752895 287078400 286679249 286593895 286001091 285380630
3373.4 285380630 284421425 284001369 284065170 283667164 282797565 281732769 281525745 281255589 280878716 280443764
3383 280443764 279580841 278674450 278152237 278389053 278216743 278248119 278229256 277562637 277135792 276545315
3392.7 276545315 276196594 276396141 276651192 276185799 275566616 275344334 275405293 275721493 275434856 275203419
3402.3 275203419 274908333 274298553 273755054 273284893 273216133 273473644 273726063 273427887 273322353 273295727
3412 273295727 273356457 273491840 273044128 272644825 271941376 271819859 272064838 271926785 271970558 271924458
$$ packed form
3344.4C00479679p55825p1602k66056k55203o7444o09894r40552p16400o50577o16780
3354.1B95529346l64780o19431o06937m09775n34877m40693p15943m35352l49350o15635
3363.7B90436573m73251l79010k83412q02403p45602o74495l99151q5354n92804o20461
3373.4B85380630r59205m20056O3801l98006q69599j064796k07024k70156l76873m34952
3383B80443764q62923r06391n22213K36816j72310L1376j8863o66619m26845n90477
3392.7B76545315l48721J99547K55051m65393o19183k22282O0959L16200k86637k31437
3402.3B75203419k95086o09780n43499m70161o8760K57511K52419k98176j05534k6626
3412B73295727O0730J35383m47712l99303p03449j21517K44979j38053M3773m6100
$$ plain form
3421.6 271924458 272160625 272154980 272415371 272559853 272377567 272963943 273217163 273291397 273055325 272418900
3431.2 272418900 272652740 273533535 273914680 273582840 273860645 274876480 275609856 275623035 275148907 275022526
3440.9 275022526 275481186 275752506 276068420 276780872 277439404 277782803 277663841 278264942 278673458 278296585
3450.5 278296585 278746872 279600143 280155945 280595112 281130962 281640892 282345390 283080540 283382931 283483963
3460.2 283483963 283580818 284371033 284960613 285406418 286459579 287435188 287650223 287349052 288168030 288939114
3469.8 288939114 289394627 289983768 290081444 290575752 291163864 292097015 293136215 293805008 294085636 294584045
3479.5 294584045 295645294 295941429 296422729 297198505 298250370 299445286 300065441 300904160 301382809
3488.1 301382809 301931133 302853107 303591156 304200172 304971199 305804405 306219349 307007027 308156796
$$ packed form
3421.6B71924458K36167n645K60391J44482j82286N86376K53220P4234k36072o36425
3431.2B72418900K33840Q80795L81145l31840K77805J015835P33376J3179m74128j26381
3440.9B75022526M58660K71320L15914P12452O58532L43399j18962O01101M08516l76873
3450.5B78296585M50287Q53271N55802M39167N35850N09930P04498P35150L02391J01032
3460.2B83483963R6855P90215N89580M45805J053161R75609K15035l01171Q18978P71084
3469.8B88939114M55513N89141R7676M94308N88112R33151J039200O68793K80628M98409
3479.5B94584045J061249K96135M81300P75776J051865J194916O20155Q38719M78649
3488.1C01382809N48324R21974P38049O09016P71027Q33206M14944P87678J149769
$$ plain form
3496.8 308156796 308973007 309211941 309714298 310973320 312120667 312727184 313222694 314385319 315371151
3505.5 315371151 316053257 316795101 318112183 319056911 319002876 319973946 320790062 321689262 322890434
3514.2 322890434 323588181 324668083 325833549 326555901 326853104 327695465 328737755 329732628 329955063
3522.9 329955063 329694595 331459732 333422050 334648514 335056076 335405540 336727219 338450356 339790497
3531.5 339790497 340733681 342077637 342500801 343072891 343603554 344254227 346518250 347980080 349120560
3540.2 349120560 350060844 350940132 351966057 352791176 353468437 353819084 355217171 356349564 358050194
3548.9 358050194 359541283 361072693 362375832 362035980 363641891 364575081 366210518 368157845 368487701
3557.6 368487701 369898376 370940704 371678085 371799049 373553162 374998283 375421638 378047295 377488060
$$ packed form
3496.8C08156796Q16211K38934N02357J259022J147347O06517M95510J162625R85832
3505.5C15371151O82106P41844J317082R44728n4035R71070Q16116Q99200J201172
3514.2C22890434O97747J079902J165466P22352K97203Q42361J042290R94873K22435
3522.9C29955063k60468J765137J962318J226464M07562L49464J321679J723137J340141
3531.5C39790497R43184J343956M23164N72090N30663O50673K264023J461830J140480
3540.2C49120560R40284Q79288J025925Q25119O77261L50647J398087J132393J700630
3548.9C58050194J491089J531410J303139l39852J605911R33190J635437J947327L29856
3557.6C68487701J410675J042328P37381J20964J754113J445121M23355K625657n59235
$$ plain form
3566.2 377488060 378171463 380017509 381198692 384312210 386835213 389359245 391006470 392637901
3574 392637901 393751793 395303612 397792397 398690300 400625687 402296104 403579445 405647087 407701378
3582.6 407701378 409013557 409651985 412701645 413393707 411928902 414334946 415873718 418844223 421877365
3591.3 421877365 424040794 424874420 426104546 428758583 428707848 431186981 434216461 434805031 436804352
3600 436804352 437933426 439703712 442872276 445373535 447399902 449464378 450193100 449188194 453068161
3608.7 453068161 453795776 453825798 459447403 459802399 459358864 462825241 463182373 467004662 469877281
3617.4 469877281 469365845 470736694 470990944 473469849 477482605 479688606 480988197 482662201 483447685
3626 483447685 485276642 490426140 489737701 484014740 487858734 492480469 497193947 498173218 497232895
$$ packed form
3566.2C77488060O83403J846046J181183L113518K523003K524032J647225J631431
3574C92637901J113892J551819K488785Q97903J935387J670417J283341K067642K054291
3582.6D07701378J312179O38428L049660O92062j464805K406044J538772K970505L033142
3591.3D21877365K163429Q33626J230126K654037n0735K479133L029480N88570J999321
3600D36804352J129074J770286L168564K501259K026367K064476P28722j004906L879967
3608.7D53068161P27615L0022N621605L54996m43535L466377L57132L822289K872619
3617.4D69877281n11436J370849K54250K478905M012756K206001J299591J674004P85484
3626D83447685J828957N149498o88439n722961L843994M621735M713478R79271r40323
$$ plain form
3634.7 497232895 500071831 503572426 505654335 505976639 507152023 509078712 511018028 511997986 512629852
3643.4 512629852 514725838 516919060 518831177 514530716 513167152 518355217 517037010 516899071
3651.1 516899071 520084229 525438118 529249191 532217484 534617767 528829689 532244530 537155838
3658.8 537155838 537711411 538839073 539812889 541630554 542207146 542730446 543897171 544445534 547425308
3667.5 547425308 547967644 545845146 545907021 542261086 545589294 552284966 556410217 549392662 536542587
3676.2 536542587 544507713 554185638 558457756 556809464 557962379 560956459 562448463 563004570
3683.9 563004570 563124886 563157196 565547714 569091949 560951385 560229530 567820740 564486771 565541039
3692.6 565541039 569531593 569590378 571399651 571722221 571455727 572494011 572851105 574981422 575994110
$$ packed form
3634.7D97232895K838936L500595K081909L22304J175384J926689J939316R79958O31866
3643.4E12629852K095986K193222J912117m300461j363564N188065j318207j37939
3651.1E16899071L185158N353889L811073K968293K400283n788078L414841M911308
3658.8E37155838N55573J127662R73816J817665N76592N23300J166725N48363K979774
3667.5E47425308N42336k122498O1875l645935L328208O695672M125251p017555j2850075
3676.2E36542587P965126R677925M272118j648292J152915K994080J492004N56107
3683.9E63004570J20316L2310K390518L544235q140564p21855P591210l333969J054268
3692.6E65541039L990554N8785J809273L22570k66494J038284L57094K130317J012688
$$ plain form
3701.3 575994110 571232338 571143456 575264397 575545807 575417747 576331329 578103714 579898834 573072433
3709.9 573072433 575468750 577573013 569086685 574441109 578519936 578768768 579343262 581278763 582020760
3718.6 582020760 579485626 581295319 584586639 578888702 576571579 581696625 582244987 581783180 580345726
3727.3 580345726 581196671 583829765 583707237 586667786 581899796 576985512 583605843 581894150 575462303
3736 575462303 577098274 580425911 581649132 584249344 586423454 583222923 585960350 593816414 580696030
3744.7 580696030 569526253 579616280 585001297 589611168 585724449 576849937 585197563 580554924
3752.4 580554924 577223930 583741455 588395538 590580101 585797615 587945786 591530228 585115776
3760.1 585115776 585288429 589162178 590064850 590550232 592484322 588810349 586996002 590761452 593909798
$$ packed form
3701.3E75994110m761772q8882M120941K81410j28060R13582J772385J795120o826401
3709.9E73072433K396317K104263q486328N354424M078827K48832N74494J935501P41997
3718.6E82020760k535134J809693L291320n697937k317123N125046N48362m61807j437454
3727.3E80345726Q50945K633094j22528K960549m767990m914284O620331j711693o431847
3736E75462303J635971L327637J223221K600212K174110l200531K737427P856064j3120384
3744.7E80696030j1169777J0090027N385017M609871l886719q874512Q347626m642639
3752.4E80554924l330994O517525M654083K184563m782486K148171L584442o414452
3760.1E85115776J72653L873749R02672M85382J934090l673973j814347L765450L148346
$$ plain form
3768.8 593909798 593077850 586456528 588688011 591709175 591865921 591800232 591487007 592610664 593163490
3777.4 593163490 595102005 593693924 588702888 591604118 592869186 592932472 593305550 590642548 591180038
3786.1 591180038 593397942 594316826 594854584 594765244 594700546 594530869 594277420 593527260 593753548 594872665
3795.8 594872665 590494156 587923393 591148033 593949356 595794525 587706718 581417809 587901649
3803.5 587901649 592081947 595691071 598618202 589301262 587678108 592977867 594726677 595040283
3811.2 595040283 595051804 594626694 595588188 598785553 594109993 583482857 589637489 595008926 596775818
3819.9 596775818 593789253 581634789 586407967 592113152 594124451 595891457 595493736 592443733
3827.6 592443733 593423767 595734749 597548599 596509323 590256271 593683624 598217239 591542969
$$ packed form
3768.8E93909798q31948o621322K231483L021164J56746o5689l13225J123657N52826
3777.4E93163490J938515j408081m991036K901230J265068O3286L73078k663002N37490
3786.1E91180038K217904R18884N37758q9340o4698j69677k53449p50160K26288J119117
3795.8E94872665m378509k570763L224640K801323J845169q087807o288909O483840
3803.5E87901649M180298L609124K927131r316940j623154N299759J748810L13606
3811.2E95040283J1521m25110R61494L197365m675560j0627136O154632N371437J766892
3819.9E96775818k986565j2154464M773178N705185K011299J767006l97721l050003
3827.6E92443733R80034K310982J813850j039276o253052L427353M533615o674270
$$ plain form
3835.3 591542969 591372375 596227188 587132072 586340141 593302612 590225220 591791000 596626396 594613266
3844 594613266 593287926 595532875 596729507 596149025 595868340 594352837 595424423 597199554 589633865
3852.7 589633865 590942307 581485100 585620651 595075493 593760262 593234787 596230431 597790222
3860.4 597790222 598530922 593073044 592558174 595933113 590820541 589513283 593811874 597323685 599232178
3869.1 599232178 590144348 585442543 590903435 596531830 597805595 590786667 592969398 596455193
3876.8 596455193 596129837 597015572 598262177 592694702 590239258 595558929 595640068 596478882 599141388
3885.4 599141388 590255013 592575798 595853920 596584320 599051094 595624886 589745560 592855759
3893.2 592855759 595834351 595028610 596302261 596623955 597200623 596320534 589014359 594140244 594409027
$$ packed form
3835.3E91542969j70594M854813r095116p91931O962471l077392J565780M835396k013130
3844E94613266j325340K244949J196632n80482k80685j515503J071586J775131p565689
3852.7E89633865J308442r457207M135551R454842j315231n25475K995644J559791
3860.4E97790222P40700n457878n14870L374939n112572j307258M298591L511811J908493
3869.1E99232178r087830m701805N460892N628395J273765p018928K182731L485795
3876.8E96455193l25356Q85735J246605n567475k455444N319671Q1139Q38814K662506
3885.4E99141388q886375K320785L278122P30400K466774l426208n879326L110199
3893.2E92855759K978592q05741J273651L21694N76668q80089p306175N125885K68783
$$ plain form
3901.8 594409027 590388336 594533005 590786514 589948120 591793785 593978844 596238708 595512009 595785942
3910.5 595785942 595495338 595267639 595670929 595727310 596554680 596546707 593437424 591787300 595112228 594671593
3920.2 594671593 592188301 594937210 596238098 595825920 593613281 592167206 593959961 594453506 594338036
3928.8 594338036 593066635 592498474 593588753 591751213 591855545 593925858 593953285 594109459 594717026
3937.5 594717026 595049744 595049095 594091873 594445229 594479637 592126770 593230553 594720726 594990234 594697037
3947.2 594697037 592614059 593110466 592517395 591073380 592746124 593017654 592916603 593638458 594267654
3955.8 594267654 594206810 593497314 593713608 593397636 593530960 593517036 592513008 593231773 594120140 594009514
3965.5 594009514 593687401 593631210 593599510 592872162 592656784 593019600 592729568 592339897 592228813 592558136
$$ packed form
3901.8E94409027m020691M144669l746491q38394J845665K185059K259864p26699K73933
3910.5E95785942k90604k27699M03290N6381Q27370p973l109283j650124L324928m40635
3920.2E94671593k483292K748909J300888m12178k212639j446075J792755M93545j15470
3928.8E94338036j271401n68161J090279j837540J04332K070313K7427J56174O07567
3937.5E94717026L32718o49r57222L53356L4408k352867J103783J490173K69508k93197
3947.2E94697037k082978M96407n93071j444015J672744K71530j01051P21855O29196
3955.8E94267654o0844p09496K16294l15972J33324j3924j004028P18765Q88367j10626
3965.5E94009514l22113n6191l1700p27348k15378L62816k90032l89671j11084L29323
$$ plain form
3975.1 592558136 593047714 593224373 593956032 594106903 593613930 593669548 593234787 592325516 591705818 591799164
3984.8 591799164 592140656 592588882 593027534 592989845 593077202 592871132 592562408 592293968 591738548 591329041
3994.4 591329041 591671791 593277969 594198570 593450546 592501640 591983986
4000.2 591983986
$$ packed form
3975.1E92558136M89578J76659P31659J50871m92973N5618m34761r09271o19698R3346
3984.8E91799164L41492M48226M38652l7689Q7357k06070l08724k68440n55420m09507
3994.4E91329041L42750J606178R20601p48024r48906n17654
4000.2E91983986
##END=$$ End of the data block
