##TITLE=$$ Begin of the data block
##JCAMP-DX=5.00 $$ ACD/SpecManager v 10.08
##SPECTROMETER/DATA SYSTEM=Varian
##DATE=04 Dec 2012 13:23:16
##DATA TYPE=INFRARED SPECTRUM
##DATA CLASS=XYDATA
##ORIGIN=
##OWNER=
##NPOINTS=3735
##FIRSTX=399.26403809
##LASTX=4000.35498047
##MAXX=4000.35498047
##MINX=399.26403809
##MAXY=68.82624054
##MINY=33.07819366
##XFACTOR=1.0000000000
##YFACTOR=0.000000100000000
##FIRSTY=56.21180725
##DELTAX=0.96440572
##XUNITS=1/CM
##YUNITS=TRANSMITTANCE
##XYDATA=(X++(Y..Y))
399.3E62118073j2901192j436768J3680077L958587r077224K923813M685516o236610
407E57714272q224297n42374O974831K204018j403428K9717K011795J338768O31523
415.7E60734825M318810m134446j8353996L162155J1540070N371895R60693k957306
423.4E60642700j397247K936439L92647o386719k989845K659760M673690m815635j0237541
432.1E45478249K462844M556427k69012J922112J68609k335586o57769o09283Q45566
440.7E51562157K414093K055893k006379m22782O272697J770706j897735O80351k560349
449.4E57868652n227737l12386O369782J262894M4860J414070l38287J96381m919472
458.1E56358757J222382J027717q99887R15489k206230j534233j237831k827034M55055
$$ y = [562118073, 549216881, 547780113, 561460190, 565418777, 556341553, 559265366, 563950882, 557714272, 549489975, 548947601, 555922432, 558126450, 556723022, 556752739, 558764534, 560103302, 560734825, 565053635, 560919189, 542565193, 545727348, 557267418, 562639313, 563600006, 560642700, 559245453, 562181892, 562574539, 556187820, 553197975, 555857735, 560531425, 555715790, 545478249, 547941093, 552497520, 552228508, 554150620, 554319229, 551983643, 551325874, 550716591, 551562157, 553976250, 556032143, 554025764, 553602982, 559875679, 561646385, 559748650, 560429001, 557868652, 552640915, 552328529, 558698311, 559961205, 560006065, 561420135, 561081848, 561278229, 556358757, 557581139, 558608856, 557708969, 558624458, 556418228, 554883995, 553646164, 550819130, 551274185]
466.8E51274185P177468R44824l677826J124115k764702l936539j632232j385727k661286
475.5E44462280k878113L857041L834724p29904j221313J92566K053985K093888l987198
484.1E47677956m840508k186012k149887J273308l48893L832779M945526k271499M00467
492.8E46333237Q90159l472290m783859N02014K243385k903594k430306r03053k605210
501.5E32870483j167945N090637J517677k512398k179870l200837r50012j012420j589890
510.2E26865425k738571p5111L799209J260796M85763p79495m047394l063431K89536
518.9E21996727k145500m160423k38228P34710j136856k282104k52915J447716K015648
527.5E15978775L038521Q49686j744881k028351j570740k278518o09627K139664K335739
$$ y = [551274185, 558451653, 559396477, 555718651, 556842766, 554078064, 550141525, 548509293, 547123566, 544462280, 541584167, 545441208, 549275932, 548546028, 547324715, 547517281, 549571266, 551665154, 547677956, 542837448, 540651436, 538501549, 539774857, 539425964, 543258743, 548204269, 545932770, 546333237, 547223396, 543751106, 538967247, 539469261, 541712646, 538809052, 536378746, 535475693, 532870483, 531702538, 536793175, 538310852, 535798454, 533618584, 530417747, 529467735, 528455315, 526865425, 524126854, 524051743, 527850952, 529111748, 529597511, 528818016, 524770622, 521707191, 521996727, 519851227, 515690804, 515452576, 516187286, 515050430, 512768326, 512515411, 513963127, 515978775, 519017296, 519866982, 518122101, 516093750, 514523010, 512244492, 511634865, 513774529, 516110268]
536.2E16110268J666298J377868R93195N92727K750473K595482m43153k230225k550392
544.9E20862541Q0223Q92487N26504J293946J394806Q24356M2686O11572j01928k131653
554.5E24295540l158837k421875j402397m80804Q49190K53486K13013P4921l82958
563.2E17839279l59917j604194k412033k579003k626800l097954j747551q26492k80686
571.9E02304649P20368K74963Q43315M41246j691971j466407M89921J301384J093712
580.6E04311180j75094J559906M295082K571754J616287J650238K244530P53441r42307
589.3E17885017j25846j368790j081123J70173J497307J931839J94740J468811K245903
597.9E22818031O45447o35033m87899j086121k181358j943322r64736J159858K211609
$$ y = [516110268, 517776566, 519154434, 520147629, 520740356, 523490829, 526086311, 525643158, 523412933, 520862541, 520942764, 521835251, 522361755, 523655701, 525050507, 525874863, 525917549, 526529121, 526427193, 524295540, 521136703, 518714828, 517312431, 516831627, 517680817, 517934303, 518147316, 518222237, 517839279, 517479362, 515875168, 513463135, 510884132, 508257332, 505159378, 503411827, 502585335, 502304649, 503025017, 503299980, 504143295, 504584541, 502892570, 501426163, 501916084, 503217468, 504311180, 504136086, 505695992, 509991074, 512562828, 514179115, 515829353, 518073883, 518827324, 517885017, 517759171, 516390381, 515309258, 515479431, 516976738, 518908577, 519103317, 520572128, 522818031, 523463478, 522828445, 522340546, 521254425, 519073067, 517129745, 516165009, 517324867, 519536476]
606.6E19536476J623421J48887J141587J468887o64329j028252j078835O43464P17735
615.3E22509041p40738p63512P83654L766632L142738K250595J472855R70688N87806
624E33979759j061058n8594L88222Q04138K386742J876335Q33473J489220K737846
632.7E43376083J723214l65982r42917J75819j49116j061478Q1940J019210O77491
641.3E44534264o9771J540603K779923J715889N78613n35660p52372j086846q62312
650E47842331k73666L84712J125107L55148O59408R51043J070442N80787r54437p35779
659.7E51005096m72450l73688l99017p35702j47553J698723K188377j862945p924881
668.3E42975960O389313N002250R42650r08890m23012j282272j315307L56636J116600
$$ y = [519536476, 521159897, 521308784, 522450371, 523919258, 523254929, 522226677, 521147842, 521791306, 522509041, 521768303, 521004791, 521788445, 525555077, 528697815, 530948410, 532421265, 533391953, 533979759, 532918701, 532860107, 533248329, 534052467, 536439209, 538315544, 539149017, 540638237, 543376083, 545099297, 544733315, 543790398, 543966217, 543817101, 542755623, 542837563, 543856773, 544534264, 544464493, 546005096, 548785019, 550500908, 551079521, 550543861, 549791489, 548704643, 547842331, 547568665, 547953377, 549078484, 549433632, 550093040, 551044083, 552114525, 552695312, 551740875, 551005096, 550532646, 550158958, 549759941, 549024239, 548876686, 550575409, 552763786, 550900841, 542975960, 549365273, 554367523, 555310173, 554401283, 553978271, 552695999, 551380692, 551737328, 552853928]
677E52853928R59587J912765K133446J044617O99005M09164j28784j602821j552887
685.7E56728020l08457J50299O37322J049957K040672J451989Q55636O2714j172104
694.4E61496048n56870j633033k119828j854629j319580k97241l74680L12500M63295
703.1E54115982J385918J238556l69225n41115k024803k341843j030044m7302r804
711.7E50376320L52135K114448K074013K389221J956253k17209l39355q77762o67496
720.4E57160568P72133L33328P14989J887169K850571M393959M267883J827316K67296
729.1E74475212M12445L75977N69801R54742l5705K4567J278190K462082L165131K581520
738.7E86263962J947021L23029k2583m02680j757087j400528k047386m19770Q42514
$$ y = [552853928, 553813515, 555726280, 557859726, 558904343, 559603348, 560012512, 559883728, 558280907, 556728020, 556419563, 556569862, 557207184, 558257141, 560297813, 561749802, 562605438, 562668152, 561496048, 560939178, 559306145, 557186317, 555331688, 554012108, 553714867, 553340187, 553652687, 554115982, 555501900, 556740456, 556371231, 555830116, 553805313, 551463470, 550433426, 550386124, 550376320, 550728455, 552842903, 554916916, 557306137, 559262390, 559045181, 558705826, 557828064, 557160568, 557932701, 558266029, 558981018, 560868187, 563718758, 568112717, 572380600, 574207916, 574475212, 574887657, 575263634, 575833435, 576788177, 576752472, 576777039, 578055229, 580517311, 583682442, 586263962, 588210983, 588534012, 588511429, 588108749, 586351662, 584951134, 582903748, 582483978, 583326492]
747.4E83326492J089974K415924R18922K92969p76634k135658j446648j277771j782608
756.1E80624962j996269j055718k39906J30195k15187N58434J584625M72984k14309
764.8E79649811l49236l18718j131630n00946J143761J326675K503167K726631K709808
773.5E87759323L430138L101349J258010o6452J035691J088409P71904P04079Q87375
782.1E99969826J623459J834640J366081J526375K818260J501809J99432J08604N8785
790.8F11007271l88184j639747K975J401405Q34542J676521L460464L208581K163925
799.5F21727753J023407o14701K41738m47579o75277P85713O69288O60172R71184K282486
809.1F26624184K013473J522713J021309j81999n27420r56231r72595j684685j78070
$$ y = [583326492, 584416466, 586832390, 587751312, 588044281, 587267647, 585131989, 583685341, 582407570, 580624962, 578628693, 577572975, 577333069, 577463264, 577248077, 577806511, 579391136, 579864120, 579649811, 579300575, 578981857, 577850227, 577349281, 578493042, 579819717, 582322884, 585049515, 587759323, 591189461, 594290810, 595548820, 595482368, 596518059, 597606468, 598378372, 599082451, 599969826, 601593285, 603427925, 604794006, 606320381, 609138641, 610640450, 610839882, 610948486, 611007271, 610619087, 608979340, 608982315, 610383720, 611218262, 612894783, 616355247, 619563828, 621727753, 622751160, 622136459, 622378197, 621930618, 621255341, 622041054, 622710342, 623370514, 624341698, 626624184, 628637657, 630160370, 631181679, 630999680, 630472260, 629516029, 628543434, 626858749, 626680679]
817.8F26680679J022377L40309J143685J644325J197357o31027j130943q59299j440468
826.5F27966995k552795l304711k257919q71200L70941N37300N26466n7411m65279
835.2F19892387J89400j343040k869797k994270l031540k121849o4927j76239p08503
843.9F06771622J112556J349259M90837m91257j742554k467308k393799j330452q08143
852.5F00490761m81415j78490K12059J213189J672058Q43315k5902r21402j800346
861.2F01023827p73049j23901K3537P62710K132301L446351L694000M461937L056259
869.9F17703972J794433K085152N88951m41742q38241L95813J745376J757393J657715
878.6F26448822J857071J355667M63104P51992p72400k485199l329621k348861q28057
$$ y = [626680679, 627703056, 628043365, 629187050, 630831375, 632028732, 631397705, 630266762, 629407463, 627966995, 625414200, 622109489, 619851570, 618980370, 619351311, 619888611, 620415077, 620357666, 619892387, 620081787, 618738747, 615868950, 612874680, 609843140, 607721291, 607656364, 607480125, 606771622, 607884178, 609233437, 609724274, 609233017, 607490463, 605023155, 602629356, 601298904, 600490761, 600009346, 599830856, 600042915, 601256104, 602928162, 603771477, 603745575, 602824173, 601023827, 600250778, 600126877, 600150414, 600913124, 603045425, 606491776, 610185776, 614647713, 617703972, 619498405, 621583557, 622172508, 621730766, 620892525, 621288338, 623033714, 624791107, 626448822, 628305893, 629661560, 630124664, 630876656, 630104256, 627619057, 624289436, 621940575, 621112518]
887.3F21112518j629333j657028j525994o99768J99204J2397k46772k002411l043862
895.9F10518951k131958j848869k070312j200371r54704j026955n01595k78015l69491
904.6F00136681q29201j183472k067337k925682k840958k444572l076172k959366j443023
913.3E80366898j538773j262436j062431j622467j950646k691726k401047k684250
921E65153122k535629q12989j234130k257042q68798Q01583J125183Q97674O85273
929.7E60954247q3199p83997o18782k47116M1580j5068K99759J258164J250152J328202
939.3E63383942J796608J702461J467247L38402L7536l3951j039505q38584j132164
948E65681992j353493p95670p62253o03446j131058j635628j935501l744164m712677
$$ y = [621112518, 619483185, 617826157, 616300163, 615600395, 615799599, 615811996, 615565224, 613562813, 610518951, 608386993, 606538124, 604467812, 603267441, 602312737, 601285782, 600784187, 600506172, 600136681, 599307480, 598124008, 596056671, 593130989, 590290031, 587845459, 584769287, 581809921, 580366898, 578828125, 577565689, 576503258, 574880791, 572930145, 570238419, 567837372, 565153122, 562617493, 561804504, 560570374, 558313332, 557444534, 558246117, 559371300, 560268974, 560954247, 560871048, 560087051, 559468269, 559221153, 559262733, 559247665, 559547424, 560805588, 562055740, 563383942, 565180550, 566883011, 568350258, 568688660, 568726196, 568692245, 567652740, 566814156, 565681992, 564328499, 563532829, 562770576, 562167130, 561036072, 559400444, 557464943, 553720779, 549008102]
956.7E49008102l920402m062004m292984l465882l099975l069420k766876l392105
964.4E20938454m036255m662247m591446n010071o901283o279030n771217n983162
972.1D77703743o014214n644302m420547n254174o190529o344757n850906o822777
979.8D31161537o986847o069908n802536m211235m342079l198547k875634k954483
987.6C94720268k546653k920304k133636k085076j321602k376785j594925n34782l67317
996.2C78839188P75680O8360P50694K74429R60121k23617j214028M35715l51677l02887
1005.9C80011978j699982o83174l357m64058K09885m20990j83449j822357j467666
1014.6C73476830j247368j054039n37911o96754M17442l02429O27327J16691M30184
$$ y = [549008102, 545087700, 541025696, 536732712, 533266830, 530166855, 527097435, 524330559, 520938454, 516902199, 512239952, 507648506, 502638435, 495737152, 489458122, 483686905, 477703743, 471689529, 466045227, 461624680, 456370506, 450179977, 443835220, 437984314, 431161537, 424174690, 418104782, 412302246, 408091011, 403748932, 400550385, 397674751, 394720268, 392173615, 389253311, 387119675, 385034599, 383712997, 381336212, 379741287, 379206505, 378839188, 379614868, 379683228, 380433922, 380708351, 381668472, 381444855, 380230827, 380666542, 380314865, 380011978, 378311996, 377628822, 377625465, 377161407, 377371292, 376950302, 376766853, 374944496, 373476830, 372229462, 371175423, 370637512, 369940758, 370358200, 370055771, 370683098, 370799789, 371229973]
1023.2C71229973Q56209J28288Q34579M07181J043511J19667M90036K05574q7395R68208
1032.9C76195831O71959J352120O43272J283150k01721k84844N50995j143303L64418
1041.6C79431877O66466O86149m83207k62757M28086J54381Q87031L72467J543732
1050.2C83424225N77698P75299J834907J739464P72705k9526J854363K065124L698578
1058.9C96712837K686463K058792K980270K514572L593674L436775L550263J137428
1066.6D18671074J428909J535797q53882l22914j754608k443428l465347l142433l310776
1075.3D06342392l875275k119484k111244r71832j314774R6283L43972L77883K062226
1084C98830147J558952K392082J794968J837959N12238M57306K183723J981507J813201
$$ y = [371229973, 372086182, 372214470, 373049049, 373456230, 374499741, 374619408, 375109444, 375315018, 375227623, 376195831, 376867790, 378219910, 378863182, 380146332, 379944611, 379659767, 380210762, 379067459, 379431877, 380098343, 380784492, 380301285, 380038528, 380466614, 380620995, 381508026, 381880493, 383424225, 384001923, 384777222, 386612129, 388351593, 389124298, 389094772, 390949135, 393014259, 396712837, 399399300, 401458092, 404438362, 406952934, 410546608, 413983383, 417533646, 418671074, 420099983, 421635780, 420781898, 420458984, 418704376, 416260948, 412795601, 409653168, 406342392, 402467117, 400347633, 398236389, 397264557, 395949783, 396046066, 396390038, 396767921, 398830147, 400389099, 402781181, 404576149, 406414108, 406926346, 407383652, 409567375, 411548882, 413362083]
1092.7D13362083J368676K478103J744080J785812J015854L16239J105651j23710N35621
1101.4D23588409k33345j90315L24402P48100J596833J059570J536751J056785J636772
1110D31123962P97272O51589J205902J01280K60506J12571J332169J353340J849861
1118.7D38788452J740570N17731J025162Q22143J029358j60637J30120Q99543O24123
1127.4D45416565J131134J928596K854233J218300R79309J144524M72183k37236j119957
1136.1D53787651j131706j763992j497460j681137j484222j915169j734581q52471
1143.8D41726913k237663j588592k175942k559967k604904k651901j490364j885834
1151.5D24531746q99696o58455J85661j25237p20291l44352j153260n76210o5994J308746
$$ y = [413362083, 414730759, 417208862, 418952942, 420738754, 421754608, 422070847, 423176498, 423052788, 423588409, 423355064, 423164749, 423489151, 424237251, 425834084, 426893654, 428430405, 429487190, 431123962, 431921234, 432572823, 433778725, 433880005, 434140511, 434253082, 435585251, 436938591, 438788452, 440529022, 441046753, 442071915, 442894058, 443923416, 443762779, 443892899, 444792442, 445416565, 446547699, 448476295, 451330528, 452548828, 453528137, 454672661, 455144844, 454907608, 453787651, 452655945, 450891953, 449394493, 447713356, 446229134, 444313965, 442579384, 441726913, 439489250, 437900658, 435724716, 433164749, 430559845, 427907944, 426417580, 424531746, 423632050, 422973595, 423159256, 423034019, 422313728, 421969376, 420816116, 420239906, 420173912, 421482658]
1161.1D21482658R41162J451874K237931K039451L151512L445893M429245L227310
1168.9D42407036L043899L250847L106766L747864L799095M455795L268814M145661
1176.6D71225777N041732M694901M333992L574295M050980L602142L234711K424621
1184.3E02183151K368088K593803K160416K934570L052292K322502J881447K319184
1192E21815453J544494P30286N27038j59797M56543P06100L63732J65290M85306J085320
1201.6E27719765J142235P57789P1831M23546L90510L93448O34613K79389J55983J86767
1211.3E32155876J182861J481553J215248J199493J260300J429481N53589j69945l87191
1220E39921265n28832p35283o48536K19841M21257m3717l33824k76108p29713j147461
$$ y = [421482658, 422423820, 423875694, 426113625, 428153076, 431304588, 434750481, 439179726, 442407036, 445450935, 448701782, 451808548, 455556412, 459355507, 463811302, 467080116, 471225777, 476267509, 480962410, 485296402, 488870697, 492921677, 496523819, 499758530, 502183151, 504551239, 507145042, 509305458, 512240028, 515292320, 517614822, 519496269, 521815453, 523359947, 524090233, 524617271, 524457474, 524914017, 525620117, 525983849, 526149139, 526634445, 527719765, 528862000, 529619789, 529691620, 530115166, 530505676, 530899124, 531533737, 531813126, 531969109, 532155876, 533338737, 534820290, 536035538, 537235031, 538495331, 539924812, 540478401, 540308456, 539921265, 539392433, 538657150, 538008614, 538228455, 538649712, 538605995, 538272171, 537996063, 537266350, 536118889]
1229.6E36118889j083031j078148p42454j273499j467018r64279o37398J18027M02717
1238.3E29393806M89197L15476k22588n28679k73590k08435k88620J34811L20092P96661
1247.9E29928131J439667J692390J599655J232453N49202L73306M22897L5325k23275
1256.6E37049751l52020K44255P90253R89074J489411J528244J209068O88095M99001
1265.3E44135132J21422k37198o7063o7787L06473R38225J135330J308289J382446
1274E48955269J020508R12094M98276l32528q10470o88744j17531J48278L82576M97589
1283.6E50465317Q97865J495857J117058O78291K85416j58920l63350n06554p77397
1292.3E53133583p06253l48396J5030O21681Q78372L97911j69945j06659k13546o85578
$$ y = [536118889, 535035858, 533957710, 533215256, 531941757, 530474739, 529510460, 528873062, 528991089, 529393806, 529883003, 530198479, 529975891, 529447212, 529173622, 528965187, 528676567, 528811378, 529131470, 529928131, 531367798, 533060188, 534659843, 535892296, 536441498, 536814804, 537237701, 537273026, 537049751, 536697731, 536941986, 537732239, 538721313, 540210724, 541738968, 542948036, 543636131, 544135132, 544256554, 544019356, 543952293, 543884506, 544190979, 545129204, 546264534, 547572823, 548955269, 549975777, 550887871, 551386147, 551053619, 550243149, 549554405, 549436874, 549585152, 549967728, 550465317, 551363182, 552859039, 553976097, 554654388, 554939804, 554780884, 554417534, 553910980, 553133583, 552427330, 552078934, 552093964, 552715645, 553594017, 553991928, 553821983, 553715324, 553501778, 552816200]
1301.9E52816200r05151r60770o96106o40106o6528P30705L45993N1041K78053P9956
1311.6E51033287n01823q02079q34541p79877j070594j013298k16599p1220J08223
1320.3E45851479K63938K1554j30845o95610p89604l71589p41959j228790j044465
1328.9E41134109j058692j036835l82881N0239r5253n87883o55250k86484k71263n78613
1338.6E36231194j282273p63664m5967k38266P7286M38537P75604M66156M65203N01480
1348.2E36625290l98674o72608n69381o70395q06923n03578k02408L0022K74238J13182
1357.9E33218765M60167J14289p82700j132431j214333j733741j161118n16319k86064
1366.6E26966515L77235P4997k58980M73633L04069J07537o30722j074867n85595m61540
$$ y = [552816200, 551911049, 550950279, 550254173, 549614067, 549547539, 550278244, 550624237, 550675278, 550953331, 551033287, 550531464, 549729385, 548894844, 548114967, 547044373, 546031075, 545814476, 545743256, 545851479, 546115417, 546136971, 546006126, 545310516, 544520912, 544149323, 543407364, 542178574, 541134109, 540075417, 539038582, 538655701, 538705940, 538610687, 538022804, 537367554, 537081070, 536809807, 536231194, 534948921, 534185257, 534139290, 533901024, 533978310, 534416847, 535192451, 535658607, 536123810, 536625290, 536226616, 535554008, 534984627, 534314232, 533507309, 533003731, 532801323, 532831345, 533105583, 533218765, 533678932, 533793221, 533010521, 531878090, 530663757, 528930016, 527768898, 527252579, 526966515, 527343750, 527418747, 527159767, 527633400, 527937469, 528045006, 527414284, 526339417, 525753822, 525292282]
1376.2E25292282o51779r41963K01378Q07762J080551J143227J069946P17544M78859
1384.9E29197807J199646R72634J86653L14140J238442J289825O92253Q15392J191291
1393.6E37098083O97518j042366j36528k28386m18968j222420q99963J11656m49028
1402.2E33509598K43530O00548Q29048Q58765P4157n56640q78639o09894j094933r18884
1411.9E32056656j143341q00476O6986p3662M234P7095R35364n93223Q5105R94378
1421.5E31609116p3166j65406q87336L46412Q11081Q72040J054268N52292J40304o16493
1431.2E33643112K9869r29184r98497l78265q32787n56640J74637J387291L74832J95083
1440.8E32109451K14653r5520J51444q34503j25580n41573r46846j746330k30446O43692
$$ y = [525292282, 524640503, 523698540, 523899918, 524707680, 525788231, 526931458, 528001404, 528718948, 529197807, 530397453, 531370087, 531556740, 531870880, 533109322, 534399147, 535091400, 535906792, 537098083, 537795601, 536753235, 536616707, 536388321, 535969353, 534746933, 533846970, 533958626, 533509598, 533753128, 534353676, 535182724, 536041489, 536115646, 535559006, 534680367, 534070473, 532975540, 532056656, 530913315, 530112839, 530179825, 530106163, 530110397, 530187492, 531122856, 530529633, 530614738, 531609116, 531535950, 531370544, 530483208, 530829620, 531640701, 532512741, 533567009, 534119301, 534259605, 533643112, 533672981, 532743797, 531745300, 531367035, 530534248, 529977608, 530152245, 531539536, 531914368, 532109451, 532324104, 532228584, 532380028, 531545525, 531419945, 530878372, 529931526, 528185196, 527954750, 528598442]
1450.5E28598442q95882n42869j359177k31132m07257j716347k866364k572975K435417
1459.1E20441856L44201J539878M67415R11942J718902m86755J493607R49134L206902
1467.8E30587082L103218M328079M981728M068527O843071M102707N288849L049125
1475.5E66352386L258477L890342L502427L086929J643982K221336Q88519J132088
1483.2E85976486O96373Q63953K087631J033936J548576J294708K80571l07731J433296
1491.9E94907799J176033p13692q75244q11539j163254P77665K06337j039353N96810
1500.6E93061562J070556J07765j09977N4016j717n197983n315322Q49075R7160J10550
1510.2E84725685O17142m44031j304207K68059k05803r53216j317521l059120P85294
$$ y = [528598442, 527702560, 527159691, 525800514, 525569382, 525162125, 523445778, 520579414, 518006439, 520441856, 520786057, 522325935, 522793350, 523705292, 525424194, 524937439, 526431046, 527380180, 530587082, 533690300, 538018379, 543000107, 547068634, 553911705, 558014412, 563303261, 566352386, 569610863, 573501205, 577003632, 580090561, 581734543, 583955879, 584844398, 585976486, 586672859, 587536812, 589624443, 590658379, 592206955, 593501663, 593782234, 593474503, 594907799, 596083832, 595370140, 594494896, 593683357, 592520103, 593297768, 593504105, 592464752, 593061562, 594132118, 594239883, 594129906, 594183922, 594182205, 588984222, 583668900, 584517975, 584615135, 584725685, 585342827, 584898796, 583594589, 583862648, 583656845, 582703629, 581386108, 578326988, 579112282]
1518.9E79112282J164055j882515j275482J393051J039962J499329O09245m97093K66152
1527.6E81428986q86193j023025l69416j058120m51851n60379j585617Q76388R36089
1536.3E77306862R83734J240463r72824l079529M52576j235619o14776J040687o00547
1545E74521027k23694K059860J572876J078491R91364J28898J121826Q51441O31943
1553.6E82734032j87340o32477K263794K643967J09253n43175Q93478L226242K213211
1562.3E92720985J835900Q29124o99768l10287O06575M50325j45417J984J892433K461853
1572E99643707J026879P53631J354332K67372l571167q86192N53818j52893k35253
1580.6E98754234m2305O22521K74849m03252J79253k65045q16193j490708j290016
$$ y = [579112282, 580276337, 578393822, 577118340, 578511391, 579551353, 581050682, 581659927, 581162834, 581428986, 580542793, 579519768, 579150352, 578092232, 577640381, 577080002, 575494385, 576370773, 577306862, 578290596, 579531059, 578558235, 575478706, 575931282, 574695663, 574080887, 575121574, 574521027, 574297333, 576357193, 577930069, 579008560, 579999924, 580128822, 581250648, 582102089, 582734032, 582546692, 581914215, 584178009, 586821976, 586931229, 586388054, 587281532, 590507774, 592720985, 594556885, 595386009, 594686241, 594375954, 594982529, 595432854, 595287437, 595289421, 597181854, 599643707, 600670586, 601424217, 602778549, 603045921, 599474754, 598588562, 599142380, 598989487, 598754234, 598711929, 599334450, 599609299, 599206047, 599385300, 599120255, 598304062, 596813354, 595523338]
1589.3E95523338j439514j281624j056518j012192m22173o95648l73039o50635r51004
1598E87640991j539497j810608k170372k464066j352577j860657j651763j697617j365585
1606.7E71728249j610604j484909j543464k732773j497650k684403k767143k762871
1614.4E54644432j419144q99238o711731p27005j297379j642112k497597j572418j852227
1623.1E36025581n271644j490174k089500j487846l688698k728119j158371j825447
1630.8E16285782q19054j853218p31888j82876k453995l916473j023179j496849j042671
1639.5E02765579R2507j495438n150m34570M24270K44675k685127J00670j403008J094170
1649.1D98698578K03819Q76579J019288n68848j948052k47612L236199J601105J537056
$$ y = [595523338, 594083824, 592802200, 591745682, 590733490, 590311317, 589615669, 589242630, 588591995, 587640991, 586101494, 584290886, 582120514, 579656448, 578303871, 576443214, 574791451, 573093834, 571728249, 570117645, 568632736, 567089272, 564356499, 562858849, 560174446, 557407303, 554644432, 553225288, 552326050, 545614319, 544887314, 543589935, 541947823, 539450226, 537877808, 536025581, 530753937, 529263763, 527174263, 525686417, 521997719, 519269600, 518111229, 516285782, 515466728, 513613510, 512881622, 512698746, 510244751, 506328278, 505305099, 503808250, 502765579, 502858086, 501362648, 501357498, 500922928, 501347198, 501591873, 498906746, 499007416, 497604408, 498698578, 498902397, 499778976, 500798264, 500229416, 498281364, 498033752, 501269951, 502871056, 504408112]
1657.8E04408112P07054J084709Q87031O07720J891899M5013J968689J658783J923142
1666.5E15182152K103615K211036K378006O70777K764091J330795J855202K039223
1674.2E30534897J686058N96809J825600L066673J849480K394943J710129K829628
1681.9E46494217L599205J623840j43509r11216K854805K398643J942444K611847K484054
1690.6E62954330K448273K167168K585335L038177L069992j735229J862106K863083
1698.3E79253235K402954Q88901j774636M215661L115653J976357J076698J402664
1706E92557487P49970K81639R11331K68364j14174m2877P70989J562652O75011O23360
1715.6E98243752K265434J918030k437783J134339J196098L61137J61248k94991m04739
$$ y = [504408112, 505115166, 506199875, 507086906, 507694626, 509586525, 509631538, 511600227, 513259010, 515182152, 517285767, 519496803, 521874809, 522545586, 525309677, 526640472, 528495674, 530534897, 532220955, 532817764, 534643364, 537710037, 539559517, 541954460, 543664589, 546494217, 550093422, 551717262, 551573753, 550662537, 553517342, 555915985, 557858429, 560470276, 562954330, 565402603, 567569771, 570155106, 573193283, 576263275, 574528046, 576390152, 579253235, 581656189, 582545090, 580770454, 584986115, 588101768, 590078125, 591154823, 592557487, 593307457, 593589096, 594500427, 594768791, 594654617, 594611740, 595382729, 596945381, 597620392, 598243752, 600509186, 602427216, 599989433, 601123772, 602319870, 602681007, 602842255, 602547264, 602142525]
1724.3F02142525J3580L73879k21673p14645p46612k496186l198471j136131p34482
1733E93281784m597664q651237j177826j674958l096771k419243m372062o094895j305504
1741.7E59891624o88858l392791j883698n48668M67987J086083K629242M993782M597740
1750.4E67152443P857895O615791P094460O986427O288872O784172N913086O191063
1758.1F20884209N175514N055962M674530L620986L558388L948136L468628K224502
1765.8F52610855K657013K580414j09482N16281J572113R19190M62341q0948K298660
1774.5F63426437K294159K00959J322631J033020Q89130O27899j030044L27301O25992
1783.2F69717484M45098j05896M19312J803055J209106O74820Q59375L00064N63812
$$ y = [602142525, 602156105, 602529984, 602308311, 601593666, 600847054, 598350868, 595152397, 594016266, 593281784, 588684120, 580032883, 578855057, 577180099, 574083328, 571664085, 567292023, 561197128, 559891624, 559202766, 555809975, 553926277, 553377609, 553845596, 554931679, 557560921, 562554703, 567152443, 575010338, 581626129, 588720589, 595707016, 601995888, 608780060, 614693146, 620884209, 626059723, 631115685, 635790215, 639411201, 642969589, 646917725, 650386353, 652610855, 655267868, 657848282, 657738800, 658255081, 659827194, 660746384, 661208725, 661127777, 663426437, 665720596, 665921555, 667244186, 668277206, 669166336, 669794235, 668764191, 669091492, 669717484, 670162582, 670056686, 670475998, 672279053, 673488159, 674162979, 675022354, 675322418, 675886230]
1791.8F75886230j103668j586151R04923N52063J60751P15103J249085J080780M19387
1800.5F78278503J536103J30005p23801L2272l35159l35007k79999L63923P17620P47605
1810.2F80132065j19934N35507J563721P43179J32980n40466k18277o71768n94788
1818.8F80962219K12555j7547O75735P47452J341171J284790j011810m24118M23507
1827.5F84193954J70212p47604k444306M6540J484909Q04825P63778Q89359P20596
1836.2F85882263O08444l16772q5831o13327o10962o13708q011Q16879k264175O40487
1845.8F83435287J860581Q10852K21863K26135L87344o18820n04226k55662k05535
1854.5F85357819j66550j42059N23223M38614O77872N60684K77100j14212n54199o88935
$$ y = [675886230, 674782562, 673196411, 674101334, 674653397, 674814148, 675529251, 676778336, 677859116, 678278503, 679814606, 679944611, 679220810, 679253082, 678917923, 678582916, 678302917, 678666840, 679384460, 680132065, 680012131, 680547638, 682111359, 682854538, 682987518, 682447052, 682228775, 681557007, 680962219, 681174774, 681157227, 681832962, 682580414, 683921585, 685206375, 684194565, 683770447, 684193954, 684364166, 683616562, 681172256, 681218796, 682703705, 683508530, 684272308, 685161667, 685882263, 686490707, 686173935, 686088104, 685474777, 684863815, 684250107, 684242096, 685058975, 682794800, 683435287, 685295868, 686106720, 686328583, 686554718, 686942062, 686323242, 685819016, 685563354, 685357819, 685191269, 685049210, 685572433, 686011047, 686688919, 687249603, 687526703, 687412491, 686858292, 686169357]
1864.2F86169357n71670p6294n12009K43225J42823k02179J192474Q89282L34702j06736
1873.8F87502975j49841l50876o54068p54165m06876L07541M27704Q03833N56869N64423
1883.4F87847519M14886m84466k79083k75422L0060j43127j375275l08761O13327L30734
1893.1F86370392O31561O38046n3939L17688Q3770k87704n19028l20434r5292n73425
1902.7F86191635k20489K12326P06710L96882m807L35770K38876k06833n87539k44599
1912.4F86817932q15887m64402N6153j59073P14493r7046O6147Q86383L43399M28619
1922F87776718l94363r30329j57699l05405n43747P6904K39182n0888J56708P05795
1931.7F86572876P45239j54190l49960m52728m73786l15018l23715j87301m22821L42178
$$ y = [686169357, 685597687, 685521393, 685009384, 685252609, 685395432, 685193253, 686385727, 687275009, 687609711, 687502975, 687353134, 687002258, 686348190, 685594025, 685187149, 685494690, 685922394, 686726227, 687283096, 687847519, 688262405, 687777939, 687498856, 687223434, 687253494, 687110367, 685735092, 685426331, 686039658, 686370392, 687001953, 687639999, 687586060, 687903748, 687987518, 687699814, 687180786, 686860352, 686765060, 686191635, 685971146, 686183472, 686890182, 687287064, 687282257, 687618027, 687856903, 687650070, 687062531, 686817932, 686002045, 685537643, 685593796, 685434723, 686149216, 686052170, 686118317, 687004700, 687348099, 687776718, 687382355, 686452026, 686294327, 685988922, 685445175, 685522079, 685761261, 685710373, 685867081, 686572876, 687318115, 687163925, 686813965, 686361237, 685887451, 685572433, 685248718, 685061417, 684638596, 684980774]
1941.3F84980774M14505k89307P09534Q92715N5695m13513m49829p10602m80652j07422
1951F84601898r1858m4479L63464Q53882N87158L67127j48926l15933j67694m91639
1960.6F85513000o63299o66275j15204k289L82843R52835M83246J15051k212k09045
1970.2F85788651n58777n50766o22101l72086o4697l3875N84336O50024P61872L41186
1979.9F85923767l48663l60184o08597m11758l24097n13229n35507j7548L10898L43551
1989.5F83458633R63974O21186l56674m82331j24206k6856k23541m82407m89731l48968
1999.2F82509079k00348N42374M34952J2512J49917n0430m02222p57675m83551l10821
2008.8F81443787k38572k60849j24130M85077M32358L67203J84250o1951n41306n24444
$$ y = [684980774, 685395279, 685105972, 685815506, 686708221, 686763916, 686350403, 685900574, 685189972, 684709320, 684601898, 684510040, 684465561, 684829025, 685682907, 686270065, 686637192, 686488266, 686172333, 686004639, 685513000, 684849701, 684183426, 684068222, 684065933, 684448776, 685401611, 685884857, 685999908, 685997696, 685788651, 685229874, 684679108, 684057007, 683684921, 683620224, 683586349, 684170685, 684820709, 685582581, 685923767, 685575104, 685214920, 684606323, 684194565, 683870468, 683357239, 682821732, 682804184, 683115082, 683458633, 684422607, 685043793, 684687119, 684204788, 684080582, 684053726, 683830185, 683347778, 682858047, 682509079, 682308731, 682851105, 683286057, 683298569, 683448486, 683398056, 682995834, 682238159, 681754608, 681443787, 681205215, 680944366, 680820236, 681305313, 681737671, 682104874, 682289124, 682227173, 681685867, 681161423]
2018.5F81161423j28937o11343n07508k80761k89765k1286K51312K10495K8458k0370
2028.1F79791718m10157l76587k53830k66571m00009l12347N0354j29013n7526q6212
2037.7F77549820O4468L37677L05329j52817o68793j50833k85721o13479l27454M578
2047.4F76062775l4027j62354J86157K54898N40390J54190l30963j19400l10287o25534
2057F75615845p46918L4485L45764K34604L62015M25110O25381J05591n30548p62329
2066.7F75709000k71531j41067n79834k88849N9357M30984M74015K56500J39313L10134
2076.3F76098022J71662m09470m73633j74026L9520n46799k57949L38592K39334L78571
2086F75403824K12707M50287R5673k32392l32946q47016l31268n3101j99890o4087
$$ y = [681161423, 681032486, 680421143, 679913635, 679632874, 679343109, 679321823, 679573135, 679783630, 679812088, 679791718, 679381561, 679004974, 678751144, 678484573, 678084564, 677772217, 677822571, 677693558, 677636032, 677549820, 677614288, 677951965, 678257294, 678104477, 677435684, 677284851, 676999130, 676385651, 676058197, 676062775, 676028748, 675866394, 676052551, 676307449, 676847839, 677002029, 676671066, 676551666, 676241379, 675615845, 674868927, 674903412, 675249176, 675483780, 675845795, 676270905, 676896286, 677001877, 676471329, 675709000, 675437469, 675296402, 674716568, 674427719, 674487076, 674918060, 675392075, 675648575, 675787888, 676098022, 676269684, 675860214, 675386581, 675212555, 675252075, 674705276, 674447327, 674785919, 675025253, 675403824, 675616531, 676066818, 676162491, 675930099, 675597153, 674750137, 674418869, 674365768, 674165878, 674101791]
2095.6F74101791K40021K86789K98081M18930K99530K34527l28598p11746o17142o8054
2105.2F74154129L13110p0114l22265J09863Q60977N56717J26343l36914m30451r2239
2114.9F74869156n07507k12555k91825j89972L67585O8512K84881Q12836N38406m12369
2124.5F75327148m34875l38364n43441m10386l28140J62583M86145L94058j12915J99280
2134.2F74401093N45196o4621k6398k54440p24029m78440J54877j87149l83606K94800
2143.8F73277283L86810P00302L80554k71377l77655j98365k4337l78647m32282m09164
2153.5F72653122n646L52173L54157L34930M72870O14471j05362k26364k62604m07028
2163.1F73774719k80761m34800l7536L67202O29578M39606J37558K49100K79006n5770
$$ y = [674101791, 674341812, 674628601, 674926682, 675345612, 675645142, 675879669, 675551071, 674839325, 674222183, 674154129, 674467239, 674397125, 674074860, 674184723, 675045700, 675602417, 675728760, 675391846, 674961395, 674869156, 674361649, 674149094, 673857269, 673667297, 674034882, 674103394, 674388275, 675201111, 675739517, 675327148, 674892273, 674553909, 674010468, 673600082, 673271942, 673434525, 673920670, 674314728, 674201813, 674401093, 674946289, 674881668, 674855270, 674600830, 673876801, 673398361, 673553238, 673366089, 672982483, 673277283, 673664093, 674364395, 674744949, 674473572, 674095917, 673897552, 673873215, 673494568, 673062286, 672653122, 672647476, 672999649, 673353806, 673688736, 674161606, 674776077, 674670715, 674444351, 674181747, 673774719, 673493958, 673059158, 673021622, 673388824, 674018402, 674458008, 674595566, 674844666, 675123672, 675067902]
2172.8F75067902m53186k21100j21613j00860j88752P5989N09110L18145K42844J13297
2182.4F75241776J23214L9292J04751j7090l22418j78451l10746M5166L11051K91290
2192F75327835K92053L44849M85611J46713j20163l05633O8893m8752l45764l6316
2201.7F75809326J297L05023m3945j56555K56729M34570N78385J17569k33536k54898
2211.3F76813965j99509l68118n2643K55508j67541J373N71747O18210J4038m7836
2221F77439194R5215j64795l28217l33176k72064k44522J72424M13743Q04977K73743
2230.6F77856522n02777K19192J46408j78757l05862n45960n29861K1286N32913Q8883
2240.3F76801987K67334L83072L81546K41317m33578m91409l17612j50833k98310k17895
$$ y = [675067902, 674614716, 674393616, 674272003, 674171143, 673982391, 674058380, 674567490, 674885635, 675128479, 675241776, 675364990, 675404282, 675509033, 675491943, 675169525, 674991074, 674680328, 674725494, 675036545, 675327835, 675619888, 675964737, 676450348, 676597061, 676476898, 676171265, 676240158, 676191406, 675845642, 675809326, 675810623, 676115646, 676071701, 675915146, 676171875, 676606445, 677184830, 677302399, 677068863, 676813965, 676614456, 676246338, 676193695, 676449203, 676281662, 676283035, 676854782, 677472992, 677487030, 677439194, 677534409, 677369614, 677041397, 676708221, 676436157, 676191635, 676364059, 676777802, 677582779, 677856522, 677353745, 677572937, 677719345, 677540588, 677234726, 676688766, 676158905, 676180191, 676713104, 676801987, 677069321, 677452393, 677833939, 678075256, 677641678, 677150269, 676832657, 676681824, 676383514, 676165619]
2249.9F76165619j68686J65100P36160M65622J86768K3804p2327n26962n82733l54615
2259.5F76037750k29034J63650K33536N02319K53602n9586J0300K25906j05057m95453
2269.2F76537933P4692m96139o13785j16043K73056N95627K11105J67923p3853J82114
2278.8F76742630p553k98004l73993n60455n6687l83606L3417K49481J72882L07083
2288.5F75825195p0648J66550N493m4785o53152l58429L1204o40716l40577m83169
2298.1F73436966K78625L44391n0735R9411k060J72501p00684n76553m91562m62113
2307.8F72048187m87747o42929M4556n49622j22299K899K15302R6206r01642j73339
2317.4F69529572l05787n16967j169739j102905j78452L7537j25580o96259P74994
$$ y = [676165619, 675996933, 676162033, 676898193, 677363815, 677550583, 677574387, 677502060, 676975098, 676392365, 676037750, 675808716, 675972366, 676205902, 676708221, 676961823, 676902237, 676912537, 677138443, 677033386, 676537933, 676612625, 676116486, 675502701, 675386658, 675659714, 676255341, 676466446, 676634369, 676560516, 676742630, 676735077, 676437073, 676063080, 675502625, 675445938, 675062332, 675095749, 675345230, 675518112, 675825195, 675754547, 675921097, 675926590, 675881805, 675228653, 674870224, 674901428, 674260712, 673920135, 673436966, 673715591, 674059982, 674009247, 674108658, 674106598, 674279099, 673578415, 673001862, 672510300, 672048187, 671560440, 670917511, 670962067, 670412445, 670290146, 670293045, 670508347, 670604553, 669702911, 669529572, 669223785, 668706818, 667537079, 666434174, 666255722, 666293259, 666167679, 665471420, 666246414]
2326.1F66246414N07355l43933m8599k27433r15908j602097o12793j84708L59574m19388
2335.7F62758484L5705J511078N68085l61862j395950m52347m27017k33307P4920o13784
2345.4F61464005J121597J613617J221008O91376K49481o52924j794357j724625j412735
2354.1F60776443o50787j790008k366791r28498j33895P46688J266709J649170M42428
2362.7F59011459l02963L65906J045685p52182j410065N53589L25470R09347J626892
2371.4F61373138J711503J412582M03747M57993K38266j16425j69601j34125L52783
2380.1F65529861N81742N97915J026841P74154L27988M33884l4867j70517j88217l65829
2389.7F68512955l68271l49503j01928k88926J03302O87561N79682N8822n79834o37435
$$ y = [666246414, 666753769, 666409836, 666361237, 666133804, 665217896, 663615799, 663003006, 662818298, 663177872, 662758484, 662794189, 664305267, 664873352, 664511490, 663115540, 662663193, 662236176, 662002869, 662077789, 661464005, 662585602, 664199219, 665420227, 666111603, 666361084, 665708160, 663913803, 662189178, 660776443, 660125656, 658335648, 655968857, 655040359, 654906464, 655653152, 656919861, 658569031, 659011459, 658708496, 659074402, 660120087, 659367905, 657957840, 658511429, 658836899, 659746246, 661373138, 663084641, 664497223, 664900970, 665358963, 665597229, 665480804, 665311203, 665177078, 665529861, 666111603, 666709518, 667736359, 668510513, 668838501, 669272385, 669237518, 669067001, 668878784, 668512955, 668144684, 667795181, 667693253, 667404327, 667507629, 668195190, 668774872, 668833694, 668253860, 667616425]
2399.4F67616425m22440R8801m1657m43649m46396k97165J65176K01645M47312K83127
2409F67161179j78528j77765l68958o01349p15332l28292k48719j84021K27738J89438
2418.7F64775391J60598J11084l4942j61438l14484m50592l87802p12128p11059J08947
2428.3F62383575J86768J18637J83334O867k93655l47367k10113n26810k79999R5139
2438F61316376j40152k95792j01852k43683l64838K44827J55793j5106N0735m72488
2447.6F60133820p30057m53415r8190k2202n7754l56522l18222m044j53656P63K35367
2458.2F58175888J9836j18865j13831n12848o01425k31323j43128k78625k01798J86920
2467.8F56180801j01089j75858R3460m1275j40304m13056j22146m8142m85229m66309
$$ y = [667616425, 667193985, 667292786, 667251129, 666807480, 666361084, 666063919, 666229095, 666430740, 666878052, 667161179, 666982651, 666804886, 666435928, 665834579, 665119247, 664790955, 664542236, 664358215, 664585953, 664775391, 664935989, 665047073, 665012131, 664850693, 664536209, 664085617, 663697815, 662985687, 662274628, 662383575, 662570343, 662688980, 662872314, 662879181, 662585526, 662238159, 662028046, 661501236, 661221237, 661316376, 661176224, 660880432, 660778580, 660534897, 660170059, 660414886, 660570679, 660555573, 660606308, 660133820, 659403763, 658950348, 658852158, 658829956, 658772202, 658415680, 658097458, 658093414, 657939758, 657940521, 658175888, 658195724, 658076859, 657963028, 657450180, 656848755, 656617432, 656474304, 656195679, 655993881, 656180801, 656079712, 655903854, 655997314, 655956039, 655815735, 655402679, 655280533, 655232391, 654747162, 654280853]
2477.5F54280853j81350L41568M21752J05134r8572m80423o07910j4801n494l27911
2487.1F53432846m52270n07126K12860J8539l79562l0823K14234M57153j89743o37589
2496.8F52138519m07867j88217j17112q6669j74256k37808M12140M26178l1357l16620
2506.4F51416931k47955j50986n97076m85306n1804K36206j88064j24436J94855o9427
2516.1F49932938K85492N0888j85395n26657n32608j45187n71594j20316K7618j69143
2525.7F48046036K2812K54058K24991k41012q8654l68194l33634J8540m27399o79550
2535.4F46427994m44031K1210J75018M11224K44522k55661l01208m20837n52292m43726
2545F44862213l96499l44620J07879O8436O8665R4070k19955K822j76544k70614k50397
$$ y = [654280853, 654099503, 654441071, 654862823, 654967957, 654869385, 654388962, 653781052, 653766251, 653760757, 653432846, 652980576, 652473450, 652686310, 652704849, 652325287, 652294464, 652508698, 652965851, 652776108, 652138519, 651730652, 651542435, 651425323, 651338654, 651164398, 650926590, 651338730, 651764908, 651733551, 651416931, 651168976, 651017990, 650420914, 649935608, 649883804, 650120010, 649931946, 649807510, 650002365, 649932938, 650218430, 650269318, 650083923, 649557266, 649024658, 648879471, 648307877, 648187561, 648215179, 648046036, 648068848, 648322906, 648547897, 648306885, 648218231, 647850037, 647516403, 647534943, 647107544, 646427994, 645983963, 646005173, 646180191, 646591415, 646835937, 646580276, 646279068, 645858231, 645305939, 644862213, 644465714, 644121094, 644228973, 644297409, 644366074, 644460144, 644240189, 644243011, 644066467, 643795853, 643545456]
2555.6F43545456k59857k68479m18014k06375l82996J15509M65851m8904k54899n58319
2565.2F41728973k21786Q6975l21198n20324l16391o7368q8653k54593k29149j5144
2574.9F39781342k9030J39351J66702l50685n46112l73612m18625j96304J56860k67105
2584.5F38062782n29785k44369M45060N15595k11907l24173n64689m90456k13814o7710
2594.2F36376534R498m88014j97106M34494M03748k03705l51333p4921k16789j39733
2603.8F35552673l31306l80821k82402m34685l42674J1978J55601j46293L9329J43929
2613.5F33985329Q9531l56865r52492m77142k38953m36592o24008l71437k4987O3515
2623.1F30655899L04604k05155n14946k37541j46065m46129r71984n44548O0005j49842
$$ y = [643545456, 643285599, 643017120, 642599106, 642392731, 642009735, 642125244, 642591095, 642542191, 642287292, 641728973, 641507187, 641594162, 641272964, 640752640, 640436249, 640368881, 640280228, 640025635, 639796486, 639781342, 639752312, 639891663, 640058365, 639707680, 639161568, 638787956, 638369331, 638173027, 638329887, 638062782, 637532997, 637288628, 637733688, 638249283, 638037376, 637713203, 637148514, 636658058, 636444244, 636376534, 636386032, 635898018, 635700912, 636135406, 636539154, 636335449, 635984116, 635909195, 635692406, 635552673, 635221367, 634840546, 634558144, 634123459, 633780785, 633792763, 633948364, 633802071, 633841400, 633985329, 634074860, 633717995, 632765503, 632288361, 632049408, 631612816, 630988808, 630617371, 630592384, 630655899, 630960503, 630755348, 630240402, 630002861, 629856796, 629410667, 628438683, 627894135, 627954140, 627804298]
2632.8F27804298J2436K78778k84614m64058k36511j68763m15916q87947n74532k91633
2642.4F24771538l92609l75824j49612J373j38283r7427k21672J5144J00937n70717
2652F22942848q68645p56835n26467l71780j89629J69792N93071K41661n91850m62532
2661.7F20179634j52168o11382q75663l73497l58696l41454k5444k00081l0365J36719
2671.3F17347603P0877j79100l87344m21677m92554l54576n32684m40026m9858J82610
2681F14743271J69029j23558j98059j36261j23863o86836q36716j83716J21002m64477
2690.6F12279816q31261P4882J20011n6877K82058J5564j45187m47884o08863o09169
2700.3F10073090l69950j23367l19138j73339j46676r9983o3019l23600j75896J37329
$$ y = [627804298, 627816734, 628095512, 627810898, 627346840, 627110329, 626941566, 626525650, 625637703, 625063171, 624771538, 624378929, 624003105, 623853493, 623854866, 623716583, 623619156, 623397484, 623412628, 623513565, 622942848, 622074203, 621317368, 620790901, 620419121, 620229492, 620399284, 620992355, 621234016, 620642166, 620179634, 620027466, 619416084, 618540421, 618166924, 617808228, 617466774, 617441330, 617241249, 617210884, 617347603, 617418480, 617239380, 616852036, 616430359, 615937805, 615583229, 615050545, 614610519, 614560661, 614743271, 614912300, 614788742, 614590683, 614454422, 614330559, 613643723, 612807007, 612623291, 612744293, 612279816, 611448555, 611523437, 611643448, 611586571, 611868629, 611884193, 611739006, 611291122, 610682259, 610073090, 609703140, 609579773, 609260635, 609087296, 608940620, 608840637, 608777618, 608454018, 608278122, 608415451]
2709.9F08415451R2850n39284j263199q02574R1400j13869l55873K3842J20316k24533
2719.5F05444527p6447J13564l95089n36537l95698l08419o02722n19600R7390j45226
2729.2F02675743k01073L3837L6392m03786o43501k42271j82267j26571n52063m69628
2738.8E99924812P7477j02081j33133l21618k42843L3340M235k30332l22380j08566
2748.5E98578911l37448n01328j82113k2164k61345N303j0643m23050j21231q5984
2758.1E96638908k40974m32243k24495k85950o91032p9651N5351k13242j95121j81733
2767.8E94149818k13661j85165p8163j70327m62608n69610K098l91426n34287K0943
2777.4E91567612j67427M4593l61290l97110k03704n81551m54025n78461m69398k26860
$$ y = [608415451, 608508301, 607969017, 606705818, 605903244, 605994644, 605880775, 605524902, 605548744, 605669060, 605444527, 605368080, 605481644, 605086555, 604550018, 604154320, 603845901, 603243179, 602723579, 602820969, 602675743, 602474670, 602508507, 602544899, 602141113, 601497612, 601255341, 601073074, 600946503, 600394440, 599924812, 600002289, 599900208, 599767075, 599445457, 599202614, 599235954, 599240189, 599009857, 598687477, 598578911, 598241463, 597740135, 597558022, 597535858, 597274513, 597279816, 597269173, 596846123, 596724892, 596638908, 596397934, 595965691, 595741196, 595455246, 594764214, 594684563, 594739914, 594526672, 594331551, 594149818, 593936157, 593750992, 593672829, 593502502, 593039894, 592470284, 592472382, 592080956, 591546669, 591567612, 591400185, 591444778, 591083488, 590686378, 590482674, 589901123, 589447098, 588868637, 588399239, 588172379]
2787E88172379P0152k74391k80495M54140j26076m83131n65148p27615q26607p58629
2796.7E84654579k14462l44429o66084o19278j4763o9199o27937l92914m32053m75387
2806.3E80798073m64363o91986r26552r04617n94445m84810m45785m81186n42069m82406
2816E74779854l04032n60989j015587j293182j422234r84993q53653p20825n66559
2824.7E67057800r59434p12738p78351j320496p87201p31010j592865j747894j672707
2833.3E56755104j841812j797409j180802j050529j939735k476807k769127l055000
2841.1E40643883l581963m278450m765014n214882n276795n511970o209221o522026
2848.8D99283562n957794n439644m769745l703957k946014j576348k05268J107330
$$ y = [588172379, 588242531, 587968140, 587687645, 588141785, 588015709, 587532578, 586967430, 586239815, 585413208, 584654579, 584440117, 584095688, 583429604, 582810326, 582795563, 582726364, 582098427, 581705513, 581273460, 580798073, 580333710, 579641724, 578715172, 577810555, 577216110, 576731300, 576285515, 575804329, 575262260, 574779854, 574475822, 573914833, 572899246, 571606064, 570183830, 569198837, 568345184, 567624359, 567057800, 566098366, 565385628, 564607277, 563286781, 562499580, 561768570, 560175705, 558427811, 556755104, 554913292, 553115883, 551935081, 550884552, 548944817, 546468010, 543698883, 540643883, 537061920, 532783470, 528018456, 522803574, 517526779, 512014809, 505805588, 499283562, 493325768, 487886124, 483116379, 479412422, 476466408, 474890060, 474684792, 475792122]
2856.5D75792122J973076K208786L474197L748169L581886L576279K883949K685967
2864.2D99924431J827469J094818P67975J39427n25589r58519o05965n64308k86064
2872.9E00813675M95834M20494P5302M8867k39640k98118l39432p93304n67246p22809
2882.5D98893623j227607r30825n77011p32879r88617r24301j273880j310578j090546
2891.2D89837379j253013j590462k161827j877670j320076j181832j390419j522026
2898.9D77540054j276169j572036k077828k137718k082100k511101k411575k201805
2906.6D61269722k674904k772102k546616k561226l618469l996010m407806n257302
2914.3D33435287m486160m752655n346412n462761n571900m579658l767853l169594
$$ y = [475792122, 477765198, 479973984, 483448181, 487196350, 490778236, 494354515, 497238464, 499924431, 501751900, 502846718, 503614693, 503754120, 503228531, 502270012, 501664047, 501099739, 500813675, 501309509, 501730003, 501805305, 501854172, 501614532, 501316414, 500976982, 500183678, 499616432, 498893623, 497666016, 496735191, 496158180, 495425301, 494436684, 493512383, 492238503, 490927925, 489837379, 488584366, 486993904, 484832077, 482954407, 481634331, 480452499, 479062080, 477540054, 476263885, 474691849, 472614021, 470476303, 468394203, 465883102, 463471527, 461269722, 458594818, 455822716, 453276100, 450714874, 447096405, 443100395, 438692589, 433435287, 428949127, 424196472, 418850060, 413387299, 407815399, 403235741, 399467888, 396298294]
2922.1C96298294k868957j796151p91549p39174k91176L93867J400338J646232K338791
2930.7C95590515L264961L643532L922730L831100M394035M438897M434623M516068
2938.5D28036461M201050L820152L481102L900185L911056L594246L406296L277893
2946.2D57628441K715721J770210J191368J008797J206818M49791K4109N36003N63964
2954.8D67095222Q49724J558342K093277J851540J751518K048035K177315K130126
2962.6D81555099J899682K335167K797546K936401L297043L223763L064041L494529
2970.3E04603271L212090K449112K288628K060051J688461J575661J887893K109947
2978E21875114K152100J708832J427002J967964J717033J228600J096344Q49152N29212
$$ y = [396298294, 393429337, 391633186, 390841637, 390102463, 389811287, 390205154, 391605492, 393251724, 395590515, 398855476, 402499008, 406421738, 410252838, 414646873, 419085770, 423520393, 428036461, 432237511, 436057663, 439538765, 443438950, 447350006, 450944252, 454350548, 457628441, 460344162, 462114372, 463305740, 464314537, 465521355, 465971146, 465995255, 466531258, 467095222, 467944946, 469503288, 471596565, 473448105, 475199623, 477247658, 479424973, 481555099, 483454781, 485789948, 488587494, 491523895, 494820938, 498044701, 501108742, 504603271, 507815361, 510264473, 512553101, 514613152, 516301613, 517877274, 519765167, 521875114, 524027214, 525736046, 527163048, 529131012, 530848045, 532076645, 533172989, 534022141, 534551353]
2986.7E34551353P28264J120873Q10203O80466N35927P07855N70908k28386k41013
2995.3E39236450J04599J73950n04798q34694q93975j252289r64088n03349n87235
3004E33974571r40513m48342r2239l75214n60455k61269J77689o1874M18739Q07304
3013.7E32638397P96280Q20580N88989J152687J223221N72281L10707O52618L71399
3022.4E39127159k20261k35443l23295J3733o3057R3651L8223l66211K61726k2888
3032E38303337p37953o42357k61421m52080p49168n69496k89879j25199n40962j80550
3041.6E33754272k9983n00679p37953j193772r64508m72297j99128o46209q95882n81779
3051.3E27532082o88858m44680j18179q2321m93736r12133j160621q42896l31573q54683
$$ y = [534551353, 535279617, 536400490, 537210693, 537891159, 538427086, 539134941, 539705849, 539477463, 539236450, 539341049, 539514999, 539010201, 538175507, 537281532, 536029243, 535065155, 534561806, 533974571, 533034058, 532585716, 532493477, 532118263, 531557808, 531296539, 531474228, 531412354, 531831093, 532638397, 533434677, 534255257, 534844246, 535996933, 537220154, 537792435, 538103142, 538755760, 539127159, 538906898, 538671455, 538348160, 538361893, 538298836, 538392487, 538430710, 538064499, 538326225, 538303337, 537565384, 536923027, 536661606, 536209526, 535460358, 534890862, 534600983, 534475784, 533934822, 533754272, 533724289, 533223610, 532485657, 531291885, 530327377, 529855080, 529655952, 529009743, 528113861, 527532082, 526843224, 526398544, 526280365, 526198044, 525704308, 524792175, 523631554, 522788658, 522457085, 521602402]
3060.9E21602402j163178p33375m1161j59912k81906j14632p84988j058579q45337
3069.6E16419334l31306n77011r46503n93986l42141j91726n41992l47481k74582m55971
3079.2E11816635o73179q82187o71425j037216o46553m94462o49070k77138k80342
3087.9E06205063m46625p10068k87819m64248p26509r12857j314927o42585n03731
3096.6E00195694m20990l59345n69992n10635q9149J6212j133766j156883o40793o30150
3106.2D94700203o16989p39098n02014p34978q73794m08020k32811m02146o53534j047401
3115.9D88489418o35948j48201p89032j101303r84802n58777r51043j225128k40135
3124.6D81855049j90773k07863o68068q09745l45803r63592j184998j011429o35414
$$ y = [521602402, 520439224, 519705849, 519664688, 519504776, 519222870, 519108238, 518323250, 517264671, 516419334, 516088028, 515511017, 514564514, 513970528, 513628387, 513436661, 512894669, 512547188, 512272606, 511816635, 511143456, 510261269, 509589844, 508552628, 507906075, 507411613, 506762543, 506485405, 506205063, 505758438, 505048370, 504760551, 504296303, 503569794, 502656937, 501342010, 500699425, 500195694, 499774704, 499415359, 498845367, 498334732, 498245583, 498261795, 497128029, 495971146, 495330353, 494700203, 494083214, 493344116, 492842102, 492107124, 491233330, 490825310, 490592499, 490190353, 489536819, 488489418, 487853470, 487705269, 486916237, 485814934, 484830132, 484271355, 483320312, 482095184, 481855049, 481664276, 481456413, 480788345, 479978600, 479632797, 478669205, 477484207, 476472778, 475837364]
3133.3D75837364n45273m57420j27068o55670p48787n65796q31031r76906r65271o50444
3142.9D69313698m21982q47130j068840r59701o71540j82380m82483m01840j57471
3151.6D64120331o44531q53615j077500j434898j453133o64100k49214m46969n02128
3160.3D56794243p16324o91338o97364p17011r02557q82302n99289p29637q46328o95038
3169.9D49317055k33536m83894o59905k94380n30663p55539n16624n33180j356888
3178.6D43952446j078072l85360p12166p62787n12238m65583q91076p14492k43302
3187.3D38187370l37600p04880j048012p88498p58133q21724p16247n97611m42276
3195.9D31972389l62625n48401q68644n85099n94864n55572n36957q54568j052895
$$ y = [475837364, 475292091, 474834671, 474707603, 474051933, 473303146, 472737350, 471906319, 470929413, 469964142, 469313698, 468891716, 468044586, 466975746, 466016045, 465344505, 465162125, 464679642, 464277802, 464120331, 463475800, 462622185, 461544685, 460109787, 458656654, 457992554, 457743340, 457296371, 456794243, 456077919, 455386581, 454689217, 453972206, 453069649, 452187347, 451588058, 450858421, 450012093, 449317055, 449083519, 448599625, 447939720, 447645340, 447114677, 446359138, 445842514, 445309334, 443952446, 442874374, 442489014, 441776848, 441014061, 440501823, 440036240, 439145164, 438430672, 438187370, 437849770, 437144890, 436096878, 435308380, 434550247, 433728523, 433012276, 432414665, 431972389, 431609764, 431061363, 430192719, 429607620, 429012756, 428457184, 427920227, 427065659, 426012764]
3204.6D26012764q54225l20511o75774j83334j54610r15260l13644l93830l46451o60667
3214.3D21194458j252327p48367k64092m2648n68657q75893p44133l15971k38228p39250
3223.9D15404892l89214l49922q42247j061630r47609p62482n92727N4359K23122m56620
3233.5D10279922p14797n42946m21906m21142r07059r31168p64541m96178j34773n51453
3243.2D04393959k76031k16675m07219k71149p09953o49758p92465r79500p82928o12831
3252.8C98695450m43344j89667m7569n51758n43442m53873o54525n87883l77922l67470
3262.5C94477997n34630l75671o13213m62036j74408k09618k62184o96449q21686o45256
3272.1C89682846j47133o35605q25691m1618k99568l49007n84488p67899l52211j21612
$$ y = [426012764, 425158539, 424838028, 424162254, 423978920, 423824310, 422909050, 422595406, 422201576, 421855125, 421194458, 419942131, 419193764, 418929672, 418887024, 418318367, 417442474, 416698341, 416382370, 416144142, 415404892, 415015678, 414665756, 413823509, 412761879, 411814270, 411051788, 410459061, 410513420, 410736542, 410279922, 409565125, 409022179, 408600273, 408179131, 407272072, 406340904, 405576363, 405080185, 404945412, 404393959, 404117928, 403901253, 403494034, 403222885, 402512932, 401863174, 401070709, 400091209, 399308281, 398695450, 398252106, 398062439, 398014870, 397463112, 396919670, 396465797, 395811272, 395223389, 394845467, 394477997, 393943367, 393567696, 392954483, 392492447, 392318039, 392108421, 391846237, 391149788, 390328102, 389682846, 389535713, 388900108, 388074417, 388032799, 387733231, 387384224, 386799736, 386031837, 385679626, 385558014]
3281.8C85558014k67487l58657N2337m10194o24924k77405m37317n10254m82482m62685
3291.4C81778946l09715j89057l63693l2806k74353p17354j52626j18485l32641n65720
3301C78722496o49872n71708k74239L0708k82821m52614m91905m68903r10797o57005
3310.7C73993340o7177n63011l13607K6055j7052j20583o01425o08558j60218m35829
3320.3C71131935p88040L1700o5308q99314q73185l25775R7733l31383r32465q39347
3330C66206551j19973k77328m26979k34719q28552o40526k48527j21498l59917r06067
3339.6C62042465m94423j678l97377q00514l67699k67410p45354q13408m00314n26429
3349.3C57227859q14590j06163M8370n19294q26722m38537l92609o77452k56004n44319
$$ y = [385558014, 385290527, 384931870, 384984207, 384574013, 383949089, 383671684, 383234367, 382724113, 382241631, 381778946, 381469231, 381280174, 380916481, 380883675, 380609322, 379891968, 379739342, 379620857, 379288216, 378722496, 378072624, 377500916, 377226677, 377257385, 376974564, 376521950, 376030045, 375561142, 374650345, 373993340, 373926163, 373363152, 373049545, 373075600, 373058548, 372937965, 372336540, 371727982, 371567764, 371131935, 370343895, 370375595, 370310287, 369410973, 368537788, 368212013, 368309746, 367978363, 367045898, 366206551, 366086578, 365809250, 365382271, 365147552, 364319000, 363678474, 363429947, 363308449, 362948532, 362042465, 361548042, 361546364, 361148987, 360348473, 359980774, 359713364, 358968010, 358154602, 357754288, 357227859, 356413269, 356307106, 356355476, 355836182, 355009460, 354570923, 354178314, 353500862, 353244858, 352700539]
3358.9C52700539n35126m91943p29790p15256q70857P7896J59111p73506q00286n19714
3368.6C47501068m81377p49053p53327o38237l97949l90396l23372j68076n67054n76897
3378.2C42455330j27525j39275n46951m37622n64042n70831l6316j13487l04070o40220
3387.8C38974991l36304M5624m90990n40809l76015o84509o35987K16141K75536l47367
3397.5C36100311m57954n84259k02408L79066J35155n50422q52738l89252K53106K5901
3407.1C33856506o45218p99942j66282M85496m692m62494m79393k26936L16696J79978
3416.8C32053719l76053j82152M06456l73840m49257K24495j06583j19972k94876R0103
3426.4C30872040O71158M10461k79312l18298L86314K20718M2458k62070r4299J99814
$$ y = [352700539, 352165413, 351673470, 350943680, 350228424, 349357567, 349435463, 349594574, 348821068, 348020782, 347501068, 347019691, 346270638, 345517311, 344879074, 344481125, 344090729, 343767357, 343599281, 343032227, 342455330, 342327805, 342188530, 341641579, 341203957, 340639915, 340069084, 340032768, 339919281, 339615211, 338974991, 338638687, 338684311, 338193321, 337652512, 337276497, 336591988, 335956001, 336172142, 336447678, 336100311, 335642357, 335058098, 334855690, 335234756, 335369911, 334819489, 333966751, 333577499, 333830605, 333856506, 333211288, 332411346, 332245064, 332730560, 332725868, 332263374, 331783981, 331557045, 331873741, 332053719, 331677666, 331495514, 331901970, 331528130, 331078873, 331303368, 331196785, 331076813, 330781937, 330872040, 331543198, 331953659, 331674347, 331356049, 331742363, 331963081, 332005539, 331743469, 331649170, 331848984]
3436.1C31848984M0130N97382L69911m06494k40478Q04367M78591P2938K42996k07253
3445.7C33601074O57959J14174j16348P02019K61497K26440K09504P13119M41284j21727
3455.3C36688995L89977J001129O56815j91155L83263N64155N73426O0386j37787P50733
3465C40739937M60129O69937N47409K52571M27589O10466Q35457R7466J39160P34825
3474.6C45514946O17218J09749M17518J055565Q32939N5466J183R30671M51432P09533
3484.3C50696220Q41828L38745R18732N03120O15768K71531L5667R41811P88841O10618
3493.9C56562881M09432Q22296J043282M80384O58570N59959M14086J203689J033974
3502.6C63188553n19409m31748P71790J331787J071129J134643K32659l63045J489181
$$ y = [331848984, 331889114, 332486496, 332856407, 332449913, 332209435, 333013802, 333492393, 333565331, 333808327, 333601074, 334259033, 334373207, 334256859, 334958878, 335220375, 335446815, 335656319, 336369438, 336810722, 336688995, 337078972, 338080101, 338736916, 338545761, 338929024, 339493179, 340066605, 340126991, 339989204, 340739937, 341200066, 341870003, 342417412, 342669983, 343097572, 343708038, 344543495, 344640961, 344780121, 345514946, 346132164, 346241913, 346659431, 347714996, 348547935, 348603401, 348604584, 349535255, 349986687, 350696220, 351538048, 351876793, 352795525, 353298645, 353914413, 354185944, 354221611, 355163422, 355952263, 356562881, 356972313, 357794609, 358837891, 359318275, 359976845, 360536804, 360950890, 362154579, 363188553, 362669144, 362237396, 363009186, 364340973, 365412102, 366546745, 366779404, 366416359, 367905540]
3511.3C67905540J049080L40310N14526L92341Q37746J012535J122704O64062O45562
3520C74484406O94618J078224Q41484l98102M04549P26623J373139J144485N20287
3528.6C80869713J209030Q71353N62287K86445N43976P46002J452522Q37326J00594
3537.3C87479248J544647M91982M09851J463013J625366J424865P01027J11084J40648
3546C95391731J671524N73387R57337J214027P84455J768608n57862M69399J477356
3554.7D03749962J350212J660919K99492J278954J532745J321487O30036J265220J108971
3563.4D14197998J05820L254776R45701k18238R41085m01954K622490J285667Q09517
3572D23542862J784477J684494J091385J430817K305031L79943J260300J062088O58569
$$ y = [367905540, 368954620, 369294930, 369809456, 370201797, 371039543, 372052078, 373174782, 373838844, 374484406, 375179024, 376257248, 377098732, 376700630, 377105179, 377831802, 379204941, 380349426, 380869713, 382078743, 382950096, 383512383, 383798828, 384342804, 385088806, 386541328, 387378654, 387479248, 389023895, 389515877, 389925728, 391388741, 393014107, 394438972, 395139999, 395251083, 395391731, 397063255, 397636642, 398593979, 399808006, 400592461, 402361069, 401803207, 402272606, 403749962, 405100174, 406761093, 407060585, 408339539, 409872284, 411193771, 411823807, 413089027, 414197998, 414303818, 417558594, 418504295, 418286057, 419227142, 418825188, 421447678, 422733345, 423542862, 425327339, 427011833, 428103218, 429534035, 431839066, 432219009, 433479309, 434541397, 435199966]
3580.7D35199966K316513J792794J250610N07050L176155K399978j619606J446343
3588.4D46469803j45302J650658K724380K995835J611557J38816L321190l44429Q51975
3597.1D59274483L168869P42187K112808L54577R9907J660118J612205K096787L119316
3605.8D74241257K993812r82246K563553M93240j710396N667763K067413k387085K560501
3614.5D85507812o4544L043976M772186O36024J407891k73781m27361J897774J444359
3623.1D97944336K001686K394142J520157R36470L589554J895866n148582K599640
3630.9E07733269K596321L893699K178154k233047J024094K480697K275887L79791
3638.6E20328865L08647K062493K556991J268234j39427J412163K093239L564529j177788
$$ y = [435199966, 437516479, 439309273, 440559883, 441066933, 444243088, 446643066, 445023460, 446469803, 446324501, 447975159, 450699539, 453695374, 455306931, 455445747, 458766937, 458422508, 459274483, 462443352, 463185539, 465298347, 465652924, 465752831, 467412949, 469025154, 471121941, 474241257, 477235069, 476252823, 478816376, 479309616, 477599220, 483266983, 485334396, 482947311, 485507812, 485443268, 488487244, 493259430, 493895454, 495303345, 495029564, 494602203, 496499977, 497944336, 499946022, 502340164, 503860321, 504796791, 508386345, 510282211, 505133629, 507733269, 510329590, 514223289, 516401443, 514168396, 515192490, 517673187, 519949074, 520328865, 520637512, 522700005, 525256996, 526525230, 526385803, 527797966, 529891205, 533455734, 532277946]
3647.3E32277946l740081M555893J463966j318398j289672L714218L373031K119713
3655E41156616M901161m524040p56340L531914R81636J367416L22228J037063J088944
3663.6E49106598J354484J103821j0490L442573K925797m61884n16929m795723Q36601
3672.3E52984848N242767P024079L019981j3125343l090N742721M348183o96106q79936
3681E63658104J371880J259918O02264j04790M69971L356171N507736o144333m388466
3689.7E65588455P101250k798348j441955M134636O58684Q47015R9182j61629R09348
3698.4E74936638o4240J775818L707924k529030l914299L395424J947365n25742m55360
3707E78274498J093788L750954m758530J820946M445228j0198249K437477L756904
$$ y = [532277946, 528537865, 533093758, 534557724, 533239326, 531949654, 535663872, 539036903, 541156616, 546057777, 541533737, 540777397, 544309311, 545290947, 546658363, 546980591, 548017654, 549106598, 550461082, 551564903, 551554413, 554996986, 557922783, 557460899, 556943970, 552148247, 552984848, 558227615, 565251694, 568271675, 555146332, 555143242, 560885963, 565234146, 564538040, 563658104, 565029984, 566289902, 566892166, 566787376, 567257347, 570613518, 576121254, 569976921, 565588455, 572689705, 569891357, 568449402, 572584038, 573242722, 574089737, 574188919, 574027290, 574936638, 574872398, 576648216, 580356140, 577827110, 573912811, 577308235, 579255600, 578729858, 578274498, 579368286, 583119240, 578360710, 580181656, 584626884, 574428635, 576866112, 580623016]
3714.8E80623016J08910M62532K178459J304856l340378k46163M510842j862069m190406
3723.4E79549599M070434K183571O20613k541046j604462K475167l53890M108391r6435
3732.1E88411942p481156O314469L820228n748215j170539J215705k5901J787490K877083
3740.8E90001106l618011J144905J0176697m442520j5647812O768570L939933M831276
3748.5E93154144l28979q923531Q868408j786079p851257L623886L453102L218117
3756.2E93427811l971367P09839N135688m478607k309952K342492P90481K41509L469505
3764.9E95357399j65749m615478O88362L697815J745644p001229l75747K685165P58171
3773.6E92774353J185074L68805J13449k12898K606544J420059p085189j58921J593704
$$ y = [580623016, 580731926, 581194458, 583372917, 584677773, 581337395, 581091232, 585602074, 583740005, 579549599, 583620033, 585803604, 586424217, 583883171, 582278709, 584753876, 584399986, 588508377, 588411942, 580930786, 587245255, 591065483, 585317268, 584146729, 585362434, 585336533, 587124023, 590001106, 586383095, 587528000, 597704697, 593262177, 577614365, 584382935, 588322868, 593154144, 592825165, 583901634, 592770042, 590983963, 583132706, 586756592, 590209694, 593427811, 589456444, 590166283, 595301971, 590823364, 588513412, 590855904, 591646385, 591887894, 595357399, 595191650, 590576172, 591264534, 594962349, 596707993, 589706764, 589331017, 592016182, 592774353, 593959427, 594328232, 594441681, 594228783, 596835327, 598255386, 591170197, 591011276, 592604980]
3782.3E92604980P95136K500725j062203p51152J015129J39580K03667o16455k33460
3790.9E94595947J26305K10762l01323Q54416L536568j437645l989258N92003K777710
3799.6E96965485M935608l554383q417473K426529J853180K878151N292969n600929
3807.3E96779137n376435K711487J714287P83005K54745o52656J60141M563255J954117
3816F02891083j0878220J692772L731842L613167L524895j1242447j473274K639884
3823.7E94499702J891633K747230N04456l534623o07528J554680K603378J796684p135963
3832.4E94319649O63414O263733l648072j095123P474403m418144o004257O090813
3840.1E99646416l023644k018204N423317o96525l404923J255455P72286m49600Q27598
$$ y = [592604980, 593400116, 595900841, 594838638, 594087486, 595102615, 595242195, 595445862, 594829407, 594595947, 594722252, 594933014, 594631691, 595486107, 599022675, 597585030, 593595772, 594187775, 596965485, 601901093, 598346710, 589929237, 592355766, 594208946, 597087097, 602380066, 596779137, 591402702, 594114189, 595828476, 596611481, 596866226, 596213570, 596373711, 600936966, 602891083, 592012863, 593705635, 597437477, 601050644, 604575539, 593333092, 591859818, 594499702, 596391335, 599138565, 599643021, 596108398, 595500870, 597055550, 599658928, 601455612, 594319649, 594983063, 601246796, 597598724, 596503601, 603978004, 599559860, 593555603, 599646416, 596622772, 594604568, 600027885, 599331360, 595926437, 597181892, 597954178, 597504578, 598332176]
3848.8E98332176k68440J731911M763984l290405L009453j0035248m179115P597160
3856.5E97661476N15976j847725J189079J355858K303734l694038p51343N846329k545777
3865.2F00033569n367851J491432L777657O259155l440056q146934Q72879M190216
3872.9E99670067M149399p730294j115493L158569M1618J333428L618431k373467o705513
3881.6E94046745L803673J705513N64041M594307r218674j072464L398819R95446L906707
3890.3F02724113L31345q015289K09579L885117j094971k0027J226540K214202K382775
3898.9F03843384q861275K008820K796325m253730M211578j294251j429748Q34007
3906.7E97855110p05948J063462J60217R9983k27165J42784J40152o00433Q51554J694184
$$ y = [598332176, 598063736, 599795647, 604559631, 601269226, 604278679, 594243431, 590064316, 597661476, 598177452, 596329727, 597518806, 598874664, 601178398, 597484360, 596733017, 602579346, 600033569, 594665718, 596157150, 599934807, 606193962, 602753906, 594606972, 595479851, 599670067, 603819466, 596089172, 594973679, 598132248, 598173866, 599507294, 603125725, 600752258, 594046745, 597850418, 599555931, 600119972, 604714279, 595495605, 594423141, 597821960, 598817406, 602724113, 603055458, 595040169, 595249748, 599134865, 598039894, 598019867, 599246407, 601460609, 603843384, 594982109, 596990929, 599787254, 595533524, 599745102, 598450851, 597021103, 597855110, 597149162, 598212624, 598372841, 598472824, 598245659, 598388443, 598528595, 597928162, 598779716, 600473900]
3916.3F00473900j406326l372727K392464J059303l037147J130714J195793R51080
3924E99387054j436004k608261J174698R39254J269608j78108n54085J390304j855239
3932.7E97529221j085282J226502O0234J22108L57666q5983K50244o22482N69610K204476
3942.3F00526314k797852j826706O82259K83279J236763r02099L96118P10983p95860
3951E97513199J418190l24593j408195k06452N65262M84810r02138m58603K2355J046791
3960.7E97750626O67076j520119m25758N23452Q1559M28352M81071K15302k17056q61092
3970.3E97123413k34413M04205L97263J60408l36571m33922n14068k6436K09541j71051
3980E96578369j46751J93405K09274j40190q8959l87039P1983N67704L34930O42929
$$ y = [600473900, 599067574, 595694847, 598087311, 599146614, 596109467, 597240181, 598435974, 599387054, 597951050, 595342789, 596517487, 597456741, 598726349, 598548241, 597994156, 599384460, 597529221, 596443939, 597670441, 597730675, 597852783, 598210449, 598124466, 598374710, 597752228, 598321838, 600526314, 597728462, 595901756, 596584015, 596867294, 598104057, 597201958, 597598076, 598309059, 597513199, 598931389, 598606796, 597198601, 596992149, 597557411, 598042221, 597140083, 596681480, 596703835, 597750626, 598417702, 596897583, 596471825, 596995277, 597076836, 597505188, 597986259, 598201561, 597984505, 597123413, 596889000, 597293205, 597690468, 597850876, 597514305, 597080383, 596566315, 596539879, 596749420, 596578369, 596431618, 596625023, 596834297, 596694107, 596605148, 596218109, 596290092, 596857796, 597192726, 597835655]
3989.6E97835655J88332o08673r95941q1978P29484j61972m84161P515L63083k34452
3999.2E96556892k84195
4000.2E96272697
$$ y = [597835655, 598023987, 597415314, 596419373, 596337395, 597066879, 596904907, 596420746, 596428261, 596791344, 596556892, 596272697]
##END=$$ End of the data block
