##TITLE=$$ Begin of the data block
##JCAMP-DX=5.00 $$ ACD/SpecManager v 10.08
##SPECTROMETER/DATA SYSTEM=Varian
##DATE=04 Dec 2012 13:19:14
##DATA TYPE=INFRARED SPECTRUM
##DATA CLASS=XYDATA
##ORIGIN=
##OWNER=
##NPOINTS=3735
##FIRSTX=399.26403809
##LASTX=4000.35498047
##MAXX=4000.35498047
##MINX=399.26403809
##MAXY=69.10469818
##MINY=33.29405975
##XFACTOR=1.0000000000
##YFACTOR=0.000000100000000
##FIRSTY=55.84447098
##DELTAX=0.96440572
##XUNITS=1/CM
##YUNITS=TRANSMITTANCE
##XYDATA=(X++(Y..Y))
399.3E58444710J6145363k309685k609367o372109j2741318j24817Q580361l446655
407E55566483N2833M414101L563232J407051l827324m555473k083397L966637K544899
415.7E61049042j02310o204453n268211J5572929q33778J19972k344437p89070J766815
424.3E62966499j441230M729232k382583p243691r02290K337532l220177o272011K704010
433E51275291L837967P7019m98085N44663J930503q80050m557839j090088M971428
441.7E55610809O88706l503227N02357P722244R652672l513260p273102j436576o97175
450.4E57753448k171630J818771M366493k85225j129112j1063k06871r15451M669266
459.1E63888626L098030l286972m210510l731308j046066q59261M7417K856521j245079
$$ plain form
399.3 558444710 574590073 572280388 569671021 563298912 550557594 550432777 559013138 555566483
407 555566483 555619316 560033417 563596649 565003700 561176376 556620903 554537506 558504143 561049042
415.7 561049042 560946732 554742279 549474068 565046997 564213219 564333191 561988754 561199684 562966499
424.3 562966499 561525269 566254501 563871918 556628227 555725937 558063469 554843292 548571281 551275291
433 551275291 555113258 555190277 554692192 555236855 557167358 556287308 551729469 550639381 555610809
441.7 555610809 556299515 552796288 553298645 561020889 570673561 567160301 559887199 558450623 557753448
450.4 557753448 555581818 557400589 561767082 561481857 560352745 560341682 560134811 559219360 563888626
459.1 563888626 566986656 563699684 559489174 555757866 554711800 553852539 553899956 556756477 555511398
467.7E55511398J259003M199371l078346p691116o207886r86328n71823K4986L637886
476.4E46097145P265205N813408k791824o997948j997375M777222L269767l920936
484.1E51514664k649651j588516k100945o50329j833382J328850J469192j424751j143989
492.8E42921143k69776m9667J09711L212928j972885o887588j347428m69627k132263
501.5E33114548J342621L241348R8190J738014J085816n537758j868210K101555j821480
510.2E33494644m186783j668243o63681j258698j282081o68907J055679O34537q79593
518.9E24576874l292618l331871k101555J14517J490441n39856R18541o7673m80843
527.5E17285957O99501q34121q03185k12784L56980j662026k453155Q70514M422569
$$ plain form
467.7 555511398 556770401 560969772 557891426 550200310 543992424 543006096 542434273 542459259 546097145
476.4 546097145 553362350 559175758 556383934 549385986 547388611 552165833 555435600 551514664
484.1 551514664 548865013 547276497 545175552 544525223 542691841 544020691 545489883 544065132 542921143
492.8 542921143 542651367 542601700 542711411 545924339 543951454 537063866 535716438 535246811 533114548
501.5 533114548 534457169 537698517 537796707 539534721 540620537 535082779 533214569 535316124 533494644
510.2 533494644 529307861 527639618 526975937 525717239 524435158 523766251 524821930 525456467 524576874
518.9 524576874 521284256 517952385 515850830 515965347 517455788 516915932 517834473 517766800 517285957
527.5 517285957 517985458 517151337 516348152 516135368 516492348 514830322 512377167 513247681 517670250
536.2E17670250K196007q78678K539292K500114M63257R81483P23114j305389k167892
544.9E22721558R78088l13492j365547J183434K121048J730384o74324L82691N54161
553.6E27318001k217903j868286p22352n69229j684074j370087q43353m40483J569404
562.3E19171638J614724r23844l101959k582130k472268l321075j772957j400375k492561
570.9E02719193n35775P77169P79533o9695n92041J671372J264953o9198m75655j0414
580.6E05459442j42860J230125L914757J981544Q38700J843910K128563J959305J106415
589.3E20319901r16710j668930N43441L10631l71742J147461K284889J438484M9935
597.9E23137360j34735J86767m9515k149887k014580j147384j017723P80830J986580
$$ plain form
536.2 517670250 519866257 518987579 521526871 524026985 524490242 525471725 526194839 524889450 522721558
544.9 522721558 523699646 523386154 522020607 523204041 525325089 527055473 526381149 526763840 527318001
553.6 527318001 525100098 523231812 522509460 521940231 520256157 518886070 518042717 517602234 519171638
562.3 519171638 520786362 519862518 516760559 514178429 511706161 508385086 506612129 505211754 502719193
570.9 502719193 502183418 502960587 503740120 503670425 503078384 504749756 506014709 505945511 505469856 505459442
580.6 505459442 505316582 506546707 510461464 512443008 513281708 515125618 517254181 519213486 520319901
589.3 520319901 519403191 517734261 518277702 518588333 518216591 519364052 521648941 523087425 523137360
597.9 523137360 523002625 523189392 523139877 520989990 518975410 517828026 516810303 517591133 519577713
606.6E19577713K787056J284180Q58497O18706j427574r92966r6092m3755o05049J004029
616.3E22964745J075363j76354K536812L704109K898445J685906J049766p5721K7198
624.9E35690269P29409o76804k28462M17976J721230L045692K008362J408310J840019
633.6E45956001J514015q25843j319275p75757j125374k05879J149979K332725J458626
642.3E48159218N87234J533966J173592n69611m31671l07197j077462n9013j22757
651E48886299M5052P65762M15039P34139Q84628J737480M08745j081886J69563M80270
660.6E53445091l7040j534958j019860L02544M71268J417923k485581q193664Q720207
669.3E51085930M787559J021271K81525Q9035j857758j850090O40145Q39538N41840
$$ plain form
606.6 519577713 522364769 523648949 524507446 525126152 523698578 522705612 522609520 522565765 521960716 522964745
616.3 522964745 524040108 523863754 526400566 530104675 533003120 534689026 535738792 535663071 535690269
624.9 535690269 536419678 535742874 535514412 535932388 537653618 540699310 542707672 544115982 545956001
633.6 545956001 547470016 546644173 545324898 544549141 543423767 543217888 544367867 546700592 548159218
642.3 548159218 548746452 550280418 551454010 550884399 550452728 550145531 549068069 549009056 548886299
651 548886299 548931351 549697113 550112152 550846291 551730919 553468399 553877144 552795258 552964821 553445091
660.6 553445091 553408051 551873093 550853233 551155777 551627045 553044968 550559387 542365723 551085930
669.3 551085930 555873489 556894760 557176285 557265320 555407562 553557472 554197617 555037155 555578995
678E55578995K143783K209740O99997K80762N35240N646j577988j560898l4790j75438
687.6E58105049l0899J548767K028122J000786L81088R50928J55258j114502j754265
696.3E61270332k768631k388801p24907L82423k82516m92249J714974J806030M71878
705E58988533J53618n86968j652298k492981j688003r14879m71191J287803K048226
713.7E54671860J563415J681519K364464J158065k75154j05323o03524m93850N3710
722.3E60015182K97738J602974L365936M382858L311157J936875J771965O90193L32832
731E77707710J205826k65236j978760k03170K159042L032989L155861K397423J840515
739.7E89052200J089516K52190j5564r01757k579650k999344j03341J280976J585083
$$ plain form
678 555578995 557722778 559932518 560632515 560913277 561448517 561454163 559876175 558315277 558280487 558105049
687.6 558105049 558074150 559622917 561651039 562651825 563032913 563983841 564139099 563024597 561270332
696.3 561270332 558501701 556112900 555387993 555770416 555487900 554995651 556710625 558516655 558988533
705 558988533 559142151 558555183 556902885 554409904 552721901 551807022 551335831 552623634 554671860
713.7 554671860 556235275 557916794 560281258 561439323 561164169 561058846 560455322 559961472 560015182
722.3 560015182 560312920 561915894 565281830 569664688 572975845 574912720 576684685 577374878 577707710
731 577707710 578913536 578648300 576669540 576466370 578625412 581658401 584814262 587211685 589052200
739.7 589052200 590141716 590393906 590378342 589476585 586896935 583897591 583794250 585075226 586660309
748.4E86660309L147468J426506p75299q75091j462555k013779j991119j690407l87421
757.1E82038612q31184j515732J47209m10766O8550J975479R13315k70424m27322J18408
766.7E81806145n38521n59120O58493O99501J601829J766129K872124M800567L335419
775.4E96442566J279488J37443K00462N39475K29950R42306J530686J357956J827965
784.1F04488297J921501K260132K230300R45015N09491J8311J60675n82733o43730
792.7F11307259J390533R53751K77443J145668K683982K547608K473564K348023n8098
801.4F25069733k63367j006165q90121K53944N43175J318474R94224J922760K371445
810.1F30314102K133217P49207q29812r21936j324081q58116r84230j08643L04833
$$ plain form
748.4 586660309 589807777 591234283 590458984 589583893 588121338 586107559 584116440 582426033 582038612
757.1 582038612 581207428 579691696 579838905 579428139 579496689 581472168 582385483 582115059 581687737 581806145
766.7 581806145 581267624 580708504 581366997 582066498 583668327 585434456 588306580 593107147 596442566
775.4 596442566 597722054 597859497 598059959 598599434 598829384 599771690 601302376 602660332 604488297
784.1 604488297 606409798 608669930 610900230 611845245 612354736 612373047 612533722 611950989 611307259
792.7 611307259 612697792 613651543 613928986 615074654 617758636 620306244 622779808 625127831 625069733
801.4 625069733 624806366 623800201 622910080 623164024 623707199 625025673 626019897 627942657 630314102
810.1 630314102 632447319 633196526 632366714 631444778 630120697 629262581 628278351 628169708 628474541
818.8F28474541O87675J776657J538620J333351r13353j451759j202850j466637j277580
827.5F27498665k826004k657509j492386k48527N11207Q12073J541099j53427j606903
836.1F21378288j389160k423401l114280k586251k500000j014213k81868n57938J299706
844.8F08810883J729736O68297n40390j997414j633339j539192k437134j924019r80987
853.5F00156441K30217J280327J030426J411399J009064l86734p22198r74198q56094
862.2F02178650k75612L78609O90231K083702L218689L774948M890557K682571R59282
870.9F20581627Q09746L77159J449089J189613N14374L69568R60846J048355J578789
879.5F28879166K251930N23224m26102j279449j972351k119446j688652k273789k925262
$$ plain form
818.8 628474541 629162216 630938873 632477493 633810844 632897491 631445732 630242882 628776245 627498665
827.5 627498665 624672661 622015152 620522766 620274239 620785446 621597519 623138618 622985191 621378288
836.1 621378288 619989128 617565727 614451447 611865196 609365196 608350983 608069115 607511177 608810883
844.8 608810883 610540619 611208916 610668526 608671112 607037773 605498581 603061447 601137428 600156441
853.5 600156441 600386658 601666985 602697411 604108810 605117874 604731140 604008942 603034744 602178650
862.2 602178650 601903038 602281647 602971878 605055580 608274269 612049217 616939774 619622345 620581627
870.9 620581627 621391373 621768532 623217621 624407234 624921608 625291176 626252022 627300377 628879166
879.5 628879166 631131096 631654320 631228218 629948769 627976418 625856972 624168320 621894531 618969269
888.2F18969269j344719m89235J03607r35745j010170L63922r46121k250633k231522
896.9F10228653j683464k522965k338104r07020l57781K38190m72946q86841q35533
905.6F00462189j350479k180863k924194k744560l025780l297882k389298j482391
913.3E81066742j326523j054649j205712k275886k366524j744690k125320k591324
921E66376114k557716j948319r92851j208878q80584O35108J093789Q68034R64317
929.7E62349014K6703j099777p46956n22156m25567M2305M10347J057052J227684J450157
939.3E63768806J842881J701927J551399Q83865L10402l85322j194191r72672j010055
948E66497040j038285j064109j214028o20231o36750j851348k972260l617516l819809
$$ plain form
888.2 618969269 617624550 617135315 617238922 616303177 615293007 615656929 614710808 612460175 610228653
896.9 610228653 608545189 606022224 603684120 602777100 602419319 602657509 602184563 601297722 600462189
905.6 600462189 599111710 596930847 594006653 591262093 588236313 584938431 582549133 581066742
913.3 581066742 579740219 578685570 577479858 575203972 572837448 571092758 568967438 566376114
921 566376114 563818398 561870079 560877228 559668350 558787766 559422874 560516663 561384697 562349014
929.7 562349014 562375717 561275940 560528984 560006828 559581261 559623566 560033913 561090965 562318649 563768806
939.3 563768806 565611687 567313614 568865013 569748878 570059280 569673958 568479767 567507095 566497040
948 566497040 565458755 564394646 563180618 562560387 561923637 560072289 557100029 553482513 549662704
956.7E49662704l992233m339409m116668l784676l440857k894974k550087l172378
964.4E21371422m007225m794464n141373n356102o222115n962257o026039n949135
972.1D77912712n531502n017738m789238n918770n821152o041450o266594o751099
979.8D31775169o155853n593185o310654m905586m529534l864555l518524k184601
987.6C94712677j696434k616005k021751k507210j215782j891442j536750n70870q09555
996.2C79846878M35906n23110L07083Q81233R06640m0436n55191K47535n35049m21410
1005.9C80550079j476707o44417l68347n47562q2893p08923R15j023102q42552j288719
1015.5C73567772j410866l87840j50147k37999q41026Q65364P2746J01204O85006Q26225
$$ plain form
956.7 549662704 545670471 541331062 537214394 533429718 529988861 527093887 524543800 521371422
964.4 521371422 517364197 512569733 507428360 502072258 495850143 489887886 483861847 477912712
972.1 477912712 472381210 467363472 462574234 456655464 450834312 444792862 438526268 431775169
979.8 431775169 425619316 420026131 413715477 408809891 404280357 400415802 396897278 394712677
987.6 394712677 393016243 390400238 388378487 385871277 384655495 382764053 381227303 380656433 379846878
996.2 379846878 380282784 379759674 380066757 380947990 381854630 381814194 381259003 381506538 380971489 380550079
1005.9 380550079 379073372 378428955 378060608 377513046 377430153 376721230 376722145 375699043 374856491 373567772
1015.5 373567772 372156906 371769066 371618919 371380920 370539894 371405258 371478004 371579208 372264214 373090439
1025.2C73090439J108665R8343J134033N38903M27513p75604K07290K121659P10296
1033.8C78661537J062203M35562R11789l87688n51682M92096j34010q3198j156998
1042.5C79249611O96258J94397J27068P83920N90096J286964o4049R71642L46184P96699
1052.2C84978790J223183Q65555J642532J320038K405777J640739K515602K641678
1059.9C99233894K834626L516388K669868L340683K830544K734680J460266J743850
1067.6D20364799J734505l22418j637077k560501j546059k827377l244973l387489
1075.3D06573410k845497j824532k412605q88405j294441k27623j27563Q36753J881218
1084C99670715J059037K311859J228447J828193J469078J693077J728058J198426K466888
$$ plain form
1025.2 373090439 374199104 374297447 375431480 375970383 376397896 375622292 375829582 377951241 378661537
1033.8 378661537 379723740 380159302 381071091 380683403 380131721 380623817 380489807 380406609 379249611
1042.5 379249611 379945869 380140266 380267334 381051254 381641350 382928314 382864265 383835907 384182091 384978790
1052.2 384978790 386201973 387067528 388710060 390030098 392435875 394076614 396592216 399233894
1059.9 399233894 402068520 405584908 408254776 411595459 414426003 417160683 418620949 420364799
1067.6 420364799 422099304 421776886 420139809 417579308 416033249 413205872 409960899 406573410
1075.3 406573410 403727913 401903381 399490776 398602371 397307930 397080307 396952744 397789497 399670715
1084 399670715 400729752 403041611 404270058 406098251 407567329 409260406 410988464 412186890 414653778
1092.7D14653778J885567K407455J110916J712876J284828P2060P47299m29230O24695
1101.4D24070244l48129R8114P90557J92490J094399J009903J892280J417999J502114
1110D31719971J189346O09016P9804j48163L41797L08533J987838J271019J732979
1118.7D39092140K135773J218986J175347p4043N59349O93740O32554J77612R18083
1127.4D46529541J340523R75303K847481K197228J595153M15917j26076j88637j041603
1136.1D54544830j238975k226830q88138j205749j441689j351165j789437j443214
1143.8D42959633k854958j686477k002068k436714k204247k473182k086220k480393
1151.5D24735374q44726q07762J99203J67313m69246k65007j125565O0883k14043P57752
$$ plain form
1092.7 414653778 416539345 418946800 420057716 421770592 423055420 423127480 423874779 423445549 424070244
1101.4 424070244 423722115 423820229 424610786 424803276 425897675 426907578 428799858 430217857 431719971
1110 431719971 432909317 433518333 433598137 433449974 433791771 434100304 436088142 437359161 439092140
1118.7 439092140 441227913 442446899 443622246 443548203 444107552 444801292 445433846 445611458 446529541
1127.4 446529541 447870064 448845367 451692848 453890076 455485229 455901146 455775070 455586433 454544830
1136.1 454544830 453305855 451079025 450190887 448985138 447543449 446192284 444402847 442959633
1143.8 442959633 440104675 438418198 436416130 433979416 431775169 429301987 427215767 424735374
1151.5 424735374 423890648 423082886 423282089 423449402 422980156 422715149 421589584 421650467 421436424 422194176
1161.1D22194176J193313J555176J963959K265816L754081K860527L772087L160210
1168.9D42719345K734108L563385L755875L872642L236466M461784M116554M432297
1176.6D72892456M822311M461709M445953L594665L680420L075753L010025K919998
1184.3E02903290K245521J834069K386551L655967L040009K601013K545586J906623
1192E23118629R16710O69976Q94279J83983K27127Q23898Q04558k6321q1253J032066
1201.6E28563652J123467M98542M11301P23953N01938K51045J97144K78740L17535
1210.3E32867317N96237J122055J040230J467400J674309J644058J058082j40609m42314
1219E40886765j90468m4480q09059o47697K2964j82953k91328n78880J20048l6011
$$ plain form
1161.1 422194176 423387489 424942665 426906624 429172440 432926521 435787048 439559135 442719345
1168.9 442719345 445453453 449016838 452772713 456645355 459881821 464343605 468460159 472892456
1176.6 472892456 477714767 482176476 486622429 490217094 493897514 496973267 499983292 502903290
1184.3 502903290 505148811 506982880 509369431 513025398 516065407 518666420 521212006 523118629
1192 523118629 524035339 524705315 525599594 525783577 526010704 526834602 527639160 527612839 527531586 528563652
1201.6 528563652 529687119 530185661 530596962 531320915 531822853 532073898 532271042 532549782 532867317
1210.3 532867317 533463554 534585609 535625839 537093239 538767548 540411606 541469688 541329079 540886765
1219 540886765 540696297 540651817 539842758 539195061 539218025 539035072 538743744 538164864 538284912 538248901
1228.6E38248901j021728j060677j356353j307450j101227q17947o75392k58255N0239
1237.3E30700111k98271L0060L12843K25907j65940k81944o39610n84488L87688N83000
1247E30269356O79283R37653J629371J695557J307716J013298L69377J9265j04447
1255.7E37816429J29585J06087J63918K74505R24912J910705J427803J200905R21479
1264.3E44876328L98216k69776n31730N26390M03251O2790P11975R76868J404190J632118
1274E50190620J202774P78428K26097k91443o88973p48558k73819L21694N45769M77142
1283.6E51739731J078033J225701J036873J337127L62168m31099n56183p89528p54891
1292.3E54247932m72793k63291p2784O19431Q22448L90663j25579k40021k18582q44002
$$ plain form
1228.6 538248901 537227173 536166496 534810143 533502693 532401466 531583519 530908127 530649872 530700111
1237.3 530700111 530401840 530431900 530744743 530970650 530804710 530522766 529883156 529298668 529686356 530269356
1247 530269356 530948639 531886292 533515663 535211220 536518936 537532234 537901611 537920876 537816429
1255.7 537816429 537946014 538052101 538216019 538490524 539415436 541326141 542753944 543954849 544876328
1264.3 544876328 545274544 545004768 544473038 544999428 545402679 545465469 546177444 547154312 548558502 550190620
1274 550190620 551393394 552171822 552397919 552106476 551417503 550668945 550395126 550716820 551262589 551739731
1283.6 551739731 552817764 554043465 555080338 556417465 556779633 556348534 555792351 555002823 554247932
1292.3 554247932 553775139 553511848 553439064 554058495 554880943 555271606 555146027 554906006 554687424 553843422
1301.9E53843422r16596o16149p20025p00683K2468M04435J69181N30472L96652p6217
1311.6E52336960m96597q47512r99756j021766o18325q29048n02395J91116K4147K05841
1321.2E47442665J47934k1286l24821p41997r52797j004105r90677j331787r48944
1329.9E41274185o92520o86989j98059j10626j04828l84331n04684p04079r23118o35148
1339.6E36329803l03001j99432m52309o8169N05486R25941P07703K64320K03362l82881
1349.2E37530823p19567n98411o52542q45337m83895Q2665J94740R0790r7618K76604
1358.8E34778252j5374p85408j048240q67005j452827j219978l84675n36460k5025
1367.5E28443260m9743k02103R01909M58145Q0871m63485j153984r75418o71006m81987
$$ plain form
1301.9 553843422 552926826 552310677 551590652 550889969 550912437 551316872 551486053 552016525 552413177 552336960
1311.6 552336960 551840363 550992851 549993095 548971329 548353004 547523956 547021561 547212677 547236824 547442665
1321.2 547442665 547590599 547569313 547244492 546502495 545549698 544545593 543554916 542223129 541274185
1329.9 541274185 540581665 539894676 539696617 539585991 539481163 539096832 538592148 537888069 536964951 536329803
1339.6 536329803 536026802 535827370 535375061 535306892 535812378 536738319 537446022 537710342 537913704 537530823
1349.2 537530823 536811256 536212845 535560303 534714966 534231071 534313736 534508476 534599266 534501648 534778252
1358.8 534778252 534762878 533977470 532929230 532062225 530609398 529389420 529004745 528468285 528443260
1367.5 528443260 528393517 528191414 529093323 529551468 529632339 529168854 528014870 527039452 526368446 525886459
1377.2E25886459q36296J66130R50051J186332Q62542R61494J094666O06536J116867
1385.8E31994781Q87414J15852M77943J264878O80542M38804J253281J068649N68810
1394.5E38750954r48525J37673j56670q25157r21669j152954J71623r5444R5215L99551
1404.2E35454597K17400J038666M28505k59552p35054p34673q57544j322441j524849
1412.8E31705055o11458q812j71890M94843O13060Q52699n12199j20469Q14209l18870
1422.5E32736168k76527n50347N88036P77855L53469R23958N64804M94042k36893j14517
1432.1E35260048q09441j471214m96292k78816p56035j25656J423416O35681J25236
1440.8E33506927L51563O0806o7863q49686l54233n41916k84042j323471q01582L27224
$$ plain form
1377.2 525886459 525050163 525216293 526166344 527352676 528215218 529176712 530271378 530877914 531994781
1385.8 531994781 532882195 532998047 533475990 534740868 535421410 535860214 537113495 538182144 538750954
1394.5 538750954 537802429 537940102 537783432 536958275 536036606 534883652 535055275 534959831 535055046 535454597
1404.2 535454597 535671997 536710663 537139168 536879616 536144562 535409889 534552345 533229904 531705055
1412.8 531705055 531093597 531084785 530912895 531407738 532020798 532873497 532361298 532240829 533055038 532736168
1422.5 532736168 532459641 531909294 532497330 533275185 533628654 534552612 535117416 535611458 535374565 535260048
1432.1 535260048 534450607 532979393 532483101 532204285 531448250 531322594 532746010 533381691 533506927
1440.8 533506927 533858490 533919296 533851433 533001747 532647514 532105598 531821556 530498085 529696503 530023727
1450.5E30023727r22317o46820j143608K556r4910j703034k606964k572898K163696
1459.1E22499428J52435J049385N56679O45637J118470k88277J894379J118850L189965
1467.8E31936951L447799M405175M641113L781814O289177M422989N432396L565064
1475.5E67922478L800544L356400L370171L142814J674919K070313Q45108J289215
1483.2E87471962Q57658P21932J591835J048927K091675J437988N06897J5564Q72765
1491.9E96617203O40678o31599m54178l04375j385383J3732j8768J38054J151428P55844
1501.6E96522636m17938m42505J79100J27144n133896m996681M1771K37274N0392L48435
1511.2E86515732k80647p94144L92685k57073r26017r14307l285561O9428J297340
$$ plain form
1450.5 530023727 529101410 528454590 527310982 527313538 527218628 525515594 522908630 520335732 522499428
1459.1 522499428 522651863 523701248 524257927 524903564 526022034 525733757 527628136 528746986 531936951
1467.8 531936951 535384750 539789925 544431038 548212852 554502029 558925018 564357414 567922478
1475.5 567922478 571723022 575079422 578449593 581592407 583267326 585337639 586182747 587471962
1483.2 587471962 588329620 589051552 590643387 591692314 593783989 595221977 595728874 595744438 596617203
1491.9 596617203 597257881 596626282 596172104 595867729 594482346 594496078 594477310 594615364 595766792 596522636
1501.6 596522636 596104698 595662193 595841293 595968437 590834541 585837860 585879631 586116905 586167297 586515732
1511.2 586515732 586235085 585440941 585833626 585576553 584650536 583736229 580450668 580520096 581817436
1519.9E81817436m32014k295037O20804J856804J394348n43632O599P26280o48536
1528.6E82503052r73358p68357j227531q38204p26585j433563R97124J496734J069489
1537.2E80098801J214409n05753l804207M80919K69318q22792j98670j05400k12555
1545.9E76414070J597786J792450J187782Q75054L61175J065865N31921P28684l47634
1554.6E84207153o38237K189789J138001M51622K427444J22032L132248J987076J476021
1563.3E96493149N97801k59514l06663N39932O42929j03798q8921J333771K231217
1572F01079903J133155O30112J237564J013718k925835j460495L10173k89383J91880
1580.6F00920792J89247Q4457J5106k26020M94041k95334j187973j302872r05342j627922
$$ plain form
1519.9 581817436 581385422 579090385 579711189 581567993 582962341 582418709 582425308 583151588 582503052
1528.6 582503052 581529694 580761337 579533806 578695602 577969017 576535454 577532578 579029312 580098801
1537.2 580098801 581313210 580807457 577003250 577484169 577753487 576930695 576732025 576626625 576414070
1545.9 576414070 578011856 579804306 580992088 581867142 582228317 583294182 583826103 584554787 584207153
1554.6 584207153 583568916 585758705 586896706 587348328 589775772 589897804 593030052 595017128 596493149
1563.3 596493149 597090950 596831436 596524773 597064705 597707634 597603836 597514915 598848686 601079903
1572 601079903 602213058 602843170 604080734 605094452 602168617 600708122 601018295 600728912 600920792
1580.6 600920792 601110039 601194496 601209602 600983582 601477623 601182289 599994316 598691444 597786102 596158180
1590.3E96158180j454048p37114o43806n54390j217881m89006n63011q12263j474724
1599E88211937j989059k135964k407303j495514k175064j904182j631851j128006j259690
1607.6E72085304j413078j560059k454109j466636k834015k645989k723732j782532
1615.4E55205154j110267o848946n65834r17740j641655k293853j111260j793785n827179
1624E33094635j741447k049561j484795l352966k715073j439247j784629j014138j823349
1632.7E15689430n43022l97072k785148m493142p37648r06333j136666l6125j407166
1641.4E03247108j9378o57959O77833J025124k114906n34058j566353J465187l0975
1650.1E01491623O57692J386223m26941l504791J67045L469162J486015J703377R14345
$$ plain form
1590.3 596158180 594704132 593967018 593323212 592768822 591550941 591061935 590498924 589686661 588211937
1599 588211937 586222878 584086914 581679611 580184097 578009033 576104851 574473000 573344994 572085304
1607.6 572085304 570672226 569112167 566658058 565191422 562357407 559711418 556987686 555205154
1615.4 555205154 554094887 547245941 546680107 545762367 544120712 541826859 540715599 538921814 533094635
1624 533094635 531353188 529303627 527818832 524465866 521750793 520311546 518526917 517512779 515689430
1632.7 515689430 515146408 514749336 511964188 507471046 506733398 505827065 504690399 504654274 503247108
1641.4 503247108 503227730 502569771 503247604 504272728 502157822 501623764 500057411 501522598 501491623
1650.1 501491623 502149315 503535538 503108597 499603806 499770851 503240013 504726028 506429405 507343750
1658.8E07343750J067848J224289P61681J475906j51634K318993J800117J978035K425308
1667.4E20244293K040940K307968J029739K306252J052932J999665K199325J353874
1675.1E34534988N8861J781769L182907K065010K499848K116699K836036L342209J121483
1683.8E53539810j015053J85013L156815K423782J806145K143364K226906K727890
1691.5E67194672K417106K505951K914849L218803j090660J383209K248688K299423
1699.3E83092041K563362j036911L008957K439308J876221J252594J467094L88527
1707E95051193j50947Q50792K67219j98173J94130J313934J597519N14564R66034J873741
1716.6F02280006J684075j375618R97162Q89625J4496N1575l1777l10859J7280L35045
$$ plain form
1658.8 507343750 508411598 509635887 510397568 511873474 511721840 514040833 515840950 517818985 520244293
1667.4 520244293 522285233 524593201 525622940 527929192 528982124 530981789 533181114 534534988
1675.1 534534988 534593849 536375618 539558525 541623535 544123383 546240082 549076118 552418327 553539810
1683.8 553539810 552524757 552709770 555866585 558290367 560096512 562239876 564466782 567194672
1691.5 567194672 569611778 572117729 575032578 578251381 577160721 578543930 580792618 583092041
1699.3 583092041 585655403 584618492 587627449 590066757 591942978 593195572 594662666 595051193
1707 595051193 594900246 595751038 596018257 595820084 596014214 597328148 598925667 599440231 600406265 602280006
1716.6 602280006 603964081 602588463 603585625 604475250 604489746 604541321 604509544 604198685 604215965 604551010
1726.3F04551010l85971n45273o52694k777977k902871r52682j229820n133820p775345
1734.9E82194557j236534j879654l048210k168579l550606o068764j773185o43921
1742.7E61825104l486786k198067k25220R64318J210365K909279M744377M012070P946319
1751.3E77701759O725693P054024O904487O135216P035332O170158N792885M824600
1759F28344154M961739M562073L720855M123078M157562L542023K238006K254486J819993
1767.7F59723969l11127R69467J835403N68009J69754O24618K246552K156753M07563
1776.4F68390961J621017J368790O31714L41415q30307L85132N83877J85776j12457
1785.1F72565918N82809J531907J123809R00574J087570K28119J71433o74973j154327
$$ plain form
1726.3 604551010 604165039 603619766 602967072 600189095 597286224 596333542 595103722 589969902 582194557
1734.9 582194557 580958023 579078369 576030159 573861580 570310974 564242210 562469025 561825104
1742.7 561825104 558338318 556140251 555915031 556879349 558089714 560998993 565743370 569755440 577701759
1751.3 577701759 584427452 591481476 598385963 604521179 611556511 617726669 623519554 628344154
1759 628344154 633305893 637867966 641588821 645711899 649869461 653411484 655649490 657903976 659723969
1767.7 659723969 659412842 660382309 662217712 662785721 662955475 663580093 665826645 667983398 668390961
1776.4 668390961 670011978 671380768 672012482 672353897 671523590 671908722 672492599 672678375 672565918
1785.1 672565918 673148727 674680634 675804443 676705017 677792587 678020706 678192139 677517166 676362839
1793.8F76362839R08050K46659k83661J040649J665421J277923k13394O42548L38440
1802.4F81985474k73972J76239j92566l42178m39301J73264N92193N79071M66309Q27103
1812.1F83551636J222458P87963J24665n30396j06506p42569q83942K43454M13819
1820.8F84080582O70318L76740J076278J467591r32083l66745O47430q2321q43582
1829.4F86094208k089005N61524J395416l5553N81741R33457N86242N41230j59836
1838.1F88409424P4386m18167k45437p89185l59344P02896j701660J065216J733932
1846.8F88472061P88574L36075J42517K85874n68161q24280o84815j84936k15607l5095
1856.4F87512207O58875M18319P29141O94886N47943k03247q30155n89904m83551k47803
$$ plain form
1793.8 676362839 677270889 677517548 677233887 678274536 679939957 681217880 681004486 681647034 681985474
1802.4 681985474 681711502 681887741 681695175 681352997 680913696 681086960 681679153 682258224 682724533 683551636
1812.1 683551636 684774094 685562057 685686722 685156326 685049820 684307251 683423309 683666763 684080582
1820.8 684080582 684750900 685127640 686203918 687671509 686739426 686372681 687020111 686937790 686094208
1829.4 686094208 684005203 684566727 685962143 685926590 686508331 687441788 688028030 688569260 688409424
1838.1 688409424 688483810 688065643 687820206 687031021 686671677 687374573 685672913 686738129 688472061
1846.8 688472061 689260635 689596710 689739227 690025101 689456940 688632660 687947845 687762909 687547302 687512207
1856.4 687512207 688171082 688589401 689318542 690013428 690561371 690358124 689527969 688938065 688454514 688206711
1866.1F88206711m05503L46375L3264k76413R66110J184922N96084m55551n58395n01099
1875.7F89136505k82059k07748k80151p1488K80152P89642L44162N81512N49775r7886
1885.4F90742416j94244m90265Q8196k55203j685562k76108Q96454M29992Q40531P62252
1895F90858459k44903M33426j27258k68250k44293n52826j67313m69665j66855N5771
1904.7F89106293M67071M11072L4180K54135J78070J5488k97852j28632o71844m34113
1914.3F88933868k73056l69186M77142l62167O29806R63593J34201N00488n96618r27430
1923.9F89110641q6364l26157m03519Q774J9608J35956O04171N51148L00369j29089
1933.6F89785538k50931l04108j07040m02146p02819k23084m08478M35486N33066o73141
$$ plain form
1866.1 688206711 687801208 688147583 688180847 687904434 688870544 690055466 690651550 690195999 689637604 689136505
1875.7 689136505 688854446 688646698 688366547 688295059 688575211 689364853 689709015 690290527 690840302 690742416
1885.4 690742416 690548172 690057907 690146103 689890900 688205338 687929230 688825684 689255676 690096207 690858459
1895 690858459 690613556 691046982 690919724 690651474 690407181 689854355 689687042 689217377 689050522 689106293
1904.7 689106293 689573364 689984436 690018616 690272751 690450821 690466309 690168457 690039825 689367981 688933868
1914.3 688933868 688660812 688291626 688768768 688406601 689036407 690000000 690134201 690634689 690038071 689110641
1923.9 689110641 689024277 688698120 688294601 688303375 688322983 688458939 689063110 689614258 689914627 689785538
1933.6 689785538 689534607 689230499 689123459 688721313 688018494 687795410 687386932 687822418 688355484 687682343
1943.2F87682343N48629J283799M00619o01959o42624m71344k37045l68042n49851
1951.9F87044525j17111M45938O41174N47867Q14743N4703l54080j05286o84967o72836
1961.6F87614670m74472k42768r3689L35312J014328N73273J59302M09927L7918p11746
1971.2F88622055q82950o86950j60141l33710K2659P85599J84250M56085M50897J30081
1980.8F88587875J2284n85785p33872q47015k76260j15281R2392M46701J75171O63605
1990.5F87419815M87518j58996j16501J8082m80957o81763k21024l48510n48859k91061
2000.1F85077744O27594O71005J75171M67071K91748m61120r83124p49664n85633m68979
2009.8F84061813l24630J67312O06079K58637L77884J29776k70157n19562n25818l72314
$$ plain form
1943.2 687682343 688230972 689514771 689915390 689313431 688670807 688199463 687962418 687594376 687044525
1951.9 687044525 686927414 687373352 688014526 688562393 689377136 689431839 689077759 688972473 688287506 687614670
1961.6 687614670 687140198 686897430 686803741 687139053 688153381 688726654 688885956 689295883 689333801 688622055
1971.2 688622055 687739105 687052155 686892014 686558304 686580963 687366562 687550812 688006897 688457794 688587875
1980.8 688587875 688600159 688014374 687280502 686433487 686157227 686041946 686134338 686581039 686756210 687419815
1990.5 687419815 687907333 687748337 687631836 687649918 687168961 686487198 686266174 685917664 685368805 685077744
2000.1 685077744 685705338 686376343 686551514 687018585 687310333 686849213 685866089 685116425 684530792 684061813
2009.8 684061813 683737183 683904495 684510574 684769211 685147095 685276871 685006714 684487152 683961334 683589020
2019.4F83589020n20859n6152M7989l17612l61328J99814K54211m5853K93732P1487
2029.1F83154449k25067o19125m07715l30505q38394k61612J70059J907k79388J87301
2038.7F80551910L30124J4344P4997k41242l75748o75201l61252k31705j3427M16565
2048.4F79489365p8888K8228k4643L82996L37906m21448j47247k60849l56979l39432
2058F78609009k18353r2927K35520O34231L30964K36740K08740k14462p99485l53317
2067.6F78576660j43814m79202o7826q3618J06583L97415N50919M15115M7836N6076
2077.3F79376144m34417m59137L0594j66855o33087l36304O7978K69089O12411M34341
2086.9F78760757K63749J50833J0986l85284o92215o21643k64435K20642j77994L7232
$$ plain form
2019.4 683589020 683068161 683012009 683059998 682742386 682381058 682580872 682835083 682789230 683082962 683154449
2029.1 683154449 682929382 682310257 681902542 681572037 680733643 680472031 680642090 680643997 680364609 680551910
2038.7 680551910 680882034 680896378 680971375 680730133 680354385 679679184 679317932 679086227 679072800 679489365
2048.4 679489365 679410477 679438705 679414062 679797058 680134964 679713516 679566269 679305420 678948441 678609009
2058 678609009 678390656 678297729 678533249 679167480 679498444 679735184 679943924 679729462 678929977 678576660
2067.6 678576660 678432846 677953644 677885818 677802200 677908783 678306198 678857117 679272232 679320068 679376144
2077.3 679376144 678941727 678482590 678513184 678346329 677713242 677376938 677444916 677714005 678326416 678760757
2086.9 678760757 679024506 679175339 679186325 678801041 678108826 677487183 677222748 677443390 677265396 677302628
2096.6F77302628P42187P32498K16751j78680o0959k05994k30636m90723k53982l510
2106.2F77569580j11923J41830l8452M69132M33883O2180J13754j35345j43738m03977
2115.9F77956924l17916n09415k63062L18451K25144L29971M35867N64270l27987o85196
2125.5F77727051j97449k05688j11084m46244k47116Q4915K59858N86853L46374K33841
2135.1F78031311J69754j13449k91748m66232m14658L7537j06736o103L01590P0419
2144.8F77211685L41263K39563N6152j87072m18168k38647n28564m18015K2583R9945
2154.4F76180725n0964M68979P59353L09830L20663j36642n91736l57056L4333k36359
2164.1F76701126l44009K06680K84576N52521K49100q6212K06299J57775J13907j17721
$$ plain form
2096.6 677302628 678044815 678777313 678994064 678815384 678754425 678548431 678317795 677827072 677573090 677569580
2106.2 677569580 677457657 677599487 677561035 678030167 678464050 678526230 678639984 678504639 678360901 677956924
2115.9 677956924 677639008 677129593 676866531 677184982 677410126 677740097 678175964 678740234 678412247 677727051
2125.5 677727051 677529602 677323914 677212830 676766586 676519470 676604385 676864243 677451096 677797470 678031311
2135.1 678031311 678201065 678087616 677795868 677329636 676914978 676952515 676845779 676839676 677141266 677211685
2144.8 677211685 677552948 677792511 677848663 677661591 677243423 677004776 676476212 676058197 676080780 676180725
2154.4 676180725 676129761 676598740 677358093 677667923 677988586 677851944 677260208 676903152 676937485 676701126
2164.1 676701126 676357117 676563797 676848373 677400894 677649994 677563782 677770081 677927856 678041763 677924042
2173.7F77924042j85166j68991j74255n1727O4315K54670M76379N18951L85743J35574
2183.4F79179535k89002r3689j67846k87323Q4533q8195j22376O1722L83682L39432
2193F79000473L74908M40751K5711O4010l051q8959m34342m58450j87454P5836L95584
2203.6F79205017j69296J47934N87387M60052K98462O0272K39411j82800n04990o27289
2213.3F79514160j64566K41852M3259N82122P96585L99933l20434k89002k4414l20968
2222.9F80458527k90909m94003m19693k8992L93829N04379L75367M16565L26232J23215
2232.5F81364517l31878k87552j58844n73807p59811r5673M08935M83246Q10623M97895
2242.2F81357651K41470n0201l53623l82309o91452m11606j39694j45950j5640L45306
$$ plain form
2173.7 677924042 677738876 677569885 677395630 677343903 677408218 677662888 678139267 678658218 679043961 679179535
2183.4 679179535 678890533 678796844 678628998 678341675 678426208 678338013 678215637 678277359 678661041 679000473
2193 679000473 679375381 679816132 679841843 679905853 679902802 679813843 679379501 678921051 678733597 678809433 679205017
2203.6 679205017 679035721 679183655 679771042 680231094 680529556 680589828 680829239 680646439 680141449 679514160
2213.3 679514160 679349594 679591446 679634705 680216827 681013412 681413345 681092911 680803909 680779495 680458527
2222.9 680458527 680167618 679673615 679253922 679224930 679618759 680123138 680498505 680915070 681241302 681364517
2232.5 681364517 681032639 680745087 680586243 680012436 679252625 679156952 679565887 680049133 680859756 681357651
2242.2 681357651 681599121 681548920 681195297 680812988 680121536 679709930 679570236 679424286 679408646 679753952
2251.8F79753952K51770L06854N60990p1259k40555l97491m45938m07410l00217L34397
2261.5F79345093M04968K38495l281J93939J71509K0142o6300l17001n6534q7356n34
2272.1F79843140l82996k50320J26113K17286P14340k1744j79825l2730N1651m3716
2281.7F80041199m74701k46353m76685j10779j07803J72501N42907J13297m6845m34952
2291.4F78971786M0360l48740m76532j60369m78364k96401o20575R0560M65165L66745
2301F77553635J16958K9602K65885q15735r11560o36063k40478m14353m86450p5302
2310.7F74386139p03964l0670J67617M60816m3488n85327O3477o03867o29883j236572
2320.3F71244278q25806l20892n45654k00501n83343L85589n4321l88794J03912l7841
$$ plain form
2251.8 679753952 680005722 680312576 680873566 680802307 680561752 680164261 679718323 679310913 679010696 679345093
2261.5 679345093 679750061 679988556 679985275 680179214 680350723 680370865 680304565 679987564 679931030 679843674 679843140
2272.1 679843140 679460144 679209824 679335937 679553223 680267563 680245819 680065994 680033264 680084915 680041199
2281.7 680041199 679566498 679320145 678843460 678732681 678624878 678797379 679340286 679453583 679406738 678971786
2291.4 678971786 679012146 678663406 678186874 678026505 677548141 677251740 676631165 676721725 677186890 677553635
2301 677553635 677670593 677700195 677966080 677150345 676238785 675602722 675362244 674947891 674461441 674386139
2310.7 674386139 673682175 673651505 673819122 674279938 674236450 673651123 673714600 673110733 672480850 671244278
2320.3 671244278 670418472 670097580 669551926 669351425 668768082 669153671 669099350 668710556 668814468 668776627
2329.9F68776627r32541j069641K7389q65707P5149K82898n04532K05841P88498L15552
2339.6F67099533j500778q41370k47345L11966N27268O11648J324768R96094J188507
2348.3F69470291L71781k52457o85349j592559j545334r11255q50830k152176k061157
2356.9F59790955o86341R50241P34711j3123J36948k44446M50592r994M37775Q0184
2366.6F61627502L72010R59930m18243J93252J079026K304687J358795K03171N50766
2375.3F68230896J83029M07868p630j20697M9362M43497Q66852Q80585J115341O51626
2384.9F72700729M40445L7384k67105k67486o82679n61981n14221j57700K83127L03803
2394.6F71314316L73535N02014M65546p7515o55823q05893m12597l17993m04740m51584
$$ plain form
2329.9 668776627 667844086 666774445 666801834 665936127 666011276 666294174 665789642 665995483 666783981 667099533
2339.6 667099533 665598755 664757385 664510040 664822006 665349274 665960922 667285690 668281784 669470291
2348.3 669470291 669842072 669589615 668904266 667311707 665766373 664855118 664004288 661852112 659790955
2356.9 659790955 659104614 660054855 660789566 660776443 660913391 660668945 661119537 661109543 661547318 661627502
2366.6 661627502 661999512 662959442 662541199 662734451 663813477 666118164 667476959 667680130 668230896
2375.3 668230896 668413925 668821793 668814163 668693466 668742828 669186325 670053177 670933762 672049103 672700729
2384.9 672700729 673141174 673178558 672911453 672643967 671961288 671399307 670885086 670727386 671010513 671314316
2394.6 671314316 671687851 672189865 672655411 672577896 671922073 671116180 670703583 670385590 669980850 669529266
2404.2F69529266j7013N27267l1433P6L51181L07694l2272n54886m95072n45959m23432
2414.8F68615417j99203j92947j22071j6403J51291L97491J26725m68979l57666m23660
2424.5F67509995k66953k42615m91256j33057k56577q2245K23771J56173j7471j39160
2434.1F66260605k49634m22592k136k96402n24979k78702k94189q4305j65405J17416
2443.7F64059677L00827j05667m85916l91312l55224o07758j20468R3384n9967k08054
2453.4F62119522k67868q4763j50527j3199J26877M1961l01208n84259l97492m8446
2463F60440598q7204l37830o8436l8070j71357L02582M45862j87759l40958l86658
2472.7F59570770n75943j57928l21274m98505l79104j35651M48532L22952L8453j15052
$$ plain form
2404.2 669529266 669512253 670039520 670008087 670008163 670359344 670667038 670634766 670079880 669584808 669038849 668615417
2414.8 668615417 668416214 668223267 668101196 668084793 668236084 668633575 668760300 668291321 667933655 667509995
2424.5 667509995 667243042 667000427 666509171 666376114 666119537 666037292 666261063 666417236 666399765 666260605
2434.1 666260605 666010971 665588379 665586243 665289841 664764862 664486160 664191971 664107666 663942261 664059677
2443.7 664059677 664360504 664254837 663768921 663377609 663022385 662414627 662294159 662387543 662327576 662119522
2453.4 662119522 661851654 661766891 661616364 661603165 661730042 661772003 661470795 660886536 660489044 660440598
2463 660440598 660353394 660015564 659947128 659909058 659737701 660040283 660486145 660298386 659957428 659570770
2472.7 659570770 658994827 658836899 658515625 658017120 657638016 657502365 657950897 658273849 658312302 658197250
2482.3F58197250k70538l93982j76163j15509o26983n22461J2436M56543K10495j62125
2492F56608963j21918n7907l1051k71149l22724m13970p3700J73263l00140n00183
2501.6F54689484j21460L57132K7160J755m9210j74865K52304j18180o99005o98394
2511.2F53466721j09559Q3161o485Q3923K38571K83661k60849k46811l46984l87879
2520.9F52797470m26330o69404k03704o180K46887l1738j60675J36490P3623p9193
2530.5F51677246n40543p9269o2942k77710r2011m32510l87039j42060L29361L58353
2540.2F50350876J50833l21884n03769L4637l81927p06406n87997j96305N8594J27640
2549.8F48024292K13394l36456l09067R3308J94168k97013n82046l32108l57208j57700
$$ plain form
2482.3 658197250 657926712 657532730 657356567 657241058 656614075 656091614 656104050 656560593 656771088 656608963
2492 656608963 656487045 656429138 656398087 656126938 655804214 655390244 655316544 655489807 655189667 654689484
2501.6 654689484 654568024 654925156 654952316 654954071 654904861 654729996 654982300 654864120 654165115 653466721
2511.2 653466721 653357162 653440323 653433838 653517761 653756332 654039993 653779144 653532333 653185349 652797470
2520.9 652797470 652371140 651701736 651498032 651491852 651738739 651707001 651546326 651682816 651756439 651677246
2530.5 651677246 651136703 651057434 650994492 650716782 650624771 650192261 649805222 649663162 649992523 650350876
2540.2 650350876 650501709 650179825 649676056 649710693 649328766 648622360 648034363 647838058 647896652 648024292
2549.8 648024292 648237686 647901230 647592163 647685471 647879639 647582626 647000580 646668472 646311264 646153564
2559.5F46153564j37939J52664L48511j63879n13764k73056J72653N7450k30027p24182
2569.1F44841995p08465k42386k15378q7585O0958J99433J25808j34658j39923j02692
2578.7F43597107n37109o14090k46048l42560k75650j80512N4703K52914K95716J02768
2588.4F42107239m01612k15301k59781m85764n61141j34202L43476k28501j52664R5825
2598F40107574O6452j13754n22384k9488L20892k22816o29997m70505m97589m20914
2607.7F37587471k52037j83220K01263K29111J26572j5602o9542k44103o12907m28505
2617.3F36338501l12996m83360o03447l17345p1335k38418j97335j4076j89590l85666
2627F33524933k19994m74128p33262n26313r270J67694l75328k92549Q1367j03798
$$ plain form
2559.5 646153564 646015625 646168289 646516800 646352921 645839157 645566101 645738754 645796204 645566177 644841995
2569.1 644841995 644133530 643891144 643675766 643588181 643649139 643848572 643974380 643839722 643699799 643597107
2578.7 643597107 643059998 642445908 642199860 641857300 641581650 641401138 641455841 641708755 642004471 642107239
2588.4 642107239 641705627 641490326 641230545 640744781 640183640 640049438 640392914 640164413 640011749 640107574
2598 640107574 640174026 640060272 639537888 639508400 639829292 639606476 638976479 638505974 638008385 637587471
2607.7 637587471 637335434 637152214 637353477 637582588 637709160 637693558 637624016 637379913 636767006 636338501
2617.3 636338501 636025505 635542145 634938698 634621353 634550018 634311600 634114265 634100189 633910599 633524933
2627 633524933 633304939 632830811 632097549 631571236 631561966 631729660 631354332 631061783 631143150 631039352
2636.6F31039352m24995j72157k26670p20558m67415l86810m93545m61579r6474J55831
2646.3F27744980R5100K49977K747k58026o84586p95479o74667n50041l55759o84852
2655.9F24089394k43035K02103N26161K80609n40542j02768k10991o04897n65033n56450
2665.5F22274551l68843l97148k17247N4932O0081j16234r8571k15874l50418l14255
2675.2F20310974m29268o07033p45849l09715L8K00958K22397j70593l30697j51290
2684.8F17989922J35574m53186o30493m73290m42543j38893k11906K66571K4719k42272
2694.5F15824203J65253j19781j02196l26614p06444o39420m44526l90130k87475k8610
2704.1F12944260m8294J03721K7924m27323m79354l0747j26877n29594o30150p48558
$$ plain form
2636.6 631039352 630614357 630442200 630215530 629494972 629027557 628640747 628147202 627685623 627589149 627744980
2646.3 627744980 627840080 628090057 628092804 627834778 627150192 626354713 625680046 625130005 624774246 624089394
2655.9 624089394 623846359 624048462 624574623 624855232 624314690 624211922 624000931 623396034 622831001 622274551
2665.5 622274551 621905708 621508560 621291313 621346245 621406326 621290092 621191521 620975647 620625229 620310974
2675.2 620310974 619881706 619274673 618528824 618219109 618219147 618420105 618642502 618471909 618141212 617989922
2684.8 617989922 618125496 617672310 617041817 616568527 616125984 615987091 615775185 616041756 616066475 615824203
2694.5 615824203 615989456 615869675 615767479 615440865 614734421 614095001 613650475 613260345 612972870 612944260
2704.1 612944260 612895966 612999687 613027611 612600288 612120934 612090187 611963310 611433716 610803566 610055008
2713.8F10055008k29645r2583l42483R308J09062j28822J18293J10207q22296o78139
2723.4F08107910o0768k81563n27267l61557r3994j86463P3967j19858n45883l46031
2733F05658493j23177j84555n34706m45404l57704o2447m8866l55034j53503j38702
2742.7F03254395J36489J0605j92299p24j86501m17862m21791m19655n49927j54152
2752.3F01058578j37557r8458J10359j61209k07824k30408L5362n04532o26259k06489
2762E99031563o16150j12457L60298J38664l10745j46790J526k85568p0801l32985
2771.6E97656555l74412l92571k93846m28162p24296q4725j793J00937p3738m87251
2781.3E94896698m13055n11170o12831m14200j10550n23796j66702K3651n64270l93791
$$ plain form
2713.8 610055008 609825363 609732780 609390297 609399605 609508667 609379845 609498138 609608345 608786049 608107910
2723.4 608107910 608047142 607765579 607238312 606876755 606782761 606596298 606670265 606550407 606004524 605658493
2733 605658493 605535316 605350761 604816055 604370651 604012947 603950500 603901634 603546600 603393097 603254395
2742.7 603254395 603390884 603401489 603209190 603208466 603021965 602604103 602182312 601762657 601212730 601058578
2752.3 601058578 600921021 600822563 600932922 600771713 600563889 600333481 600368843 599864311 599238052 599031563
2762 599031563 598415413 598302956 598663254 598801918 598491173 598344383 598345909 598060341 597989540 597656555
2771.6 597656555 597282143 596889572 596595726 596167564 595443268 595358543 595356750 595457687 595383949 594896698
2781.3 594896698 594483643 593972473 593359642 592945442 592834892 592311096 592144394 592168045 591603775 591209984
2790.9E91209984l10669j17760j00326j31646q00666j230317k91214j64642m36020
2799.6E87626724m01001r1057l86390r27391m06533j77574n98335j058884q12339m78936
2809.2E82288284l36189k88582q32405p37228j77040j16387n00183o88934r59702j460533
2818.9E76191101j165390o47545o39114j046410j179924q96187p95021p76138r07326
2827.6E68138046j216049j124496j052628j636848j635018j106491j141472j660652
2835.3E57564392j781845j511803k083587k299652k526627l506546l550987l802567
2843E36500778m814110n362053n531539n743332o274224o346588n733528n295715m535904
2851.7D86863785l755188l258400j808548K8343J424141K146988K443199L218803L393631
$$ plain form
2790.9 591209984 590899315 590781555 590681229 590549583 589748917 588518600 588227386 588062744 587626724
2799.6 587626724 587225723 587134666 586748276 585820885 585414352 585236778 584638443 583579559 582767220 582288284
2809.2 582288284 581952095 581663513 580831108 580093880 579916840 579800453 579300270 578611336 577651634 576191101
2818.9 576191101 575025711 574378166 573739052 572692642 571512718 570616531 569821510 569045372 568138046
2827.6 568138046 566921997 565797501 564744873 563108025 561473007 560366516 559225044 557564392
2835.3 557564392 555782547 554270744 552187157 549887505 547360878 543854332 540303345 536500778
2843 536500778 531686668 526324615 520793076 515049744 508775520 502428932 496695404 491399689 486863785
2851.7 486863785 483108597 479850197 478041649 478069992 479494133 481641121 484084320 487303123 490696754
2860.3D90696754L397103L458710K725791K348328J918717J171989N83992M0779l67088
2869E05975075l68271k94075n25437n91316j92299M45137P28684O04782k31819n93224
2878.7E04957237l49083q14552p48596r18541j140328p85751o29654o35528j225892
2887.3D97709312r05761q09479j695709j461678j286621j886787j824417j245308j592102
2896D85001450j764603j274376j324387j789970j881866j446076j749534k134820k678680
2904.7D68957138k920608j840821k010193k951049l116875k758446l001633m225196
2912.4D46132317m645272m659118m893952n180816n270348n478783n547027m393997
2920.1D06063004l723984l477745k944184k157936p29828k9029k82479J75247J476670
$$ plain form
2860.3 490696754 494093857 497552567 500278358 502626686 504545403 505717392 506301384 506342163 505975075
2869 505975075 505606804 505312729 504787292 504195976 504003677 504448814 505177498 505782280 505550461 504957237
2878.7 504957237 504608154 503793602 503045006 502126465 500986137 500200386 499570732 498935204 497709312
2887.3 497709312 496803551 495994072 494298363 492836685 491550064 489663277 487838860 486593552 485001450
2896 485001450 483236847 481962471 480638084 478848114 476966248 475520172 473770638 471635818 468957138
2904.7 468957138 466036530 464195709 462185516 459234467 456117592 453359146 450357513 446132317
2912.4 446132317 441487045 436827927 431933975 426753159 421482811 416004028 410457001 406063004
2920.1 406063004 402339020 398861275 395917091 393759155 393029327 393000298 392717819 392893066 394369736
2928.8C94369736J979904K569313K970581K888451L817253M463806M377632M255867
2936.5D21692543M327889L983573L942643M407501L984718M283219M626503L376274
2944.2D54624863K826728K985077K577629K231827J633835R55162M96102M94041Q39233
2952.9D69664497O48156N93605P27119J217003J552238J344834J661911K054672K477493
2961.6D81941528K522354K401658K505455K956543L423004K839737K717476L100509
2969.3E04408264L441963L046112K384148K726860K420426K020225J764793J677323
2977E23890114J908836J627655K088547K317734J312179J229668J557198R21669Q62579
2985.7E37716179R93309J006393J058236N99174O24313N95360O60744M64058m1809
$$ plain form
2928.8 394369736 396349640 398918953 401889534 404777985 408595238 413059044 417436676 421692543
2936.5 421692543 426020432 430004005 433946648 438354149 442338867 446622086 451248589 454624863
2944.2 454624863 457451591 460436668 463014297 465246124 466879959 467835121 468331223 468825264 469664497
2952.9 469664497 470312653 470906258 471633377 472850380 474402618 475747452 477409363 479464035 481941528
2961.6 481941528 484463882 486865540 489370995 492327538 495750542 498590279 501307755 504408264
2969.3 504408264 507850227 510896339 513280487 516007347 518427773 520447998 522212791 523890114
2977 523890114 525798950 527426605 529515152 531832886 533145065 534374733 535931931 536853600 537716179
2985.7 537716179 538709488 539715881 540774117 541373291 541997604 542592964 543253708 543717766 543675957
2994.4E43675957R3918l6622k84461o44379n91927n81207j103745r45472o34995p76252
3004E38170815p38373m42238n68886k30255q7433l77388n684J97525M49257K77329
3013.7E36644669Q09288J370010O93741Q57200O59867O86455J076393M83856J75857
3022.4E43457336L9216k92016j36604k5139o15501K5177O12030p3700N9738O87m28620
3033E42622604o06041p39402n29786q24356j020927j22871j00937n83725k02179k50206
3042.6E37642174n1270k53486j109238j064758k73972j45721j305390r06067l92418
3051.3E32139854r66110m63142l2654r8953m22745o71921r67712j030312p01637o72989
3060.9E26111679p74574q28209l62320l60527j23749K12021o63261j138611q12073
$$ plain form
2994.4 543675957 543769875 543733253 543448792 542804413 542212486 541631279 540527534 539582062 538947067 538170815
3004 538170815 537432442 536990204 536421318 536191063 536103630 535726242 535720558 535918083 536367340 536644669
3013.7 536644669 537453957 538823967 539517708 540374908 541034775 541721230 542797623 543281479 543457336
3022.4 543457336 543496552 543204536 543067932 543042793 542427292 542452469 543064499 542990799 543050537 543051224 542622604
3033 542622604 542016563 541277161 540747375 539923019 538902092 538779221 538678284 538094559 537892380 537642174
3042.6 537642174 537590904 537337418 536228180 535163422 534889450 534743729 533438339 532532272 532139854
3051.3 532139854 531173744 530710602 530677948 530578995 530156250 529484329 528516617 527486305 526784668 526111679
3060.9 526111679 525337105 524508896 524146576 523786049 523662300 523874321 523211060 522072449 521260376
3069.6E21260376l58238p29409q84513o19164o27136n59654m22364O6185l53584n49393
3079.2E16223106n09758p49359o92901j067582o53953m95148n22575n07584n96542
3087.9E10427704j48277m07296n21583n83534o97403r25217q79898n74875r48105m24576
3097.6E04316940l94134p27997m42047j67275O5422p55004j200028p13692m02069r03244
3107.2D98676872j262893p49054m48151q3771k22740o62842n46798l02391n92919j135940
3116.9D92669373r02291q09631j030274r52453o57196l78990n51644q70170n78156
3125.5D85938568j12419m88014o69861p74422j162529r28535p55654o22558k16408
3134.2D80208168j53999m13704o39458q55293j054230q72421o98052j113929j059761
$$ plain form
3069.6 521260376 520902138 520172729 519288216 518669052 518041916 517482262 517059898 517126083 516772499 516223106
3079.2 516223106 515713348 514963989 514271088 513203506 512549553 512054405 511531830 511024246 510427704
3087.9 510427704 510279427 509872131 509350548 508767014 508069611 507144394 506264496 505689621 504741516 504316940
3097.6 504316940 503922806 503194809 502752762 502585487 502650909 501895905 500695877 499982185 499580116 498676872
3107.2 498676872 497413979 496664925 496216774 496133003 495910263 495247421 494700623 494398232 493805313 492669373
3116.9 492669373 491767082 490957451 489927177 488974724 488317528 487938538 487386894 486516724 485938568
3125.5 485938568 485826149 485338135 484668274 483893852 482731323 481802788 481047134 480424576 480208168
3134.2 480208168 480054169 479640465 479001007 478145714 477091484 476219063 475521011 474407082 473347321
3142.9D73347321n50194p03202m01535k06184q25844j004410o85844n07545p56150
3151.6D67706413o37016p59850j060447q70972q28896p18154j037331q16383K82363
3160.3D61259727L54653o80161j259536j049920j010093r50623r29069p62863n70946
3168.9D54401169l23372k08588o39152n38483n59158p90100r53522o38542n24750j099281
3178.6D48126221p56645q23479p21359p52106r15756k58255l67814m84466r93118p41501
3188.2D41311722m92058j350555q56858l55186m64096p95670p75146o39534l45421
3196.9D35237198r3460q91228n95627n57556r28306m25568n32570q81271r16329p12089
3206.5D28703194m39949j67961o75812q77152k97012k91596n54924j042594j076355
$$ plain form
3142.9 473347321 472797127 472093925 471692390 471486206 470660362 469655952 468970108 468462563 467706413
3151.6 467706413 467069397 466309547 465249100 464378128 463549232 462831078 461793747 460977364 461259727
3160.3 461259727 461614380 460934219 459674683 458624763 457614670 456664047 455734978 454972115 454401169
3168.9 454401169 454077797 453869209 453230057 452691574 452132416 451342316 450388794 449750252 449225502 448126221
3178.6 448126221 447369576 446546097 445824738 445072632 444156876 443898621 443530807 443046341 442053223 441311722
3188.2 441311722 440819664 439469109 438612251 438257065 437792969 436997299 436222153 435582619 435237198
3196.9 435237198 435143738 434252510 433656883 433099327 432171021 431745453 431212883 430331612 429415283 428703194
3206.5 428703194 428263245 428095284 427419472 426542320 426245308 425953712 425398788 424356194 423279839
3215.2D23279839j053277n68161J60409j61820l65181n17845p56645p92885n18379
3223.9D18706055m67263o44302m39873n91011j047630q06885P6904l3111m84428l27988
3233.5D13940468l30963r80721j026649k82555p76825o64940p76062q52623k2964p63893
3243.2D07462273n31655k97928l15818M3869q51097q14019l92685m80613o76842l70102
3252.8D02775383k69508q10509r31206r05075m58641k47002M883k64892p51954p25212
3262.5C97416267p51113j10283j11924m06150n83420n86701n74913m76112M3449m55703
3272.1C93403397l43514m65011p19452m84620q06274n90782p24030l09105k70118j58043
3281.8C88532448K80266o08521m63104k37122k74696l93753p26586m17633k56385m94957
$$ plain form
3215.2 423279839 422226562 421658401 421818810 421656990 421291809 420773964 420017319 419224434 418706055
3223.9 418706055 418238792 417594490 417154617 416563606 415515976 414709091 414785995 414752884 414268456 413940468
3233.5 413940468 413609505 412628784 411602135 411319580 410542755 409877815 409101753 408249130 408226166 407462273
3243.2 407462273 406930618 406632690 406316872 406360741 405509644 404695625 404302940 403822327 403145485 402775383
3252.8 402775383 402505875 401695366 400764160 399859085 399400444 399153442 399158325 398893433 398141479 397416267
3262.5 397416267 396665154 396554871 396442947 396036797 395453377 394866676 394291763 393815651 393859100 393403397
3272.1 393403397 393059883 392594872 391875420 391390800 390584526 389993744 389269714 388960609 388690491 388532448
3281.8 388532448 388812714 388204193 387741089 387503967 387229271 386835518 386108932 385691299 385434914 384939957
3291.4C84939957o83327m692j29318n28374l74985l03955j30577o54831p08847n50194
3301C80870857k55623j50871m74625p3204K5101q621o40144j078415n12467m43649
3310.7C77258339k91748j6136m45977q35876p5417J26763j71395j97715p48291n44167
3320.3C74058380n75333r16099m95834m12713n62210o43272m20876q506O4926m58527
3330C69629936j128959q92106l5018K48718k47421n61676r01070j145096j70402K63290
3339.6C65060196j19591j55983o55327o87027n41153p16934p00874q25119m32205n49775
3349.3C59676208n05065j66016m81949k54631l24707n46188r29718r00193m08668m78363
3358.9C54680710l45726m76418k37045l90663p87430p37190o81725j96266n87349n30090
$$ plain form
3291.4 384939957 384256630 384251938 384122620 383594246 383219261 382915306 382784729 382129898 381421051 380870857
3301 380870857 380615234 380464363 379989738 379916534 379941635 379933014 379292870 378214455 377701988 377258339
3310.7 377258339 376966591 376950455 376504478 375668602 375593185 375719948 375548553 375350838 374602547 374058380
3320.3 374058380 373483047 372566948 372071114 371658401 371096191 370452919 370032043 370023537 370088463 369629936
3330 369629936 368500977 367608871 367573853 367822571 367575150 367013474 366112404 364967308 364796906 365060196
3339.6 365060196 364940605 364784622 364129295 363442268 362901115 362184181 361483307 360658188 360225983 359676208
3349.3 359676208 359171143 359005127 358523178 358268547 357943840 357397652 356467934 355567741 355159073 354680710
3358.9 354680710 354334984 353858566 353621521 353230858 352443428 351706238 351024513 350828247 350240898 349710808
3368.6C49710808n74951r39598n91622p61680l40767o4659j95694j80550l36456o40107
3378.2C45084724n39016o333n78575p60727n50499o90880m10079j69335l08952l82195
3387.8C40688133J39885m09050q39309M8332K68058l18756l07312J31379m41475r12285
3397.5C38047600q88062l10974J13259m43039J2741M41093j4992n62935p72666n88990
3407.1C35033035k7656L55568j34697k54441l18145k17095m4555j43166l32336j48545
3416.8C33767967L53356l65715j45913r5253n20935K73705P6675j19781k83508K10762
3426.4C33151360M11987m35524l4371M93622K37313m15345K6398Q08258N66673o50940
3436.1C34159431j125297M74930R66224J93520J49345R43451N66902m88586n26123
$$ plain form
3368.6 349710808 349135857 348196259 347604637 346842957 346502190 346437531 346241837 346061287 345724831 345084724
3378.2 345084724 344545708 344539375 343960800 343200073 342649574 341958694 341548615 341379280 341070328 340688133
3387.8 340688133 340828018 340418968 339579659 339627991 339896049 339577293 339269981 339401360 338959885 338047600
3397.5 338047600 337159538 336848564 336961823 336518784 336531525 336972618 336957626 336394691 335622025 335033035
3407.1 335033035 335005379 335360947 335226250 334971809 334653664 334436569 334392014 334248848 333916512 333767967
3416.8 333767967 334121323 333755608 333609695 333514442 332993507 333267212 333343887 333224106 332940598 333151360
3426.4 333151360 333563347 333127823 333093452 333587074 333824387 333409042 333435440 334243698 334810371 334159431
3436.1 334159431 333034134 333509064 334475288 334668808 334818153 335761604 336328506 335839920 335313797
3444.7C35313797R8305J175308l07770n16243P79076O16379Q94699L23753J24703J97868
3454.4C38699875M40063P80602K84729L46832J60256M49600N67665M18472L48664J91230
3464C42687988Q26035N93338J50719L70063P34330N15060K67067M47502J15509N23071
3473.7C47230682J127892R34067K49519M4251O38656P83730M45594N85022N34173m31023
3483.3C52142563M67834J554108Q76732Q01201M64020l73383K27432Q51364N70107
3492C57581978R85756Q80165K07100P58819O25153K36397P11136Q01811N80826J238899
3501.6C64608040J243439j88904p5379R85566R37271K97737J135292O99577p16209
3510.3C68926430Q57086J595879J035995K69012N28908Q40187O38161J143456J106719
$$ plain form
3444.7 335313797 335412102 336587410 336279640 335763397 336542473 337158852 338053551 338377304 338502007 338699875
3454.4 338699875 339139938 339920540 340205269 340552101 340712357 341161957 341729622 342148094 342496758 342687988
3464 342687988 343514023 344107361 344258080 344628143 345362473 345877533 346144600 346592102 346707611 347230682
3473.7 347230682 348358574 349292641 349542160 349586411 350225067 351008797 351454391 352039413 352573586 352142563
3483.3 352142563 352610397 354164505 355041237 355842438 356306458 355933075 356160507 357011871 357581978
3492 357581978 358567734 359447899 359654999 360413818 361038971 361275368 361986504 362788315 363369141 364608040
3501.6 364608040 365851479 365662575 365587196 366572762 367510033 367807770 368943062 369642639 368926430
3510.3 368926430 369783516 371379395 372415390 372684402 373213310 374053497 374691658 375835114 376941833
3519C76941833R76677J40839Q74100J394844l43132M23622J284904J259652Q74443
3527.7C83827782O85157J20659M88968J169129N19065J134263R80033J396828Q07724
3536.4C91129608j80816J356468P53669N24559N95131J062928J426391J495819J701622
3545C99865379J46256O82602L92837O31333N72204Q88939J920471K9068R95140R04618
3554.7D07028847J478233J862526N16891J922875J433716J045151K45285Q81462J218643
3563.4D17633629K49405L238182J379432J33095M09813n33447K724953J510772P09610
3572D27455444J384468J868897J308288J150971K094154Q72879J717911J178665N77355
3580.7D39609032K253074K123223J005706K65770L456459K223626j605568J963539
$$ plain form
3519 376941833 377918510 378059349 378933449 380328293 379985161 380408783 381693687 382953339 383827782
3527.7 383827782 384512939 384633598 385122566 386291695 386810760 387945023 388925056 390321884 391129608
3536.4 391129608 390948792 392305260 393058929 393583488 394178619 395241547 396667938 398163757 399865379
3545 399865379 400011635 400694237 401087074 401718407 402290611 403179550 405100021 405129089 406124229 407028847
3554.7 407028847 408507080 410369606 410886497 412809372 414243088 415288239 415533524 416414986 417633629
3563.4 417633629 417883034 421121216 422500648 422633743 423043556 422510109 425235062 426745834 427455444
3572 427455444 428839912 430708809 432017097 433168068 435262222 436135101 437853012 439031677 439609032
3580.7 439609032 441862106 443985329 444991035 445256805 448713264 450936890 449331322 451294861
3588.4D51294861K0256J417541K165261K116241J641541J098480L542747j96228Q41523
3597.1D63942223K930374N76133K018090O42776P96318J828041R58748K103424L232270
3605.8D79028397K491226q77152K858467R13392j784058N513954K694397j883659K437019
3614.5D91391983q95004K791366N079537N10406J470757p90062j079903K503243K085838
3623.1E03068161J814461K097358J307946J113968N020294M076767p797165J335564
3630.9E12037354L381843M099693J793366j855889J157723K215881J573410L2196J058808
3639.5E25494385K294769K400284J629524r0141J141968K269401L998909n63354k347641
3648.2E36228104N542259M49600k184524j701737K648125L205604L165055M820060
$$ plain form
3588.4 451294861 451315117 452732658 454897919 457014160 458655701 459754181 463296928 463100700 463942223
3597.1 463942223 466872597 467448730 469466820 470109596 470905914 472733955 473692703 475796127 479028397
3605.8 479028397 481519623 480642471 483500938 484414330 482630272 488144226 490838623 488954964 491391983
3614.5 491391983 490496979 493288345 498367882 498878288 500349045 499558983 498479080 500982323 503068161
3623.1 503068161 504882622 506979980 508287926 509401894 514422188 518498955 510701790 512037354
3630.9 512037354 515419197 519518890 521312256 519456367 520614090 522829971 524403381 524435577 525494385
3639.5 525494385 527789154 530189438 531818962 531728821 532870789 535140190 539139099 538575745 536228104
3648.2 536228104 541770363 542219963 540035439 538333702 540981827 544187431 547352486 552172546
3655.9E52172546n392761L815L587761M70161R05724o9199J338387J738739J728859
3664.6E56484032R78241n00336L157730K453041j240539N77812l701897N4207N728950
3673.3E63991241Q254624K812919j4999275k15492O687851M696426j557273o84586
3681E68986435J809349J018600P6600J5754N64385K590751N488778l755188m174386
3689.7E72621078N670624k976379j570664L114968Q12111J500702K35862r3689J109009
3698.4E80423622J33400J520577L461685k192498l397178L059311J346206m33120m20418
3707E83501587J208229L519440n105439K304154M736709r170265K261124L209114K28882
3715.7E86693535O43463K182312J225166l245239o94809L745232j419030m023742L442573
$$ plain form
3655.9 552172546 546779785 546783600 550371361 550841522 551747246 551678047 553016434 554755173 556484032
3664.6 556484032 557462273 556961937 560119667 562572708 561332169 561909981 558208084 558262291 563991241
3673.3 563991241 572245865 575058784 560059509 559844017 566531868 571228294 569671021 568986435
3681 568986435 570795784 571814384 571890984 571906738 572471123 575061874 580550652 576795464 572621078
3689.7 572621078 578291702 575315323 573744659 576859627 577671738 579172440 579408302 579314613 580423622
3698.4 580423622 580557022 582077599 585539284 583346786 579949608 583008919 584355125 583922005 583501587
3707 583501587 584709816 588229256 583123817 585427971 590164680 580994415 583255539 586464653 586693535
3715.7 586693535 587336998 589519310 590744476 587499237 586804428 590549660 589130630 585106888 588549461
3724.4E88549461J437912k85263j490516j18485K854195J37329M144058n31883p711334
3733.1E86985474N658760L392296n011445j182327R27124K5292J835479L248635l056565
3741.8E92822723L93944Q725166m890174j4241410P242089M586677M779473n8518q066635
3750.4E91293335Q237915j742439p889519K719612K594032K823868l159027J034126
3758.2E95911903M969063l936043k351036K026406N91621R4414L184624r38607m628639
3766.8E94923706J623421M233513J532211o644249j79291K735291J008758O88248k62413
3775.5E99659195N72739j15433J679687J145554o786079J3198K509690J650276K179832
3784.2F02508659k188797j093826J331749N04303M29420m27322n14107n34439L71514
$$ plain form
3724.4 588549461 589987373 589702110 588211594 588093109 590947304 591084633 595228691 594696808 586985474
3733.1 586985474 592644234 596036530 591025085 589842758 590769882 590795174 592630653 595879288 592822723
3741.8 592822723 593216667 601941833 597051659 582810249 590052338 594639015 599418488 599359970 591293335
3750.4 591293335 599531250 597788811 589899292 592618904 595212936 598036804 594877777 595911903
3758.2 595911903 600880966 596944923 594593887 596620293 597211914 597306328 600490952 599552345 594923706
3766.8 594923706 596547127 600780640 602312851 595668602 595489311 598224602 599233360 599921608 599659195
3775.5 599659195 600231934 600116501 601796188 602941742 596155663 596168861 598678551 600328827 602508659
3784.2 602508659 600319862 599226036 600557785 601062088 601491508 601064186 600550079 600015640 600387154
3792.9F00387154q8768O62841L177758k209854l421021J520157L118782M831314m103775
3801.5F03874588q732758K122612J841813L024292N577621m965286n143547L044128
3809.3F00643463K016678N47523l78341p87506M25720M327812J505280j0949936J857109
3817.9E99207802L991775L252144L554344r854087j254197K938576J289063J851043
3825.7F04976463J28670l779030m46319J620216K911873K486725o682320K87438O154594
3834.3F07658310k866745k528038N723991m056167n339585O080742k211380j220932
3842.1F01240196M889527j163636l489303J010589Q40912l21731J464347q16993N92232
3850.7F04246140M920158k693482L802147q997497m546585O322288J70059j599731
$$ plain form
3792.9 600387154 600298386 600961227 604138985 601929131 598508110 600028267 603147049 607978363 603874588
3801.5 603874588 595141830 597264442 599106255 602130547 607708168 602742882 597599335 600643463
3809.3 600643463 602660141 603207664 602829323 602041817 602467537 606795349 608300629 597350693 599207802
3817.9 599207802 603199577 606451721 610006065 600151978 598897781 601836357 603125420 604976463
3825.7 604976463 605105133 601326103 600879784 602500000 605411873 607898598 601216278 601503716 607658310
3834.3 607658310 604791565 602263527 607987518 603931351 598591766 604672508 602461128 601240196
3842.1 601240196 606129723 604966087 601476784 602487373 603328285 603006554 604470901 603653908 604246140
3850.7 604246140 609166298 606472816 610274963 601277466 596730881 603053169 603223228 601623497
3858.4F01623497J218643K396698K657509m035606j978073M931144j379966n227662
3866.2F00206184J750222L821373O082344l592987p824974J621589L893585M047203
3873.9F10004539p809600j225624K845916o48727J523628M444122j250534p246666
3881.6F00637054L233681J383553O50711N137977r791870j146774K890930M77982L795280
3890.3F07268524K86179o367302M47464L299675j000481J34087J101989J811104J184235
3898.9F08165474q940659L342057L074913m271012M266892j600342k067070P58018
3906.7F02728271K14234J052933J33361N09949m56734j35612J25351j07803J227912
3915.3F05291862J594124j917038l375778K950707J137046l355369P42836J263351
$$ plain form
3858.4 601623497 602842140 605238838 607896347 603860741 601882668 606813812 605433846 600206184
3866.2 600206184 601956406 605777779 611860123 608267136 600442162 602063751 605957336 610004539
3873.9 610004539 602194939 600969315 603815231 603166504 604690132 609134254 607883720 600637054
3881.6 600637054 603870735 605254288 605904999 611042976 601251106 600104332 602995262 603473244 607268524
3890.3 607268524 607554703 601187401 601634865 604934540 603934059 604068146 605170135 606981239 608165474
3898.9 608165474 599224815 602566872 605641785 601370773 605637665 604037323 601970253 602728271
3906.7 602728271 602942505 603995438 604128799 604638748 604182014 604046402 604171753 604063950 605291862
3915.3 605291862 606885986 604968948 601593170 604543877 605680923 602325554 603068390 604331741
3923.1F04331741J690293p18499k879600L30162P43484J470147j61438r03893J474915
3931.7F05377312j021538j580505L94783J0337J83144M79050k60887J44310L12042
3940.4F04038048P46994R49821l227920j288109J167602Q57926J398620j797027J39618
3949.1F02985573J041221j700592R06639L88527n90324l51715K33726P59583n55000
3957.8F03117638P4310M1275L50838M26902p13539j09558J5679L7918j27945P5645
3967.4F03189163N03655j82839m82902J9111L51830K72102K69547M6882m57191o08254
3977.1F02921104K82822R0180r98726j27564Q18596J7166j052856R918O53267P3967
3986.7F02687874J27449k54097L75671L39623q14476o83213L45765P48710j92260o0845
$$ plain form
3923.1 604331741 606022034 605303535 602423935 602754097 603497581 604967728 604806290 603902397 605377312
3931.7 605377312 604355774 602775269 603170052 603180389 603363533 603842583 603581696 603726006 604038048
3940.4 604038048 604785042 605734863 602506943 601218834 602386436 603244362 604642982 602845955 602985573
3949.1 602985573 604026794 602326202 603232841 603621368 603031044 602679329 602913055 603672638 603117638
3957.8 603117638 603191948 603233223 603584061 604010963 603297424 603187866 603203545 603241463 603113518 603189163
3967.4 603189163 603692818 603509979 603027077 603046188 603398018 603670120 603939667 603986549 603529358 602921104
3977.1 602921104 603203926 603294106 602295380 602167816 602986412 603003578 601950722 601960640 602613907 602687874
3986.7 602687874 602815323 602561226 602936897 603276520 602462044 601778831 602124596 602873306 602681046 602620201
3996.3F02620201l57971l95813P85141M28581
4000.2F03080139
$$ plain form
3996.3 602620201 602262230 601866417 602651558 603080139
4000.2 603080139
##END=$$ End of the data block
