##TITLE=$$ Begin of the data block
##JCAMP-DX=5.00 $$ ACD/SpecManager v 10.08
##SPECTROMETER/DATA SYSTEM=Varian
##DATE=04 Dec 2012 13:17:32
##DATA TYPE=INFRARED SPECTRUM
##DATA CLASS=XYDATA
##ORIGIN=
##OWNER=
##NPOINTS=3735
##FIRSTX=399.26403809
##LASTX=4000.35498047
##MAXX=4000.35498047
##MINX=399.26403809
##MAXY=69.67275238
##MINY=33.78838348
##XFACTOR=1.0000000000
##YFACTOR=0.000000100000000
##FIRSTY=57.56749344
##DELTAX=0.96440572
##XUNITS=1/CM
##YUNITS=TRANSMITTANCE
##XYDATA=(X++(Y..Y))
399.3E75674934l797416l443108j925964m467697l01476M299545q2092j1425552o015549
$$ 575674934 571877518 568434410 566508446 562040749 561739273 566038818 565956726 554531174 548515625
407.9E48515625K760963J0477219M737473k128907J200943O30608r38377m778519R23042
$$ 548515625 551276588 561753807 566491280 564362373 565563316 566193924 565255547 560477028 561400070
416.6E61400070l635025o472092J5333443k420692j601792o355133q11958N299759
$$ 561400070 557765045 551292953 566626396 564205704 562603912 556248779 555436821 560736580
424.3E60736580J811256j520195o541481j682853k109261L650665M991036l118706
$$ 560736580 562547836 561027641 554486160 552803307 550694046 554344711 559335747 556217041
432.1E56217041M43230J990547l097038m390145M735947R40094k717743J116943J698380
$$ 556217041 556660271 558650818 555553780 551163635 555899582 556839676 554121933 555238876 556937256
440.7E56937256M654388N73731m389305m78173O464844L506851k772941k102166k703094
$$ 556937256 561591644 562165375 557776070 557297897 563762741 567269592 564496651 562394485 559691391
449.4E59691391j802101j600571L741379J409340j953774n02739j307525K495651K575340
$$ 559691391 557889290 556288719 560030098 561439438 559485664 558982925 557675400 560171051 562746391
458.1E62746391N642929k760887r557876l129197j990928O64253K07825J984749K570762
$$ 562746391 568389320 565628433 556070557 552941360 550950432 551614685 551822510 553807259 556378021
466.8E56378021J681328R61914L160019N047913o642189p915993M3640l608932m960480
$$ 556378021 558059349 559021263 562181282 567229195 560587006 552671013 552714653 549105721 544145241
475.5E44145241K00729N480652P89108k11754P33948p3776j479149k52190n13305o207581
$$ 544145241 544345970 549826622 550615730 550403976 551137924 551064148 549584999 549332809 548819504 542611923
485.1E42611923k799721K166253L035087j130752L25584K427902k178459l27415r67293
$$ 542611923 539812202 541978455 545013542 543882790 544208374 546636276 544457817 544130402 543163109
493.8E43163109k190743l24440K542572K166863l775063j603508K283364k246437l875390
$$ 543163109 540972366 540647926 543190498 545357361 541582298 539978790 542262154 540015717 536140327
502.5E36140327K014199J159210l48854k588043l093605J568603m26292k087288k813301
$$ 536140327 538154526 539313736 538964882 536376839 533283234 534851837 534425545 532338257 529524956
511.1E29524956k445717K40364J819000J291847j351280j089020m72335j762696n365257
$$ 529524956 527079239 527319603 529138603 530430450 529079170 527990150 527517815 525755119 520389862
519.8E20389862l037491J180878j88294j974449k730064Q32367K580681K037162L88947
$$ 520389862 517352371 518533249 518344955 516370506 513640442 514472809 517053490 519090652 519479599
528.5E19479599j083641P48520j784363k077293o05622j216430J68571L975220M456825
$$ 519479599 518395958 519144478 517360115 515282822 514677200 513460770 513629341 517604561 522061386
537.2E22061386J860352Q99963q659K073974P07970j243629N25360m55704n26848j260719
$$ 522061386 523921738 524821701 524813042 526887016 527594986 526351357 526876717 526421013 525894165 524633446
546.8E24633446N69267K466011J899643J043129j720123l80020P13005k022934l902970
$$ 524633446 525202713 527668724 529568367 530611496 528891373 528511353 529224358 527201424 523298454
555.5E23298454j138496j24970k222099p62138m79050N73883J223221K25754j302567
$$ 523298454 522159958 522034988 519812889 519050751 518571701 519145584 520368805 520594559 519291992
564.2E19291992j262970j20239m673119n075988j745148m09470o50749j205940R99451
$$ 519291992 518029022 517908783 513235664 508159676 506414528 506005058 505354309 504148369 505147820
572.9E05147820J600265M91943j171035r47876P28836L86963M97093J515579n4283
$$ 505147820 506748085 507240028 506068993 505121117 505849953 506236916 506734009 508249588 508195305
581.5E08195305k97356K874336L374444K539939K385369K554168M36593p42798N31349
$$ 508195305 507897949 510772285 514146729 516686668 519072037 521626205 522062798 521320000 521851349
590.2E21851349j069183r65386O50711P40967N06935M34113J621704K275543J191292
$$ 521851349 520782166 519816780 520467491 521208458 521715393 522149506 523771210 526046753 527238045
598.9E27238045j775780j986160j590004j230507N92842n92232j423340Q7548K954406
$$ 527238045 525462265 523476105 521886101 520655594 521248436 520656204 519232864 519320412 522274818
607.6E22274818K375870J379051R76906j816749m81453j27526o11534N96009K73551
$$ 522274818 524650688 526029739 527006645 525189896 524708443 524580917 523969383 524565392 524838943
616.3E24838943J65329M15345K293281L416329L024902J983986J441879J091385N4779
$$ 524838943 525004272 525419617 527712898 531129227 534154129 536138115 537579994 538671379 538726158
624.9E38726158q30307p24449O87981J465072K182846K090302J704712K111130K113075
$$ 538726158 537895851 537171402 537859383 539324455 541507301 543597603 545302315 547413445 549526520
633.6E49526520J195946j610680j402741m09584m51088M33426o0005J798020K224197
$$ 549526520 550722466 549111786 547709045 547299461 546848373 547281799 547221794 549019814 551244011
642.3E51244011N15442J168632J095124K87284O18134R3155k017975j855431J70060
$$ 551244011 551759453 552928085 554023209 554310493 554928627 555021782 553003807 551148376 551318436
651E51318436R81788Q80738J186905Q58917Q42094K730484J281204o78749j382332
$$ 551318436 552300224 553180962 554367867 555226784 556068878 558799362 560080566 559401817 558019485
659.7E58019485j716690j88636q27904k70615Q33664L50075R06410k555084q044853
$$ 558019485 556302795 556114159 555286255 555015640 555849304 556199379 557105789 554550705 546505852
668.3E46505852Q170166M532432K15950l65104k76299j114845j199722r32961J067200
$$ 546505852 554676018 559208450 559424400 559059296 558782997 557668152 556468430 555535469 556602669
677E56602669L045768K758217J538926J329154J109505L14636r23156k549820j366806
$$ 556602669 559648437 562406654 563945580 565274734 566384239 566698875 565775719 563225899 561859093
685.7E61859093l25890q0032J051063N34859R46999K382202K082405N08957k96364
$$ 561859093 561533203 561453171 562504234 563039093 563986092 566368294 568450699 568959656 568663292
694.4E68663292o72150k032318k459946k253265k012825m58259O99996K91100J309471
$$ 568663292 567991142 565958824 563498878 561245613 559232788 558774529 559474525 559765625 561075096
703.1E61075096J268654q84476j074066p44591n63049p37991j125069p79495j65367
$$ 561075096 562343750 561459274 560385208 559640617 559077568 558339577 557214508 556435013 556269646
711.7E56269646O86683J441460K357140K651558K256965O67076l15628q14361j693077
$$ 556269646 556956329 558397789 560754929 563406487 565663452 566330528 566014900 565200539 563507462
720.4E63507462n799J82724J63498K293015L950996M745750L053208J891556J584282
$$ 563507462 563501663 563684387 563847885 566140900 570091896 574837646 577890854 579782410 581366692
729.1E81366692J3008l44391L54538P56721Q17261Q26149P81937K302055L366661K244377
$$ 581366692 581379700 581035309 581389847 582146568 582963829 583789978 584571915 586873970 590240631 592485008
738.7E92485008J770325Q66547l98331j141968r57565j496506k700882j40381J190949
$$ 592485008 594255333 595121880 594723549 593581581 592624016 591127510 588426628 588286247 589477196
747.4E89477196J512031K657280M58107p05108m81606j449737j763726j274681j145553
$$ 589477196 590989227 593646507 594104614 593399506 592917900 591468163 589704437 588429756 587284203
756.1E87284203k366524k959099r31206P19643P52602J559600J757050j39694q41599
$$ 587284203 584917679 581958580 581027374 581747017 582499619 584059219 585816269 585676575 584834976
764.8E84834976L31040N2719j017266n54046P63702J547775J682206K712211L584214
$$ 584834976 585166016 585218735 584201469 583647423 584411125 585958900 587641106 590353317 593937531
773.5E93937531L121604K175370J047935J111756J442718L30772j09291M13819Q05015
$$ 593937531 597059135 599234505 600282440 601394196 602836914 603167686 603058395 603472214 604277229
782.1F04277229J826287K619209K017555K107163K442245J528092K83012m67873k60849
$$ 604277229 606103516 608722725 610740280 612847443 615289688 616817780 617100792 616632919 616372070
790.8F16372070p00912m23775N40009R00840J196099J427574K789154L036690K142143
$$ 616372070 615671158 615247383 615787392 616688232 617884331 619311905 622101059 625137749 627279892
799.5F27279892R58252M8141n1345o04020l8757m77257P4539J169129J352692K685165
$$ 627279892 628238144 628286285 628234940 627630920 627592163 627114906 627189445 628358574 629711266 632396431
809.1F32396431K313690J596031K36740k00729l71475j385346n68695p63206j62010
$$ 632396431 634710121 636306152 636542892 636342163 635970688 634585342 634016647 633253441 633091431
817.8F33091431J53732M8027J316452K060547J188202j061020j202889j273155j634521
$$ 633091431 633245163 633293190 634609642 636670189 637858391 636797371 635594482 634321327 632686806
826.5F32686806k257271l176613k636452j628074N77850J387367M88358j59645o85730
$$ 632686806 630429535 627252922 624616470 622988396 623566246 624953613 625441971 625282326 624596596
835.2F24596596m58794q48923k535514l590394l150024k579536j009941p3128J19362
$$ 624596596 624137802 623288879 620753365 617162971 614012947 611433411 610423470 610350342 610469704
843.9F10469704J359634J018334M71839K22359j834640l040047k492523j477433m31289
$$ 610469704 611829338 612847672 613319511 613541870 611707230 608667183 606174660 604697227 604265938
852.5F04265938m48303Q812O32782L98750R33990J305199J260872p65152k844162j273613
$$ 604265938 603817635 603826447 604459229 604857979 605791969 607097168 608358040 607592888 604748726 603475113
862.2F03475113K88811P61146R31091K374917L735961L168450L909149L848915K096596
$$ 603475113 603763924 604525070 605456161 607831078 611567039 614735489 618644638 622493553 624590149
870.9F24590149Q27827M78897L86391l97186k72064O99577J652794J368027J719932
$$ 624590149 625417976 625896873 626283264 625886078 625614014 626313591 627966385 629334412 631054344
879.5F31054344J993447P60688k83394j594047j788254j782112j604309k906609l615837
$$ 631054344 633047791 633808479 633525085 631931038 630142784 628360672 626756363 623849754 620233917
888.2F20233917j110153J67313L60107q03146j143189j90925j634331l196983k479287
$$ 620233917 619123764 619291077 619651184 618848038 617704849 617513924 615879593 612682610 610203323
896.9F10203323j449165k029953j664009p26318r08814q75931r6855J51215o06079
$$ 610203323 608754158 606724205 605060196 604333878 603425064 602549133 602452278 602603493 601997414
905.6F01997414j552658k574234k550011k576828k971687k948685k445183k041206
$$ 601997414 600444756 597870522 595320511 592743683 589771996 586823311 584378128 582336922
913.3E82336922j975479p05796j056022k185288k125778k634850k626609k279206k033348
$$ 582336922 580361443 579655647 578599625 576414337 574288559 571653709 569027100 566747894 564714546
922E64714546j531410r77516q26340q12874M8104J122169Q49686K17247L43933L33328
$$ 564714546 563183136 562205620 561379280 560566406 560614510 561736679 562586365 562803612 563147545 563480873
931.6E63480873l30543r35326o58722m55933m7760J072998J493836J605835J683464
$$ 563480873 563150330 562215004 561556282 561100349 561052589 562125587 563619423 565225258 566908722
940.3E66908722J563072J121903O15005L77426l26004n08194o53190j228905p23610
$$ 566908722 568471794 569593697 570208702 570586128 570260124 569751930 569098740 567869835 567146225
949E67146225p36809j594276j410370q46939j472397k676468l403931l911438m872627
$$ 567146225 566409416 564815140 563404770 562557831 561085434 558408966 555005035 551093597 546220970
957.7E46220970m951629l953553l390045k781639l065605l203468l217392l727265
$$ 546220970 541269341 537315788 533925743 531144104 528078499 524875031 521657639 517930374
965.4E17930374m395256n288048n557327o198845o436119o306190n656701n663337
$$ 517930374 513535118 508247070 502689743 496490898 490054779 483748589 478091888 472428551
973.1D72428551n488701m547806n434685n702667n950470o150360p117310o692962
$$ 472428551 466939850 462392044 456957359 451254692 445304222 439153862 432036552 425343590
980.8D25343590n201111n612946n091285m705201k685127k566986l279877k943000
$$ 425343590 420142479 414529533 409438248 404733047 402047920 399480934 396201057 393258057
988.5C93258057k205620j255188k734413j978302k246781r57565M09813n31426J07956
$$ 393258057 391052437 389797249 387062836 385084534 382837753 381880188 382290001 381758575 381866531
997.2C81866531j13830N19333j38130R08546L3531j068573J132813k75154j332589
$$ 381866531 381752701 382272034 382133904 383042450 383075981 382007408 383140221 382865067 381532478
1005.9C81532478j634140k4719J8120o81076k25945j040497k8495n83687n53589j402588
$$ 381532478 379898338 379873619 379891739 379210663 378984718 377944221 377915726 377332039 376778450 375375862
1015.5C75375862j564484k87551m67568n79185j009713M62723L81813J048661M10347
$$ 375375862 373811378 373523827 373056259 372477074 371467361 371930084 372311897 373360558 373770905
1024.2C73770905Q697J264267K06947J027108K32353M83856k14081k39525J675110
$$ 373770905 373779602 375043869 375250816 376277924 376510277 376994133 376780052 376540527 378215637
1032.9C78215637O36368J016388J056595J416817n8404o98547o35109k33879J115112
$$ 378215637 378852005 379868393 380924988 382341805 382283401 381584854 380949745 380715866 381830978
1041.6C81830978o07795K64091m27856L28445O64864m65889J291580Q19969J511650
$$ 381830978 381223183 381487274 381059418 381387863 382052727 381586838 382878418 383698387 385210037
1050.2C85210037J56059P55616K107734J376114J095925J181411L020783J316833J963005
$$ 385210037 385366096 386121712 388229446 389605560 390701485 391882896 394903679 396220512 398183517
1058.9C98183517K729950K672539L314820K673225L348923K963714K865601P34825
$$ 398183517 400913467 403586006 406900826 409574051 412922974 415886688 418752289 419487114
1066.6D19487114J160660J752052j5717q84094k709427k090225l760605l418541k321624
$$ 419487114 420647774 422399826 422384109 421500015 418790588 416700363 412939758 409521217 407199593
1075.3D07199593l027039j566887j256637q59223k501297k72484J371651J130981J639748
$$ 407199593 404172554 402605667 401349030 400489807 397988510 397716026 399087677 400218658 401858406
1084D01858406P16248K374916J693382J411400J093445P62329J121483K157096K958374
$$ 401858406 402574654 404949570 406642952 408054352 409147797 409910126 411031609 413188705 416147079
1092.7D16147079J069413K183075J994514J494637P04765R37805J519013q37975J82686
$$ 416147079 417216492 419399567 421394081 422888718 423593483 424531288 426050301 425212326 425395012
1101.4D25395012j17073M8065N99899O90956J228562J093445K049026N87998J325378
$$ 425395012 425277939 425326004 425925903 426616859 427845421 428938866 430987892 431575890 432901268
1110D32901268J315613L06663K07939J51139J555099O57807R77440J030616J692925
$$ 432901268 434216881 434523544 434731483 434882622 436437721 437095528 438072968 439103584 440796509
1118.7D40796509J940307Q95157J344605R65652J099015j80855j7128M25148N27420
$$ 440796509 442736816 443631973 444976578 445942230 447041245 446860390 446843262 447268410 447795830
1127.4D47795830J592941J535988K261352J905709J918373M10309m84619j57662j079063
$$ 447795830 449388771 450924759 453186111 455091820 457010193 457420502 456935883 456778221 455699158
1136.1D55699158j348839k539215j165581k47765r10682j544800k047844j616135j883087
$$ 455699158 454350319 451811104 450645523 450397758 449487076 447942276 445894432 444278297 442395210
1144.8D42395210j304207k577247k433853k425614k775154j359520j645012q45909
$$ 442395210 441091003 438513756 436079903 433654289 430879135 429519615 427874603 427028694
1152.5D27028694j115036l07007m67834m01650J69068j302109K8229M05807J160965
$$ 427028694 425913658 425606651 425138817 424737167 424906235 423604126 423632355 424038162 425199127
1161.1D25199127J001625J243058J792106J936150L671188L161774M271545L638802
$$ 425199127 426200752 427443810 429235916 431172066 434843254 438005028 442276573 445915375
1168.9D45915375K530975L037605L189774L821068L597755L973313L687439M743423
$$ 445915375 448446350 451483955 454673729 458494797 462092552 466065865 469753304 474496727
1176.6D74496727N255966M629250M078712L560181M112511L221321K896576K399559
$$ 474496727 479752693 484381943 488460655 492020836 496133347 499354668 502251244 504650803
1184.3E04650803J971817K369575K591210L308639K769737K390786K567138K534027
$$ 504650803 506622620 508992195 511583405 514892044 517661781 520052567 522619705 525153732
1192E25153732J536560M33960L63121j30729j90773J15661L77236M48227N76629J182747
$$ 525153732 526690292 527124252 527487373 527356644 527165871 527281532 527658768 528106995 528683624 529866371
1201.6E29866371J012192O26297P71408P83539L05176K38647O7635J9760M52575P76711
$$ 529866371 530878563 531504860 532276268 533059807 533364983 533603630 533671265 533691025 534143600 534920311
1211.3E34920311J239014J083183J705284J985474R78851N62286K20185J9951j88446
$$ 534920311 536159325 537242508 538947792 540933266 541912117 542474403 542694588 542714539 542526093
1220E42526093p06978q18024l47252O6986J32752j40457m48380J68076j18561j191826
$$ 542526093 541819115 541001091 540653839 540720825 540853577 540713120 540264740 540432816 540314255 539122429
1229.6E39122429j476517j340408j125527j470604j057167m75692j63613J27640q7166
$$ 539122429 537645912 536305504 535179977 533709373 532652206 532176514 532012901 532140541 532053375
1238.3E32053375K44141M11796K47460m19502n97077k28729k29454J60141Q8425M77790
$$ 532053375 532297516 532709312 532956772 532537270 531940193 531711464 531482010 531642151 531730576 532208366
1247.9E32208366J523056J882554J672363J275902P25822N19905L00636p7285q6365
$$ 532208366 533731422 535613976 537286339 538562241 539288063 539807968 540108604 540031319 539944954
1256.6E39944954j09940K74430O83098J083755J586418J335449R85718R17397Q91494
$$ 539944954 539835014 540109444 540792542 541876297 543462715 544798164 545783882 546701279 547592773
1265.3E47592773r3841p57065k15721M5776L11051P12356J034699J689605J864052
$$ 547592773 547498932 546741867 546526146 546571922 546882973 547595329 548630028 550319633 552183685
1274E52183685J009674N35546L67775M7264l13568n07584j99089j10512J33362L80516
$$ 552183685 553193359 553728905 554096680 554143944 553830376 553322792 553123703 553013191 553146553 553527069
1283.6E53527069R03092J512184J125183Q49190L41911l07655m22249m14048p90176
$$ 553527069 554430161 555942345 557067528 557916718 558258629 557950974 557528725 557114677 556324501
1292.3E56324501o79626p8469K1820L12920O48765R21822O87103j82380q57086j007042
$$ 556324501 555644875 555566406 555588226 555901146 556549911 557471733 558158836 557976456 557119370 556112328
1301.9E56112328p24793r06067p49969k98844J55487N27878K82784J95121j63688j51100
$$ 556112328 555387535 554481468 553731499 553432655 553588142 554116020 554398804 554593925 554430237 554279137
1311.6E54279137m37317r44824m72908q35610j193962r06563l72658k1553J02654N41611
$$ 554279137 553841820 552896996 552424088 551588478 550394516 549487953 549115295 549093742 549196396 549738007
1321.2E49738007J56707k31208m26407n53208n09491j087875j367569j239052j032715
$$ 549738007 549894714 549663506 549237099 548683891 548174400 547086525 545718956 544479904 543447189
1329.9E43447189j048126n54237M45900K36740m20113o02646j92871j56936o43006
$$ 543447189 542399063 541844826 542290726 542527466 542107353 541504707 541311836 541154900 540511894
1338.6E40511894j065063j051522j76124R7885K24457N39474P04041L01513J25199
$$ 540511894 539446831 538395309 538219185 538317070 538541527 539081001 539785042 540086555 540211754
1347.3E40211754K21443j41869o57882q50411m43077o04744n63583p6904k61536j19476
$$ 540211754 540433197 540291328 539633446 538783035 538339958 537735214 537171631 537094727 536833191 536713715
1356.9E36713715m2458K4452O5384l52478r58671r35441j385650j063042l30620p04155
$$ 536713715 536671257 536695709 536761093 536408615 535449944 534514503 533128853 532065811 531735191 531031036
1366.6E31031036k55165K30561L46870O04668m5586J9989n10635j038018p53898r24111
$$ 531031036 530775871 531006432 531353302 531957970 531912384 531932373 531421738 530383720 529629822 528705711
1376.2E28705711m78286l99552O2981L77197R23653J292267J329002R24187N90934
$$ 528705711 528227425 527827873 527890854 528268051 529191704 530483971 531812973 532737160 533328094
1384.9E33328094J093407R33457K67677J21651R62028Q42400P90062J126213O80313
$$ 533328094 534421501 535354958 535622635 535744286 536706314 537548714 538338776 539464989 540145302
1393.6E40145302M07371l29551J79023o82716p54852n45426j089592o5689k16942L58620
$$ 540145302 540552673 540223122 540402145 539719429 538964577 538419151 537329559 537263870 537046928 537405548
1403.2E37405548O98776O77986Q78068J22718n15060q77457p01332j166954j178741
$$ 537405548 538104324 538782310 539660378 539783096 539268036 538390579 537689247 536522293 535343552
1411.9E35343552j101914n39894J08376j25771L89786O92863J166458r63554l51906
$$ 535343552 534241638 533701744 533810120 533684349 534074135 534766998 535933456 534969902 534617996
1420.6E34617996R64051o4087J51977o34041L33634O02913J00364R13468P67250M88128
$$ 534617996 535582047 535517960 535669937 535035896 535369530 535972443 536072807 536986275 537753525 538241653
1430.2E38241653j92756n9509r09653j132317l94478o22749p43790R9678J279679N35507
$$ 538241653 538048897 537989388 537079735 535947418 535552940 534930191 534186401 534286079 535565758 536101265
1439.8E36101265N63278L20816l75519n7029q76580m08592n24788l21884j090965q72803
$$ 536101265 536664543 536985359 536609840 536552811 535676231 535267639 534742851 534420967 533330002 532457199
1449.5E32457199n8632m74663k40135j326103J97296n14030j906281j641235k636719
$$ 532457199 532398567 531923904 531683769 530357666 530554962 530040932 528134651 526493416 523856697
1458.2E23856697J492119k11105J417656N42030J114311J839676q56400J513749J246795
$$ 523856697 525348816 525137711 526555367 527097397 528211708 530051384 529194984 530708733 531955528
1466.8E31955528L192635L304176M504395M658165M001732P567215L820114M457092
$$ 531955528 535148163 538452339 542956734 547614899 551616631 559183846 563003960 567461052
1474.6E67461052K924919M221573L796539K720909L129311K033844J993179O96678
$$ 567461052 570385971 574607544 578404083 581124992 584254303 586288147 588281326 588978004
1482.3E88978004J407395J076240Q93860J640969P09648J926536J812783Q65249p65648
$$ 588978004 590385399 591461639 592355499 593996468 594706116 596632652 598445435 599310684 598545036
1491E98545036M85154P02857o34689n18837j66702j179276m70810l68270J97906J357155
$$ 598545036 599030190 599733047 599098358 598579521 598412819 597233543 596762733 596394463 596592369 597949524
1500.6E97949524R31969k61803k03934k96592k90108l433151n157509L45306M16451
$$ 597949524 598881493 598619690 598415756 598119164 597829056 594395905 589238396 589583702 590000153
1509.3E90000153l59307l40233p22045r44863M92401M32701n21659j470719l478927
$$ 590000153 589640846 589300613 588578568 587633705 588126106 588558807 588037148 586566429 583087502
1518E83087502K98423Q63152j359024j700363J204452K051964J735992K84424l66211
$$ 583087502 583385925 584249077 582890053 581189690 582394142 584446106 586182098 586466522 586100311
1526.6E86100311K52419q51898j272927n62057q98323o03218p51610j196938J393128
$$ 586100311 586352730 585500832 584227905 583665848 582767525 582164307 581412697 580215759 581608887
1535.3E81608887J229782P83424J735993n8861n515938J246491r14155j248817Q59375
$$ 581608887 582838669 583622093 585358086 585299225 579783287 581029778 580115623 578866806 579726181
1544E79726181K42424J52054J607590J915359J596146J516037j04752O32057R06029
$$ 579726181 579968605 580120659 581728249 583643608 585239754 586755791 586651039 587283096 588189125
1552.7E88189125M06265l1891l06129J781349J456642k073822K071495L021469L025628
$$ 588189125 588595390 588563499 588257370 590038719 591495361 589421539 591493034 594514503 597540131
1561.4E97540131J934394J524277Q16574o21528o63224L38326P59621L50799j80435
$$ 597540131 599474525 600998802 601815376 601193848 600530624 600868950 601628571 601979370 601798935
1570F01798935J587982K237549J177711Q89054J215706M10499l519287q31375K00500
$$ 601798935 603386917 605624466 606802177 607691231 608906937 609317436 605798149 604966774 605167274
1578.7F05167274o59103m7493K06070N76057K46468r3384L95012k54288m61044j586914
$$ 605167274 604508171 604460678 604666748 605242805 605489273 605395889 605790901 605536613 605075569 603488655
1588.4F03488655j635628j578827j644668j070900n48325l36380j154747l23791n08003
$$ 603488655 601853027 600274200 598629532 597558632 597010307 596673927 595519180 595195389 594687386
1597E94687386r85489j308899j834221k190132k506218j311341j536026j622619j731186
$$ 594687386 593701897 592392998 590558777 588368645 585862427 584551086 583015060 581392441 579661255
1605.7E79661255j457291j669388j424560j262818k684745j756592k643204k798157
$$ 579661255 578203964 576534576 575110016 573847198 571162453 569405861 566762657 563964500
1613.4E63964500k898216j768799j297683n973816l68729j209106j638985j756859
$$ 563964500 561066284 559297485 557999802 552025986 551657257 550448151 548809166 547052307
1621.1E47052307j066170k007217n650978k166481k122917j378899l424530k901726
$$ 547052307 545986137 543978920 538327942 536161461 534038544 532659645 529235115 526333389
1628.9E26333389j455650j525841j175155k120095o42700l08456k216645m651413o61201
$$ 526333389 524877739 523351898 522176743 520056648 519413948 519105492 516888847 512237434 511576233
1637.5E11576233j466980j271553L82309j555710K56424k44865L89175R25674j569290
$$ 511576233 510109253 508837700 509220009 507664299 507920723 507675858 508065033 508990707 507421417
1646.2E07421417J19133k240944N38102m19693M06837J407776j984253j176376Q12263
$$ 507421417 507540550 505299606 505837708 505418015 505824852 507232628 505248375 504071999 504884262
1654.9E04884262K920265J611367J765060P91054J166267J224747Q32710J975975l128
$$ 504884262 507804527 509415894 511180954 511972008 513138275 514363022 515195732 517171707 517168579
1663.6E17168579J668015J440353J741676K177239K346420K155228Q90999K790947
$$ 517168579 518836594 520276947 522018623 524195862 526542282 528697510 529588509 532379456
1671.3E32379456Q55636J583443J959305K181854R70764J140251K942772K226219K559967
$$ 532379456 533235092 534818535 536777840 538959694 539930458 541070709 544013481 546239700 548799667
1680E48799667J662979K358513L221627J288185J411M0207K674484K050553J487083
$$ 548799667 550462646 552821159 556042786 557330971 557332382 557372589 560047073 562097626 563584709
1688.6E63584709K034989K349929K953453K515183K291565K635460L141899j563988
$$ 563584709 565619698 567969627 570923080 573438263 575729828 578365288 581507187 579943199
1696.4E79943199J277657K796707K624512R69009j676674M037819K893906J852455
$$ 579943199 581220856 584017563 586642075 587611084 585934410 589972229 592866135 594718590
1704.1E94718590J263466J247711K71644M32473Q84781l36724k83317O90879J228943
$$ 594718590 595982056 597229767 597501411 597933884 598818665 598481941 598198624 598889503 600118446
1712.8F00118446J656037J194839N49088K103004K485466k559242Q07152J361084M83131
$$ 600118446 601774483 602969322 603518410 605621414 608106880 605547638 606354790 607715874 608199005
1721.4F08199005J49498L0747j86425j52473K02675k49062n91736p19566k491074l057251
$$ 608199005 608348503 608379250 608192825 608040352 608243027 607993965 607402229 606682663 604191589 601134338
1731.1F01134338j011238p76481m639969q473358r88922j283265k908325k184448l384705
$$ 601134338 600123100 599346619 594706650 586233292 585244370 583961105 581052780 578868332 575483627
1739.8E75483627n511207j803971j388626l207359j577263j34773J180534J298332
$$ 575483627 569972420 568168449 566779823 563572464 561995201 561860428 563040962 564339294
1747.5E64339294K719880M357643M250183Q328438O686592O534157O578407O351547
$$ 564339294 567059174 571416817 575667000 583995438 590682030 597216187 603794594 610146141
1755.2F10146141O719780N680885N775566M935799N022392M382553L680954L943406
$$ 610146141 616865921 622546806 628322372 633258171 638280563 642663116 646344070 650287476
1762.9F50287476M040145L475419K232666K428283K217865L08914P89490J573868O31332
$$ 650287476 654327621 657803040 660035706 662463989 664681854 664990768 665780258 667354126 667985458
1771.6F67985458J2284M85763K401505K371902N18570J436844J229553Q11081L47977
$$ 667985458 667997742 668483505 670885010 673256912 673775482 675212326 676441879 677252960 677600937
1780.3F77600937r79691P7820K97852M78973J64871O44913J679001J020813O28891
$$ 677600937 676621246 676699066 676996918 677475891 677640762 678285675 679964676 680985489 681614380
1788.9F81614380R25751L41720J41068j040116q66775J023025M29612J38549P89948
$$ 681614380 682540131 682881851 683022919 681982803 681116028 682139053 682568665 682707214 683497162
1797.6F83497162J381988J033097r4757J173858J02692j27564O82450l72467o59256
$$ 683497162 684879150 685912247 685817490 686991348 687094040 686966476 687648926 687276459 686617203
1806.3F86617203o16379O4545P72400Q26339K80075J118927J565094L46680j78909
$$ 686617203 686000824 686065369 686837769 687664108 687944183 689063110 690628204 690974884 690795975
1815F90795975n66712L9139m89654q08258N8746L17459R57260N23758J135254J339111
$$ 690795975 690229263 690268402 689778748 688970490 689029236 689346695 690303955 690827713 691962967 693302078
1824.6F93302078j035843m39987L93295J27717n50461k336045j3656J232605M42657
$$ 693302078 692266235 691826248 692219543 692347260 691796799 689460754 689447098 690679703 691122360
1833.3F91122360P67822R81370R96627P82547l94516J28937o47736o67114m72793k83585
$$ 691122360 691890182 692871552 693868179 694650726 694256210 694385147 693737411 693070297 692597504 692313919
1842.9F92313919M01764j775284J177597J861420P47375K97394k7160K7771n88990
$$ 692313919 692715683 690940399 692117996 693979416 694726791 695024185 694997025 695024796 694435806
1851.6F94435806l63922m03137m60358m20532m6539Q14895N50995Q69293N22233n9662
$$ 694435806 694071884 693668747 693208389 692787857 692741318 693556213 694107208 694976501 695498734 695439072
1861.3F95439072k27280k78625l69874o09817k30637o39801J3275L17460J20849J021729
$$ 695439072 695211792 694933167 694563293 693953476 693722839 693083038 693096313 693413773 693534622 694556351
1870.9F94556351J000137N47028j61133o0044l78799o23627m28085m04434o4850J17035
$$ 694556351 695556488 696103516 695942383 695882339 695503540 694879913 694451828 694047394 693982544 694099579
1880.6F94099579O12182L63007P55310P58133n74493m08936k06680J30615k16980j543655
$$ 694099579 694711761 695074768 695830078 696588211 696013718 695604782 695398102 695528717 695311737 693768082
1890.2F93768082o4316P43484N5695P68051R05533n7831N74112r5825n33600l22418
$$ 693768082 693703766 694447250 694502945 695270996 696176529 696118698 696692810 696596985 696063385 695740967
1899.8F95740967m96063l29972n16891q0719K13318P28912O41327J13220M50668K62757
$$ 695740967 695244904 694914932 694398041 694317322 694530640 695259552 695900879 696014099 696464767 696727524
1909.5F96727524l69415p91016l19977m21982m20532l51181j95770P96509j45646m7073
$$ 696727524 696358109 695567093 695247116 694825134 694404602 694053421 693857651 694654160 694508514 694461441
1919.1F94461441J070480O33469J52130q77228r38186J6708j10168l17002O0196J13068
$$ 694461441 695531921 696165390 696317520 695440292 694502106 694518814 694408646 694091644 694151840 694264908
1928.8F94264908K62070M51660N94177O23398k23999n39933n96008m44259l82386m16565
$$ 694264908 694526978 694978638 695572815 696196213 695972214 695432281 694836273 694392014 694009628 693593063
1938.4F93593063r4146o1798P43789M19464n96389N69229J009750R9716o33545m41284
$$ 693593063 693498917 693437119 694180908 694600372 694003983 694573212 695582962 695682678 695049133 694607849
1948.1F94607849m18243n11933o72683j63041L35618K03628O16913N91354N69001J24435
$$ 694607849 694189606 693677673 693004990 692841949 693177567 693381195 693998108 694589462 695158463 695282898
1957.7F95282898l39356l40347p84302n20935o1187r6436l88565J96610J069412N29709
$$ 695282898 694943542 694603195 693818893 693297958 693236771 693140335 692751770 692948380 694017792 694547501
1967.3F94547501J03073M04510l814p64390p97195m82483M9668j60065k17285M27398
$$ 694547501 694650574 695055084 695051270 694286880 693489685 693007202 693056870 692896805 692679520 693106918
1977F93106918L88260O52848N52825L12882l1204o96488r08508q73642m03519l66211
$$ 693106918 693495178 694148026 694700851 695013733 694982529 694286041 693377533 692503891 692100372 691734161
1986.6F91734161J20011M86984L55301P69958O46820m0664m70047j01090n20706q05435
$$ 691734161 691854172 692341156 692696457 693466415 694113235 694072571 693602524 693501434 692980728 692175293
1996.3F92175293m00085m26789k32162J45797O96412L91006J87683L28903K34986j31913
$$ 692175293 691775208 691348419 691116257 691262054 691958466 692349472 692537155 692866058 693101044 692969131
2005.9F92969131r08584n23148m68139m02832m04358l62549M15115K36817M75082TJ9303
$$ 692969131 692060547 691537399 691069260 690666428 690262070 689899521 690314636 690551453 691026535 691501617 691520920
2016.5F91520920m88968o79016m99573o03027j80970k58560l43704m13437O1035O05011
$$ 691520920 691031952 690352936 689853363 689250336 689069366 688810806 688467102 688053665 688114700 688719711
2026.2F88719711K35825L19519r4757j65787l40576o34079n59692o76194k83813j68152
$$ 688719711 688955536 689275055 689180298 689014511 688673935 688039856 687480164 686803970 686520157 686352005
2035.8F86352005K05078J02921K6168L56598K22474R8114m39148l57666l13263m07639
$$ 686352005 686557083 686660004 686686172 687042770 687265244 687363358 686924210 686566544 686253281 685845642
2045.5F85845642l94134k46201m4403J9302N54428K89612L65372L46908l03192k71301
$$ 685845642 685451508 685205307 685160904 685180206 685734634 686024246 686389618 686736526 686433334 686162033
2055.1F86162033l87573o73523p75223K2583K74506J60675L75061K46963O47126M12750
$$ 686162033 685774460 685100937 684325714 684348297 684622803 684783478 685158539 685405502 686052628 686465378
2064.7F86465378m47617o39267l88183n15824m32281q6441J78070O63833K18583O6757
$$ 686465378 686017761 685378494 684990311 684474487 684042206 683955765 684133835 684797668 685016251 685083008
2074.4F85083008K38724K83813Q4076o21872n25970k11945J92108j67923m23813Q3390
$$ 685083008 685321732 685605545 685689621 685067749 684541779 684329834 684521942 684354019 683930206 684013596
2084F84013596K80304L51715j2970L21731N16892K17819l50189r39026n01328j34506
$$ 684013596 684293900 684645615 684632645 684954376 685471268 685689087 685338898 684399872 683898544 683764038
2093.7F83764038J36566P8354K53372O82297M81110N6915j79367q9645j68839k57187
$$ 683764038 683900604 683978958 684232330 684914627 685395737 685452652 685273285 685183640 685014801 684757614
2103.3F84757614p51800m76609J76926K8076m8294J27564P72476N09491K22397M5318
$$ 684757614 684005814 683529205 683706131 683734207 683685913 683813477 684585953 685095444 685317841 685363159
2113F85363159k74658l70865q98514j67846o1493k07901L42560J33438K58026O89087
$$ 685363159 685088501 684717636 683819122 683651276 683589783 683381882 683724442 683857880 684115906 684804993
2122.6F84804993Q36486Q011m57153n57556n98679k63900m03519k0676L5629M3869
$$ 684804993 685641479 685649490 685192337 684634781 684036102 683772202 683368683 683348007 683383636 683427505
2132.3F83427505M89655O26755M74777l6697k23694l09906n70069n43441O0119k00882
$$ 683427505 683917160 684543915 685018692 684981995 684758301 684448395 683878326 683334885 683395004 683194122
2141.9F83194122l06015L42408L71933O34918J80893j40076j96075l39127K5406l40576
$$ 683194122 682888107 683230515 683602448 684237366 684418259 684278183 684082108 683742981 683768387 683427811
2151.5F83427811m43955l88107j25580L50571M89273N15823K69623J30005n9357k5482
$$ 683427811 682983856 682595749 682470169 682820740 683310013 683825836 684095459 684225464 684166107 684140625
2161.2F84140625k67181l66288k07290l4943L90167J73264L49808K78854r6359L15551
$$ 684140625 683873444 683507156 683299866 683264923 683655090 683828354 684178162 684457016 684360657 684676208
2170.8F84676208L31955p8201k45743p1869j9989k25296l00293P4921J20392K22321
$$ 684676208 685008163 684929962 684684219 684612350 684592361 684367065 684066772 684141693 684262085 684484406
2180.5F84484406N33752L97263L35769K6856J98288j26038n77011j04752j48849p0954
$$ 684484406 685018158 685415421 685751190 685778046 685976334 685850296 685273285 685168533 685019684 684948730
2190.1F84948730k36816L6240O98471Q00857N34287K9220k365r9258l0060k73361k56424
$$ 684948730 684711914 684748154 685446625 686247482 686781769 686810989 686808624 686709366 686679306 686405945 686149521
2200.7F86149521j57852k19269L51486k4719q698L15857M45404N09491m2419l22800
$$ 686149521 685991669 685772400 686123886 686099167 686090469 686406326 686851730 687361221 687318802 686996002
2210.4F86996002m05502r1629l29285j04294M35410J87607J94702K95105O03943L11355
$$ 686996002 686590500 686498871 686169586 686065292 686500702 686688309 686883011 687178116 687782059 688093414
2220F88093414K05841K1057m07257l05252n65414m33350j61895L69033O61621O00663
$$ 688093414 688299255 688320312 687913055 687607803 687042389 686609039 686447144 686816177 687477798 688078461
2229.7F88078461K79007k00196J80588j22223p10754o31561j90125l01971j42746N73959
$$ 688078461 688357468 688157272 688337860 688215637 687504883 686873322 686683197 686381226 686238480 686812439
2239.3F86812439L89709N41840N99136N53131q1558p73239l97797n72052m62493k01111
$$ 686812439 687202148 687743988 688343124 688896255 688814697 688041458 687643661 687071609 686609116 686408005
2248.9F86408005K2812K36206L64456L09296J79061K62833l7918J25885k64359m32205
$$ 686408005 686430817 686667023 687031479 687340775 687519836 687782669 687744751 687870636 687606277 687174072
2258.6F87174072l92608o55899r2469J57700N28870M02908K97546J63117J8692J4648
$$ 687174072 686781464 686125565 686033096 686190796 686719666 687122574 687420120 687583237 687601929 687616577
2268.2F87616577n26810P6142k01187n17426j43356k03018m7150J44653P13578L94744
$$ 687616577 687089767 687165909 686964722 686447296 686303940 686100922 686053772 686198425 686912003 687306747
2277.9F87306747J36261j73492l48969j29394l60565k76489l85972K82288M6616j88599
$$ 687306747 687443008 687269516 686920547 686791153 686430588 686154099 685768127 686050415 686097031 685908432
2287.5F85908432K28500j0604L45458N3483K2506m90494r04235n91812k92359O5537
$$ 685908432 686136932 686126328 686471786 686525269 686547775 686057281 685153046 684561234 684268875 684334412
2297.2F84334412o52085%M07639M87213M74091k69318k18582n89142n14221o65894
$$ 684334412 683682327 683682327 684089966 684577179 685051270 684781952 684563370 683974228 683460007 682794113
2306.8F82794113l68881k82059n60303l04107m61807L24783k8916K40403N569p68127
$$ 682794113 682425232 682143173 681582870 681278763 680816956 681141739 681112823 681353226 681358795 680590668
2316.4F80590668m47159r02786m32892j365128j064529M01611P25784j78909j138687
$$ 680590668 680143509 679240723 678807831 677442703 676378174 676779785 677505569 677326660 676187973
2325.1F76187973L95966J1367N8213q18711j087417l39203j171799J49460k06070M36325
$$ 676187973 676583939 676595306 676653519 675834808 674747391 674408188 673236389 673385849 673179779 673616104
2334.8F73616104k35977q61664L69263J08566O38123o00815q5983O4849J12992R5749
$$ 673616104 673380127 672518463 672887726 672996292 673634415 673033600 672947617 673012466 673125458 673221207
2344.4F73221207j239167L98560J681137K023697M77524p96356r67484j090393o02570
$$ 673221207 671982040 672380600 674061737 676085434 676562958 675766602 674799118 673708725 673106155
2353.1F73106155j354446j604233j948395j168136J05057n81742J05973P51571J083527
$$ 673106155 671751709 670147476 668199081 667030945 667136002 666554260 666660233 667411804 668495331
2361.8F68495331J134643j36490j808624J18790P92084J27792Q59070k28501K45820
$$ 668495331 669629974 669493484 667684860 667803650 668595734 668723526 669582596 669354095 669599915
2370.4F69599915J136856K111435K016067L83453K01111N07202M62800m273K03934
$$ 669599915 670736771 672848206 674864273 675247726 675448837 675956039 676418839 676414566 676618500
2379.1F76618500M39148K18887K83051R19723R52988J96762L95279K18963q8272l24554
$$ 676618500 677057648 677276535 677559586 678479309 679432297 679629059 680024338 680243301 680155029 679830475
2388.8F79830475n41458l83072o55670Q926K70462j02539K67181O89316M80042l17231
$$ 679830475 679289017 678905945 678250275 678259201 678529663 678427124 678694305 679383621 679863663 679546432
2398.4F79546432n66329o82984l89404j43509l72925j92566J9760r0789l73459J66778
$$ 679546432 678980103 678297119 677907715 677764206 677391281 677198715 677218475 677127686 676754227 676921005
2408.1F76921005M46396J69296J77460k19803o71997p30667m71573k22473O2408j55563
$$ 676921005 677367401 677536697 677714157 677494354 676822357 676091690 675620117 675397644 675460052 675304489
2417.7F75304489m01077K22168N83572J43433j97373j58081n73806n20935l14332l98330
$$ 675304489 674903412 675125580 675709152 675852585 675655212 675497131 674923325 674402390 674088058 673689728
2427.3F73689728k64969k16599L25165K07520%K44827N569m57611p62634k00500n8060
$$ 673689728 673424759 673208160 673533325 673740845 673740845 673985672 673991241 673533630 672770996 672570496 672512436
2438F72512436l88870n36347m06418n5847R6894J74255j19705J23901J20010k02407
$$ 672512436 672123566 671587219 671180801 671124954 671221848 671396103 671276398 671400299 671520309 671317902
2447.6F71317902n07508r37347l89252j48315j20468j94855j89514K30179N9890p4768
$$ 671317902 670810394 669873047 669483795 669335480 669215012 669020157 668830643 669060822 669120712 669045944
2457.2F69045944N2109K13470k97546q22754n10177k8840J297k63290j30615j27793
$$ 669045944 669098053 669311523 669013977 668191223 667681046 667652206 667653503 667390213 667259598 667131805
2466.9F67131805K25373K86178l12500j93023L9901k58331n77698l99093j29242J17492
$$ 667131805 667357178 667643356 667330856 667137833 667177734 666919403 666341705 665942612 665813370 665930862
2476.5F65930862j8081K1744J94473k48337k36816j22757n3025m23660m96826j69296
$$ 665930862 665912781 665934525 666128998 665880661 665643845 665521088 665468063 665044403 664547577 664378281
2486.2F64378281m60205k37656j50223J23367J37482j71051J38703O7749M4479n4550
$$ 664378281 663918076 663680420 663530197 663653564 663791046 663619995 663758698 663826447 663870926 663816376
2495.8F63816376m20838p69653m57840j36108N4245Q4533k66189M44946p4234l26462
$$ 663816376 663395538 662625885 662168045 662031937 662086182 662170715 661904526 662349472 662275238 661948776
2505.5F61948776N70603N8136l28675p53555o28891j40152Q5983J87226j86158J46180
$$ 661948776 662519379 662577515 662248840 661495285 660866394 660726242 660812225 660999451 660813293 660959473
2515.1F60959473N73730K46506l78571m47540m80423j55487n0735q81501n19180k5177
$$ 660959473 661533203 661779709 661401138 660953598 660473175 660317688 660266953 659385452 658866272 658841095
2524.7F58841095J31683L66974M17862J50528k97775j33820l89633l15247j67770n92117
$$ 658841095 658972778 659339752 659757614 659908142 659610367 659476547 659086914 658771667 658603897 658011780
2534.4F58011780n31082j41831n3329k99607L20664N73730k76260n80826k31552m77219
$$ 658011780 657480698 657338867 657285538 656985931 657306595 657880325 657604065 657023239 656791687 656314468
2544F56314468o29730j60904k05383J21689J4648r155L98560R8114J4038m21677l23563
$$ 656314468 655684738 655523834 655318451 655440140 655454788 655445633 655844193 655942307 655956345 655534668 655211105
2554.6F55211105l19748l57742j8921m95758k22778j93024l57361K25830L05329l31345
$$ 655211105 654891357 654533615 654514694 654018936 653796158 653603134 653245773 653471603 653776932 653445587
2564.3F53445587n20782M9362J34430j11008o52237n45959m3793k77939n78003l23944
$$ 653445587 652924805 652974167 653108597 652997589 652345352 651799393 651755600 651477661 650899658 650575714
2573.9F50575714M68216L53546j0376j98669j82495j17417n84640l50113k19040k08206
$$ 650575714 651043930 651397476 651387100 651188431 651005936 650888519 650303879 649953766 649734726 649526520
2583.6F49526520j40228k51694j84479J99661O42395k2583n87845o80618l85284j34735
$$ 649526520 649386292 649134598 648950119 649149780 649792175 649769592 649181747 648501129 648115845 647981110
2593.2F47981110k53067j26954l59115O1874L06397J2283j05591l83377k19726L6544
$$ 647981110 647728043 647601089 647241974 647303848 647610245 647622528 647516937 647133560 646913834 646950378
2602.9F46950378Q9035m49523o00892l06778l42407j57623O7825J14899k28272J05744
$$ 646950378 647039413 646589890 645988998 645682220 645339813 645182190 645250015 645364914 645136642 645242386
2612.5F45242386K45132m00085n04685n54428m05655l82766o13480m39758j7319n9586
$$ 645242386 645487518 645087433 644582748 644028320 643622665 643239899 642626419 642186661 642169342 642109756
2622.1F42109756j4648M66461K6474k83890j87912p08999r01947m73633l62244l53202
$$ 642109756 642095108 642561569 642588043 642304153 642116241 641407242 640505295 640031662 639669418 639316216
2631.8F39316216l2120N455M2343o4926k07291j83029l79639n55763q25958p64580
$$ 639316216 639284096 639289551 639331894 639266968 639059677 638876648 638497009 637941246 637115288 636350708
2641.4F36350708l42102m07677o64596p0153K79046R956J62964J03225j82876p53708
$$ 636350708 636008606 635600929 634936333 634866180 635145226 635155182 635318146 635421371 635238495 634484787
2651.1F34484787o93092l94364q20808o32744j38855L12881K37961J14136p2441n40009
$$ 634484787 633791695 633397331 632576523 631943779 631804924 632117805 632355766 632469902 632397461 631857452
2660.7F31857452k37312l16276m50707n18951p50351n29671j39923N6038j0910K59361
$$ 631857452 631620140 631303864 630853157 630334206 629583855 629054184 628914261 628970299 628959389 629218750
2670.4F29218750J15852p1525j44043l60909l34816n95817o11534p83196o37703J18141
$$ 629218750 629334602 629263077 629119034 628758125 628423309 627827492 627215958 626432762 625795059 625913200
2680F25913200L20092M7187M0093J46370k64702l39584o58150o64215j57166j82914
$$ 625913200 626233292 626280479 626320572 626466942 626202240 625862656 625204506 624540291 624383125 624200211
2689.6F24200211q0834m29306k41089J05896Q5488L06930j77116k70043k56958p32879
$$ 624200211 624119377 623690071 623448982 623554878 623640366 623947296 623770180 623500137 623243179 622510300
2699.3F22510300p20139k88238j70174k65579j38359j14403n1727m464p7972l99895
$$ 622510300 621790161 621501923 621331749 621066170 620927811 620813408 620761681 620757217 620679245 620279350
2708.9F20279350k48718P6485l64151o86493q53157l52211O103m00810j50490J0681
$$ 620279350 620030632 620107117 619742966 619056473 618203316 617851105 617857208 617456398 617305908 617316589
2718.6F17316589j61895N8212j41373p91359m81071J3656l24325q57010n49660M38652
$$ 617316589 617154694 617212906 617071533 616280174 615799103 615812759 615488434 614631424 614081764 614520416
2728.2F14520416K11067k82058j94969k82097l39966k84310j54495l06053l56483m21753
$$ 614520416 614731483 614449425 614254456 613972359 613632393 613348083 613193588 612887535 612531052 612109299
2737.9F12109299l00293j2970j61553j21154N8860P8011k12212k14081P3395p7095
$$ 612109299 611809006 611796036 611634483 611513329 611572189 611650200 611437988 611223907 611297302 611220207
2747.5F11220207o78329q06656j29547j77918l53660j30730Q1520J26648j49002l97606
$$ 611220207 610541878 609735222 609605675 609427757 609074097 608943367 609024887 609151535 609002533 608604927
2757.2F08604927m62418l5629l84598l91349j20545o69174k61269j74980K3384L22419
$$ 608604927 608142509 608106880 607722282 607330933 607210388 606541214 606279945 606104965 606128349 606450768
2766.8F06450768k4720q1978n27572l45497m8027l27301m45290m48914j94473k31628
$$ 606450768 606426048 606344070 605816498 605471001 605422974 605095673 604650383 604201469 604006996 603775368
2776.4F03775368m68064j73187L27759J14479n42030p73850n21087o43845n85365j09024
$$ 603775368 603307304 603134117 603461876 603576355 603034325 602260475 601739388 601095543 600510178 600401154
2786.1F00401154j8235J89820m14658o21986j82572l55720L7765r0637m06074o83823
$$ 600401154 600382919 600572739 600158081 599536095 599353523 598997803 599035568 598944931 598538857 597855034
2795.7E97855034j025276n43900j80588l87115p51762k21177j73645m91447m7760m14085
$$ 597855034 596829758 596285858 596105270 595718155 594966393 594745216 594571571 594080124 594032364 593618279
2805.4E93618279q27752p07397n20325q34198j083526m45862m08783m29955m1542l85628
$$ 593618279 592790527 592083130 591562805 590728607 589645081 589199219 588790436 588360481 588318939 587933311
2815E87933311n26275n14527j201667j299858r55506r47723j151695j104355o31028
$$ 587933311 587407036 586892509 585690842 584390984 583435478 582487755 581336060 580231705 579600677
2823.7E79600677q41674j033058j002961r41047p02324j090508j316719j306114j370316
$$ 579600677 578759003 577725945 576722984 575781937 575079613 573989105 572672386 571366272 569995956
2832.4E69995956j645355j803322j521377j282311j274185k046432k589493k850418
$$ 569995956 568350601 566547279 565025902 563743591 562469406 560422974 557833481 554983063
2840.1E54983063l116722l427506m351806m819069n219345n469628n580749o376343
$$ 554983063 551866341 548438835 544087029 539267960 534048615 528578987 522998238 516621895
2847.8E16621895o549606o048203n394516m565239m087715l155136j391487q1253R11789
$$ 516621895 510072289 504024086 498629570 494064331 489976616 486821480 485429993 485348740 486260529
2856.5D86260529J890182K579041L503189L849258L614922L143119K722893K560692
$$ 486260529 488150711 490729752 494232941 498082199 501697121 504840240 507563133 510123825
2864.2E10123825J666145R57413O61087K09389n16853o85349l57056o14776l97568
$$ 510123825 511789970 512747383 513408470 513617859 513101006 512415657 512058601 511443825 511046257
2872.9E11046257J20430M35066K87476N4664r91m72565n29251p05071q92868q00895
$$ 511046257 511166687 511601753 511889229 511943893 511942902 511470337 510941086 510236015 509343147 508542252
2882.5E08542252r83887q19206m51546p49130j237259r40819j052780j586418j724549
$$ 508542252 507558365 506739159 506287613 505538483 504301224 503360405 502307625 500721207 498996658
2891.2D98996658j590881j220284j437988j790352j407814j066780j597938j590844
$$ 498996658 497405777 496185493 494747505 492957153 491549339 490482559 488884621 487293777
2898.9D87293777j437034j908569j636925j956368k303962k191773k529755k586174
$$ 487293777 485856743 483948174 482311249 480354881 478050919 475859146 473329391 470743217
2906.6D70743217k944602k874146k395706k888985l869591m049453l996163m728355
$$ 470743217 467798615 464924469 462528763 459639778 455770187 451720734 447724571 442996216
2914.3D42996216n103340n070877n136986n392609n253677m511986m025459l516350
$$ 442996216 437892876 432821999 427685013 422292404 417038727 412526741 408501282 404984932
2922.1D04984932l225555k310791j104241m15573L47824O24161J004295J590576K556038
$$ 404984932 401759377 399448586 398344345 397928772 398276596 398900757 399905052 401495628 404051666
2930.7D04051666L074723L011207L942528M582901M502106M389572M240799M501152
$$ 404051666 407126389 410137596 414080124 418663025 423165131 427554703 431795502 436296654
2938.5D36296654M536895L838273L995094M148788L692818L668213L150520K687149
$$ 436296654 440833549 444671822 448666916 452815704 456508522 460176735 463327255 466014404
2946.2D66014404K750092K685623J580505Q38089J258316O78025M3869L34816R95140
$$ 466014404 468764496 471450119 473030624 473868713 475127029 475805054 475848923 476183739 477178879
2954.8D77178879J187248J337547J527634J218719J823693K384872K314339K187233
$$ 477178879 478366127 479703674 481231308 482450027 484273720 486658592 488972931 491160164
2962.6D91160164K294769K846680L167000K913170K900123L289452K838287L164864
$$ 491160164 493454933 496301613 499468613 502381783 505281906 508571358 511409645 514574509
2970.3E14574509L543548L018837K703972K254906K155571J442718J237603J944389
$$ 514574509 518118057 521136894 523840866 526095772 528251343 529694061 530931664 532876053
2978E32876053K460708K205697J447181J866188J894455J610298Q64525L45917J014595
$$ 532876053 535336761 537542458 538989639 540855827 542750282 544360580 545225105 545571022 546585617
2986.7E46585617R68742Q14248O32743Q80814R22279P16362P50695j50986l12653K17209
$$ 546585617 547554359 548368607 549001350 549882164 550804443 551520805 552271500 552120514 551807861 552025070
2996.3E52025070R7771n94101q26454m80156l66707q28743j515083j119004o32057
$$ 552025070 552122841 551528740 550702286 550222130 549855423 549026680 547511597 546392593 545760536
3005E45760536l82614k74239l82423l21617k23732K88391L84255M61692O68183R75799
$$ 545760536 545377922 545103683 544721260 544399643 544175911 544464302 544848557 545310249 545978432 546954231
3014.6E46954231J122208P19910P89299Q72917J208114Q57430Q1215m387j76773r7809
$$ 546954231 548076439 548796349 549585648 550458565 551666679 552524109 552605324 552600937 552424164 552326355
3024.3E52326355J47438o2485m92668J99585L84522k4949J81466l79181n49012k90489
$$ 552326355 552473793 552411308 551918640 552118225 552502747 552477798 552659264 552280083 551731071 551440582
3033.9E51440582l64799r25179r30519l10173q9760N3101m60282o24732o14319l82767
$$ 551440582 551075783 550150604 549220085 548909912 548820152 548873253 548412971 547788239 547173920 546791153
3043.6E46791153m94385q96683l81698o79779n86853q28591r01756j13258o19545m52004
$$ 546791153 546296768 545400085 545018387 544338608 543751755 542923164 542021408 541908150 541288605 540836601
3053.2E40836601K2087k13813p46727p03469p42721j170273o69403q23860n87922j04293
$$ 540836601 540858688 540644875 539898148 539194679 538451958 537281685 536612282 535788422 535200500 535096207
3062.9E35096207o02875p11823q8005J41983o06536j074334j249656p89147p20558
$$ 535096207 534493332 533781509 533693504 533835487 533228951 532154617 530904961 530115814 529395256
3071.5E29395256q29887j78872l68118m09622l76205l36342j30196l14941q68340j089249
$$ 529395256 528565369 528386497 528018379 527608757 527232552 526896210 526766014 526451073 525582733 524493484
3081.2E24493484n83496p77244o41213o21986o78177j08528l27492o64596o39611l07274
$$ 524493484 523909988 523132744 522491531 521869545 521191368 521082840 520755348 520090752 519451141 519143867
3090.8E19143867m15000l06893o31790j273537o51359p73468p96662p98072p23801
$$ 519143867 518728867 518421974 517790184 516516647 515865288 515091820 514295158 513497086 512773285
3099.5E12773285j52321k89612k35786q05626j046143o49337o00777n26695o26831
$$ 512773285 512620964 512331352 512095566 511289940 510243797 509594460 508993683 508466988 507840157
3108.2E07840157o78368r17320q27713o47889m80651j03417j72615p77054j098175
$$ 507840157 507161789 506244469 505416756 504768867 504288216 504184799 504012184 503235130 502136955
3116.9E02136955n22384o75431r43107m94347o49681j177864j126366m68521j89857
$$ 502136955 501614571 500939140 499996033 499501686 498852005 497674141 496547775 496079254 495889397
3125.5D95889397k48986q01010j075897m79507p78809j465111j153717l30734j33362
$$ 495889397 495640411 494839401 493763504 493283997 492505188 491040077 489886360 489555626 489422264
3134.2D89422264l56254k03057o01768j025391m97703n03235r24111j075554j188888
$$ 489422264 489066010 488862953 488261185 487235794 486738091 486234856 485310745 484235191 483046303
3142.9D83046303q95043o56852m91333q42667r35516n03693o57616l01437m58603p00836
$$ 483046303 482151260 481494408 481003075 480160408 479224892 478721199 478063583 477762146 477303543 476602707
3152.5D76602707o53954j012420r27353j119347n91087n58434j003990m35409l86925
$$ 476602707 475948753 474936333 474008980 472889633 472298546 471740112 470736122 470300713 469913788
3161.2D69913788m69780q74863j123314p90481m89960p80563j281929q61283n92918
$$ 469913788 469444008 468569145 467445831 466655350 466165390 465384827 464102898 463241615 462648697
3169.9D62648697l97034m05578m95224m15497o41747q96225j053467n75828o04897
$$ 462648697 462251663 461846085 461350861 460935364 460293617 459397392 458343925 457768097 457163200
3178.6D57163200r32350j008987r79843p36275p53212n03120m59176j68113p26586
$$ 457163200 456230850 455221863 454242020 453505745 452752533 452249413 451790237 451622124 450895538
3187.3D50895538j461754o71348o07414m90990m41551r08318r24110p52602k86102
$$ 450895538 449433784 448762436 448155022 447664032 447222481 446314163 445390053 444637451 444351349
3195.9D44351349k72102n60456n93567n60913r73549j016006o61621q00247p08085
$$ 444351349 444079247 443518791 442925224 442364311 441390762 440374756 439713135 438912888 438204803
3204.6D38204803m44717k28500m76113n69687o36329p80716l55034o59752o81915o36177
$$ 438204803 437760086 437531586 437055473 436485786 435849457 435068741 434713707 434053955 433372040 432735863
3214.3D32735863r86367o51054m57458m15459o26907q55332q26187m83971K2622l77732
$$ 432735863 431749496 431098442 430640984 430225525 429598618 428743286 427917099 427433128 427455750 427078018
3223.9D27078018q26454n76858o39878r78546j051445q83179k91900R9563Q469k15836
$$ 427078018 426251564 425674706 425034828 424056282 423004837 422121658 421829758 421929321 421937790 421721954
3233.5D21721954n92956p39594m22096m88815r96285p11517q88748r92470l10974o22635
$$ 421721954 421128998 420389404 419967308 419478493 418482208 417770691 416881943 415889473 415578499 414955864
3243.2D14955864o16531l88108m72450m24194l98522m01230q85429q58192n04418l55644
$$ 414955864 414339333 413951225 413478775 413054581 412656059 412254829 411369400 410511208 410006790 409651146
3252.8D09651146m39568m74243n25627p64046m99649l66363N2910k80114j076278p40547
$$ 409651146 409211578 408737335 408211708 407447662 406948013 406581650 406634560 406354446 405278168 404537621
3262.5D04537621m17328l29972o10466n30586o62231m49677K39945n29519r49745l33519
$$ 404537621 404120293 403790321 403179855 402649269 401987038 401537361 401777306 401247787 400298042 399964523
3272.1C99964523J24474n77355q71887n56717j084060p58362j51329K61841k35176
$$ 399964523 400088997 399511642 398639755 398083038 396998978 396240616 396089287 396351128 396115952
3280.8C96115952j056557n02892o0081m67262q39158k96897J30081n3177p24831r06563
$$ 396115952 395059395 394556503 394496422 394029160 393190002 392893105 393023186 392970009 392245178 391338615
3290.4C91338615k63786j64528R5444k7542m38538p87620r82743o15654m79927j98135
$$ 391338615 391074829 390910301 391005745 390978203 390539665 389752045 388769302 388153648 387673721 387475586
3300.1C87475586k22855j50871q3199k05039k81716o46553k11563k71759p85751l27492
$$ 387475586 387252731 387101860 387018661 386813622 386531906 385885353 385673790 385402031 384616280 384288788
3309.7C84288788J72996m01039j134071o33125j42785J7319k00577m64058l66935n62821
$$ 384288788 384461784 384060745 382926674 382293549 382150764 382168083 381967506 381503448 381136513 380573692
3319.4C80573692q22982q69675k58026m6768l55607n00984q49113q33893l20625q736
$$ 380573692 379750710 378881035 378623009 378576241 378220634 377719650 376870537 376036644 375716019 375707283
3329C75707283l71742m89464l36418o20003o97746l33176k67830l92723k26593o02417
$$ 375707283 375335541 374846077 374509659 373889656 373191910 372858734 372590904 372198181 371971588 371369171
3338.7C71369171r54361o26221l90739m25796k92969m03290m81606m38804j179695
$$ 371369171 370414810 369788589 369397850 368972054 368679085 368275795 367794189 367355385 366175690
3347.3C66175690o58570k55165q37974n24712n62515m1886J28327k15798n85250j379319
$$ 366175690 365517120 365261955 364423981 363899269 363336754 363294868 363423195 363207397 362622147 361242828
3357C61242828r09156m03328m53873o83174m42162n65452q76503m42505n11399n9089
$$ 361242828 360333672 359930344 359476471 358793297 358351135 357785683 356909180 356466675 355955276 355896187
3366.6C55896187q8349j74484n20401j348076r04426p53098l93905m90723o00967l21427
$$ 355896187 355807838 355633354 355112953 353764877 352860451 352107353 351713448 351222725 350621758 350300331
3376.3C50300331n37834J1215J02768j30310n64079q58460n23224l49845n87502o05354
$$ 350300331 349762497 349773712 349876480 349746170 349182091 348323631 347800407 347450562 346863060 346257706
3385.9C46257706Q3542r1134k55966o08902p52754J3275l78799q11730j02996O40373
$$ 346257706 346341248 346250114 345994148 345385246 344632492 344645767 344266968 343455238 343352242 343992615
3395.6C43992615m35219j283379n13000j18408R2849l36303j18027J05019l73459k72255
$$ 343992615 343557396 342274017 341761017 341642609 341735458 341399155 341281128 341386147 341012688 340740433
3405.2C40740433j54686j4191j92108m43688j57089L96767k3117m03710l26118n78499
$$ 340740433 340585747 340571556 340379448 339935760 339778671 340175438 340152321 339748611 339422493 338843994
3414.8C38843994j20430k06604l80554q4648K24495Q1138m66804K65274L32260k71034
$$ 338843994 338723564 338516960 338136406 338051758 338276253 338357391 337890587 338155861 338488121 338217087
3424.5C38217087l33252R15L78914L49312K3880m59862j5602J52664j46331j55182
$$ 338217087 337883835 337884750 338263664 338612976 338636856 338176994 338161392 338314056 338167725 338012543
3434.1C38012543N0201M27780N16129N66139O3782L32222N51071K0332o0615J29699
$$ 338012543 338062744 338490524 339006653 339572792 339636574 339968796 340519867 340540199 340479584 340609283
3443.8C40609283M29993N6229M85153K11601m36973N49240Q47587O37970l14865p667
$$ 340609283 341039276 341095505 341580658 341792259 341355286 341904526 342752113 343390083 343075218 343067551
3453.4C43067551J221122N72625m13590m27780P08656J218529M44489K8152M49829
$$ 343067551 344288673 344861298 344447708 344019928 344728584 345947113 346391602 346419754 346869583
3462.1C46869583N42259M15535L48435K31819O39954N19332O21643N19410J29699K14959
$$ 346869583 347411842 347827377 348175812 348407631 349047585 349566917 350188560 350707970 350837669 351052628
3471.7C51052628L15589J242981J000405K55661L13110J90735N39856P18536O46630
$$ 351052628 351368217 352611198 353611603 353867264 354180374 354371109 354910965 355629501 356276131
3480.4C56276131O74133L30276n5046P27158Q54988M26025J070366R97773N28030L63197
$$ 356276131 356950264 357280540 357225494 357952652 358807640 359233665 360304031 361301804 361829834 362193031
3490.1C62193031P44973O40945N6686O94275R58786R01680P83387M87480O96296Q82378
$$ 362193031 362938004 363578949 363635635 364329910 365288696 366190376 366973763 367461243 368157539 369039917
3499.7C69039917M10347M50020J073494p6752l18870J146659J319085P36618J151008
$$ 369039917 369450264 369900284 370973778 370897026 370578156 371724815 373043900 373780518 374931526
3508.4C74931526O88133p46193O43273J384964R62334P04002L88489R55429J167869
$$ 374931526 375619659 374873466 375516739 376901703 377864037 378568039 378956528 379911957 381079826
3517.1C81079826R14688N90973Q12607R59816R27086P55615J92871P30324Q42781J096268
$$ 381079826 381994514 382585487 383398094 384357910 385284996 386040611 386233482 386963806 387806587 388902855
3526.7C88902855J332321J151238O70967J02081N33676Q62236J276932R04617Q82149
$$ 388902855 390235176 391386414 392057381 392159462 392693138 393555374 394832306 395736923 396619072
3535.4C96619072O27518O7749J217575P67631K37999Q16002J875992J868668J041259
$$ 396619072 397246590 397314339 398531914 399299545 399537544 400353546 402229538 404098206 405139465
3544.1D05139465R38149L34930J106644L96919L18337J199493J821098J694413p48330
$$ 405139465 406077614 406412544 407519188 407916107 408234444 409433937 411255035 412949448 412201118
3552.7D12201118J006051J297493J059951K327957J143418J544380J563149N06362
$$ 412201118 413207169 414504662 415564613 417892570 419035988 420580368 422143517 422649879
3560.5D22649879K55623J731644J077347k94647L109397J946373O4965J10245j20316
$$ 422649879 422905502 424637146 425714493 425419846 428529243 430475616 430540581 430650826 430530510
3569.1D30530510K730942J308441J207886K042770J528397J005973J497422K227096
$$ 430530510 433261452 434569893 435777779 437820549 439348946 440354919 441852341 444079437
3576.9D44079437J83411J564674J888390K03171J635284K143784J683426P52372K971649
$$ 444079437 444262848 445827522 447715912 447919083 449554367 451698151 453381577 454133949 457105598
3585.5D57105598K486725j314277J594658M99687J740379K348633K193603J449700
$$ 457105598 459592323 458278046 459872704 460372391 462112770 464461403 466655006 468104706
3593.2D68104706M30870K977180l42750J319771L633842L16429K239723J607247L33633
$$ 468104706 468535576 471512756 471170006 472489777 476123619 476440048 478679771 480287018 480620651
3601.9D80620651J359406J077156J810303K712593K677803L01895L115234Q2474j861649
$$ 480620651 481980057 483057213 484867516 487580109 490257912 490559807 493675041 493757515 491895866
3610.6D91895866N417252K082138j197853L093414n37033K499962L711891J003342
$$ 491895866 497313118 499395256 498197403 501290817 500753784 503253746 506965637 507968979
3618.3E07968979K782745k51274j33514J956863J193657J574898K282982J535225Q79249
$$ 507968979 510751724 510500450 510366936 512323799 513517456 515092354 517375336 518910561 519789810
3627E19789810N175934L224564q249627K336541L421631L671150J329040j137619J651917
$$ 519789810 524965744 528190308 519940681 522277222 525698853 529370003 530699043 529561424 531213341
3635.7E31213341K228279K180176J73339N43061K002754K337914J243972j20964J654206
$$ 531213341 533441620 535621796 535795135 536338196 538340950 540678864 541922836 541801872 543456078
3644.4E43456078J971969M289322P91740m034385L814049J012382o50444j756096K444077
$$ 543456078 545428047 549717369 550509109 546474724 550288773 551301155 550650711 548894615 551338692
3653E51338692K931862K480506N376397m830399q91495L514405O85272J552887P51037
$$ 551338692 554270554 556751060 562127457 557297058 556405563 559919968 560605240 562158127 562909164
3661.7E62909164J220665R34983J278572J746292Q5487K453461K192383k4491N44205
$$ 562909164 564129829 565064812 566343384 568089676 568175163 570628624 572821007 572796516 573340721
3670.4E73340721m105987J75361M806519P442894K604408j4853859Q84857N743370
$$ 573340721 569234734 569410095 574216614 581659508 584263916 569410057 570294914 576038284
3678.1E76038284L759003k10724m0131J520234J378860M37966o61583L25660L142929
$$ 576038284 579797287 579586563 579546432 581066666 582445526 582883492 582221909 582547569 585690498
3686.8E85690498N470162m207230m222145O109924l316459j786042L978501Q16460
$$ 585690498 591160660 586953430 582731285 588841209 585524750 583738708 587717209 588533669
3694.5E88533669Q74748O9237M80461J287574m55703J898994L719559k377663l421058
$$ 588533669 589408417 589477654 589958115 591245689 590789986 592688980 596408539 594030876 590609818
3703.2E90609818K714653J547737l82233m56543J372910L839073m697037J774483M063301
$$ 590609818 593324471 594872208 594489975 594033432 595406342 599245415 594548378 596322861 600386162
3711.9F00386162r394074K945023L650703n1956J94283K086868J304626l624267k80075
$$ 600386162 590992088 593937111 597587814 597535858 597730141 599817009 601121635 597497368 597217293
3720.5E97217293M504051j493340m253578L665695K040902K5329j804733j288986J621284
$$ 597217293 601721344 600228004 595974426 599640121 601681023 601706352 599901619 598612633 600233917
3729.2F00233917p0762M765243Q52966o911888N617180L143425n819206q72040J865158
$$ 600233917 600163155 604928398 605781364 598869476 604486656 607630081 601810875 600938835 602803993
3737.9F02803993j27716O44303K481880l002091L62015Q840294j796608j4530029N784149
$$ 602803993 602676277 603320580 605802460 602800369 603162384 612002678 610206070 595676041 601460190
3746.6F01460190L834762L735581k176018q182907Q922462k178840o168099L878823
$$ 601460190 605294952 609030533 606854515 598671608 607594070 605415230 599247131 603125954
3754.3F03125954K806968L391304l559303O04858N262337l993339k175904K053185
$$ 603125954 605932922 609324226 605764923 606369781 611632118 607638779 605462875 607516060
3762F07516060Q58459L02620L097115j080170m944000J241112L976516K221260o648979
$$ 607516060 608374519 608677139 611774254 610694084 605750084 606991196 610967712 613188972 606539993
3770.7F06539993n88264K344513O73828J241760k98271L61786L57818K026902J462021
$$ 606539993 605951729 608296242 608970070 610211830 609913559 610275345 610633163 612660065 614122086
3779.4F14122086n845871L81355J684189M43573J843643q47321q13713N2719l45268
$$ 614122086 608276215 608657570 610341759 610785332 612628975 611781654 610967941 611020660 610675392
3788F10675392J68228J52321r2354m63447M45747J34773J316338L410873k196006l962555
$$ 610675392 610843620 610995941 610903587 610440140 610885887 611020660 612336998 615747871 613551865 609589310
3797.7F09589310R95941L257828N443229l036270q967857K131080J664429K819557
$$ 609589310 610585251 613843079 619286308 616250038 607282181 609413261 611077690 613897247
3805.4F13897247N902443m855079n733605K264252J246605Q7395K8266J12763P45430
$$ 613897247 619799690 614944611 609211006 611475258 612721863 612809258 612837524 612950287 613695717
3814.1F13695717M099312O01883j1263008K541999M648934L238640K657394r816475
$$ 613695717 617795029 618396912 607133904 609675903 614324837 617563477 620220871 610404396
3821.8F10404396j019096K442474N07965J335526R92202k340622m33197J683350K756043
$$ 610404396 609385300 611827774 612335739 613671265 614663467 612322845 611889648 613572998 616329041
3830.5F16329041J620407o463013J107788O081085l876915j780319P063141l168984
$$ 616329041 617949448 611486435 612594223 618675308 614798393 613018074 620081215 616912231
3838.2F16912231n780487N446320k919846j879043N159492j631126l509560J825753
$$ 616912231 611131744 616578064 613658218 611779175 616938667 615307541 611797981 613623734
3845.9F13623734Q01506j49613N37148j817971J237793N727654k450104M16374r040832
$$ 613623734 614425240 614275627 614812775 612994804 614232597 619960251 617510147 617926521 608885689
3854.6F08885689j552925P952118O29196k181206J154900J043815J429100l764648
$$ 608885689 607332764 615284882 615914078 613732872 614887772 615931587 617360687 613596039
3862.3F13596039m04129O465683k334061o500626J683884M291649N857773m446335
$$ 613596039 613191910 619657593 617323532 610822906 612506790 616798439 622656212 618209877
3870F18209877q089485J365013M369736M192123p125778r79347K828674K785K045097
$$ 618209877 610120392 611485405 615855141 620047264 612921486 611942139 614770813 614773598 616818695
3878.7F16818695L496208l568001n972671L868790J698608R94339N081978q322334
$$ 616818695 620314903 616746902 610774231 614643021 616341629 617335968 622417946 614095612
3886.4F14095612k066765K484054P67098L486938O09169o386032J18218K757454j420861
$$ 614095612 612028847 614512901 615279999 618766937 619376106 612990074 613108292 615865746 614444885
3895.1F14444885K3842J164398K405815K528801p806053J958237J695480m484443M013900
$$ 614444885 614468727 615633125 618038940 620567741 612761688 614719925 616415405 611930962 615944862
3903.8F15944862j177673j515503P72171p8506J216850L35083L48282p27654m46586
$$ 615944862 614767189 613251686 614023857 613945351 615162201 615497284 615845566 615117912 614671326
3912.5F14671326O20918j13754N18951J744347j665879l822174K752800J691056l003197
$$ 614671326 615292244 615178490 615697441 617441788 615775909 611953735 614706535 616397591 613394394
3921.1F13394394P41081J090927Q14514p66182k225952R00879J237030O64139o97098
$$ 613394394 614135475 615226402 616040916 615274734 613048782 613949661 615186691 615850830 615153732
3929.8F15153732j07956K004738j067772k030601L08037J91002J86500M19045n59617
$$ 615153732 615045776 617050514 615982742 613952141 614260178 614451180 614637680 615056725 614497108
3938.5F14497108m92591J46827J580887J938057k905311j415978J111870L22227Q31414
$$ 614497108 614004517 614151344 615732231 617670288 614764977 613348999 614460869 614783096 615614510
3947.2F15614510j209946K59704R01986j373787N84907o4087q62617l42980K08512
$$ 615614510 614404564 614664268 615566254 614192467 614777374 614713287 613850670 613507690 613716202
3955.8F13716202L62396m60396L28255n19867n0354M65774r39826Q97216J150704k03896
$$ 613716202 614078598 613618202 613946457 613426590 613376236 613842010 612902184 613799400 614950104 614746208
3965.5F14746208l6621L71971M98734p64733j117515M94613M93660l21197q4457J8501
$$ 614746208 614709587 615081558 615580292 614815559 613698044 614192657 614686317 614365120 614280663 614299164
3975.1F14299164M53071J38932m09737p8888l83911j92070J28937k74544j45264J17417
$$ 614299164 614752235 614891167 614481430 614402542 614018631 613826561 613955498 613680954 613535690 613653107
3984.8F13653107j40381q164M01574O1111M09698N00603j146621j373101J74446P91512
$$ 613653107 613512726 613504562 613906136 613967247 614376945 614877548 613730927 612357826 612532272 613323784
3994.4F13323784J37024R8190N05524J56784k70233q6365
$$ 613323784 613460808 613558998 614064522 614221306 613951073 613864708
4000.2F13864708
$$ 613864708
##END=$$ End of the data block
