##TITLE=$$ Begin of the data block
##JCAMP-DX=5.00 $$ ACD/SpecManager v 10.08
##SPECTROMETER/DATA SYSTEM=Varian
##DATE=04 Dec 2012 14:11:42
##DATA TYPE=INFRARED SPECTRUM
##DATA CLASS=XYDATA
##ORIGIN=
##OWNER=
##NPOINTS=3735
##FIRSTX=399.26403809
##LASTX=4000.35498047
##MAXX=4000.35498047
##MINX=399.26403809
##MAXY=69.91277313
##MINY=22.64607048
##XFACTOR=1.0000000000
##YFACTOR=0.000000100000000
##FIRSTY=51.17758942
##DELTAX=0.96440572
##XUNITS=1/CM
##YUNITS=TRANSMITTANCE
##XYDATA=(X++(Y..Y))
399.3E11775894p911835l302345r271698p647362n211296p590637k733269J231881
$$ 511775894 503864059 500561714 491290016 483642654 478431358 470840721 468107452 469339333
407D69339333K412796K206535L126907K922745K103806l783036k669983K503891j813011
$$ 469339333 471752129 473958664 477085571 480008316 482112122 478329086 475659103 478162994 476349983
415.7D76349983J284676J305046N556526L916740j3792381J644478K779579J729775
$$ 476349983 477634659 478939705 484496231 488412971 474620590 476265068 479044647 480774422
423.4D80774422J531562m610633n734902k742080L760185J804886j312867l07693m540443
$$ 480774422 482305984 477695351 471960449 469218369 472978554 474783440 473470573 473162880 468622437
432.1D68622437j195794L887749K752495K98538j721878k124824q47550j072960J592255
$$ 468622437 467426643 471314392 474066887 474365425 472643547 470518723 469671173 468598213 470190468
440.7D70190468L441734m030990l852883L022995N913544J992493o188584n128021
$$ 470190468 473632202 469601212 465748329 468771324 474684868 476677361 470488777 465360756
448.4D65360756k245636L276672N615959J186181J067962L389817J910171p5684J834565
$$ 465360756 463115120 466391792 472007751 473193932 474261894 477651711 479561882 479486198 481320763
457.1D81320763m737511q520279J303902N000419K112427k315483l851776K268791
$$ 481320763 476583252 468062973 469366875 474367294 476479721 474164238 470312462 472581253
464.8D72581253M495049n15366n352516n620842Q02994n03884k933273L692245L214722
$$ 472581253 477076302 476560936 471208420 465587578 466390572 465886688 462953415 466645660 469860382
473.5D69860382O86302l86352l266716m026566l488769l157845j795692J260490j017570
$$ 469860382 470546684 470160332 466893616 462867050 459378281 456220436 454424744 455685234 454667664
482.2D54667664k418938K182159N662499K453041P18307j712455m866448j476669j244545
$$ 454667664 452248726 454430885 460093384 462546425 463264732 461552277 456685829 455209160 453964615
490.9D53964615j677170l100395k828407K892417J551934N69000j661186l112641l150062
$$ 453964615 452287445 449187050 446358643 449251060 450802994 451371994 449710808 446598167 443448105
499.6D43448105l549156r5291m28658R84917L99894K545319M226151j728287l427582
$$ 443448105 439898949 439803658 439375000 440359917 440759811 443305130 447531281 445802994 442375412
508.2D42375412n241966n302010j712532K53372q00972l774147k440185J315078K500878
$$ 442375412 437133446 431831436 430118904 430372276 429571304 425797157 423356972 424672050 427172928
516.9D27172928j528816n63012M8142l344727m322128m484901q51784L282089K397118
$$ 427172928 425644112 425081100 425129242 421784515 417462387 412977486 412125702 415407791 417804909
525.6D17804909j080895J333161J975479Q0070k578048k949715J8158p06101J496125
$$ 417804909 416724014 418057175 420032654 420112724 417534676 414584961 414603119 413897018 415393143
534.3D15393143J737938J364746K774353J126289K771607K221489Q33129J4878o81458
$$ 415393143 417131081 418495827 421270180 422396469 425168076 427389565 428222694 428237572 427556114
543D27556114l3340j111717J57432K44408J879616L435096j2665j528091m57268L00980
$$ 427556114 427522774 426411057 426568489 426812897 428692513 432127609 432114944 430586853 430129585 430430565
552.6D30430565j461029k340927j175957j1139M07906n68161k8000K93731j236038
$$ 430430565 428969536 426628609 425452652 425441513 425849419 425281258 425253258 425546989 424310951
561.3D24310951k665329k844085l245850j665497k33230j533967q18252j259499j930580
$$ 424310951 421645622 418801537 415555687 413890190 413656960 412122993 411304741 410045242 408114662
570D08114662k643165k444153j758957l038178k035141J38131K091522L79143Q00323
$$ 408114662 405471497 403027344 401268387 398230209 396195068 396333199 398424721 398803864 399604187
578.6C99604187K418823K044564J208839J163063L223190J532135n28946l15284J170807
$$ 399604187 402023010 404067574 405276413 406439476 409662666 411194801 410665855 410350571 411521378
587.3D11521378K535286K536773L154602K061577J668167M62685l24745n06401k253266
$$ 411521378 414056664 416593437 419748039 421809616 423477783 423940468 423615723 423109322 420856056
596D20856056j262512J256790J766548m96254l94783J002655J130104P42188j298637
$$ 420856056 419593544 420850334 422616882 422120628 421725845 422728500 423858604 424600792 423302155
604.7D23302155k25945K3651j493950r09309N188Q47397J491241K630768K348251J917153
$$ 423302155 423076210 423099861 421605911 420696602 420701790 421549187 423040428 425671196 428019447 429936600
614.3D29936600O11458n65339N75562J52969K48490J339836J589927K526742M116439
$$ 429936600 430548058 429982719 430558281 430711250 430959740 432299576 433889503 436416245 440532684
623D40532684K570191N05676J170349J186104J000481L38516K72636J988755J751861
$$ 440532684 443102875 443608551 444778900 445965004 446965485 447304001 447576637 449565392 451317253
631.7D51317253J212196K738648K350922L26957m1885k10648K84577P5149j377067
$$ 451317253 452529449 455268097 457619019 457945976 457904091 457693443 457978020 458053169 456676102
640.4D56676102k67411J263657K720108K580147N52597L99856J179963J300888o72760
$$ 456676102 456408691 457672348 460392456 462972603 463525200 463925056 465105019 466405907 465733147
649D65733147j498604J54381P17697J132431N36194J64413N89333P16362Q35037o48079
$$ 465733147 464234543 464388924 465106621 466239052 466775246 466939659 467528992 468245354 469080391 468432312
658.7D68432312j435165q72384n9356O29654L42102j37406L33519J698761L317490
$$ 468432312 466997147 466124763 466065407 466695061 467037163 466899757 467233276 468932037 472249527
667.4D72249527N184937l598519l019066j082382m01840K74505Q70133O04095J529503
$$ 472249527 477434464 473835945 470816879 469734497 469332657 469607162 470477295 471081390 472610893
676.1D72610893J364060Q08181M96750p70187l42026Q20503J06621m47922j73721R13735
$$ 472610893 473974953 474783134 475279884 474509697 474167671 474988174 475094795 474646873 474473152 475386887
685.7D75386887K233848J200943M19693r0713r64661p0953o25039j932258j622925
$$ 475386887 477620735 478821678 479241371 479150658 478185997 478115044 477490005 475557747 473934822
694.4D73934822O5498J185189J79634j79253l56865j036033j802330k444992j565628
$$ 473934822 474000320 475185509 475365143 475185890 474829025 473792992 471990662 469545670 467980042
703.1D67980042j524277j688919l36151R9678P59391J712799J623955Q69713m17137
$$ 467980042 466455765 464766846 464430695 464530373 465289764 467002563 468626518 469496231 469079094
711.7D69079094m51660J30310n68962j78223J344071K352752K530937K263451L000145
$$ 469079094 468627434 468757744 468188782 468010559 469354630 471707382 474238319 476501770 479501915
720.4D79501915K085991R56535J496277J174202L50571L89480K099076K600059K359619
$$ 479501915 481587906 482544441 484040718 485214920 485565491 485954971 488054047 490654106 493013725
729.1D93013725L956452M380874L135033J589470K43988k99378O10085J188087J92032
$$ 493013725 496970177 501351051 504486084 506075554 506319542 506020164 506630249 507818336 508010368
737.8E08010368J45417J388893J918640J817398J795578J252289m73366j351891j535759
$$ 508010368 508155785 509544678 511463318 513280716 515076294 516328583 515855217 514503326 512967567
746.5E12967567k704010j396446n15480r82170K21634j78566L45306P51572k231522
$$ 512967567 510263557 508867111 508351631 507369461 507591095 507412529 507757835 508509407 506277885
755.1E06277885l391456k867203l371658k327118l75099L91693J006431J068116R55696
$$ 506277885 502886429 500019226 496647568 494320450 493945351 494337044 495343475 496411591 497367287
763.8D97367287O51245P29332J255989Q38432M87595K1934J349564L129997L220558
$$ 497367287 498018532 498747864 500003853 500842285 501329880 501351814 502701378 505831375 509051933
772.5E09051933L394089L075447L846932L152542J574745K101478J866227J023292
$$ 509051933 512446022 515521469 519368401 522520943 524095688 526197166 528063393 529086685
780.2E29086685M44069K059174K107162J943779L204498K332650K265777R08890m2953
$$ 529086685 529530754 531589928 533697090 535640869 538845367 541178017 543443794 544352684 544309731
788.9E44309731o76079p44400J376266J463967J785583K292481K550239K384720J742554
$$ 544309731 543633652 542889252 544265518 545729485 547515068 549807549 552357788 554742508 556485062
797.6E56485062J129646o78711m47121J600495J478958M47159K051010L062782K965698
$$ 556485062 557614708 556935997 556488876 558089371 559568329 560015488 562066498 565129280 568094978
806.2E68094978J801682J141434J616668q66775q24661j75095Q9111M37012K27280
$$ 568094978 569896660 571038094 572654762 571787987 570963326 570788231 570877342 571314354 571541634
814.9E71541634K128868J797294J644821J047020k04353j412315k070465r54857j581269
$$ 571541634 573670502 575467796 577112617 578159637 577955284 576542969 574472504 573517647 571936378
823.6E71936378r78012p63359j45034J93138k04163l3150k145996k415848l286552
$$ 571936378 570958366 570195007 570049973 570243111 570038948 570005798 567859802 565443954 562157402
832.3E62157402l772621k887917k456054j177597p55310J77917m87251k112580k154884
$$ 562157402 558384781 555496864 553040810 551863213 551107903 551285820 550798569 548685989 546531105
841E46531105j888657k101783j897240j499977j992035r09195k60086J35231Q43544
$$ 546531105 544642448 542540665 540643425 539143448 537151413 536242218 535982132 536117363 536960907
849.6E36960907J44081l69148j109963q23555l31649j136666j822853r37805N4054
$$ 536960907 537104988 536735840 535625877 534802322 534470673 533334007 531511154 530573349 530627403
858.3E30627403J177407K837333J588784R80567J775475J119385O80656J557846K866707
$$ 530627403 531804810 534642143 536230927 537211494 538986969 540106354 540787010 542344856 545211563
867E45211563K555885K865563L105926L963128N043373L704605K850074J483918N09491
$$ 545211563 547767448 550633011 553738937 557702065 562745438 566450043 569300117 570784035 571293526
875.7E71293526M70237J095047J152001N26771O05393M94232L41530r63287j504364
$$ 571293526 571763763 572858810 574010811 574537582 575142975 575637207 575978737 575015450 573511086
884.4E73511086k085152k554588k822457l546982l237419k592277j326447r95064r62104
$$ 573511086 571425934 568871346 566048889 562501907 559264488 556672211 555345764 554350700 553388596
893E53388596j850625k467384k236671k879448k406464k308922j474685j015702j063728
$$ 553388596 551537971 549070587 546833916 543954468 541548004 539239082 537764397 536748695 535684967
901.7E35684967o75659j645508j701164j678124k181701l111878l621216l631820l391228
$$ 535684967 535009308 533363800 531662636 529984512 527802811 524690933 521069717 517437897 514046669
910.4E14046669k293816k005310k614021l782692l620682k894325l131409l498993
$$ 514046669 511752853 509747543 507133522 503350830 499730148 496835823 493704414 490205421
918.1D90205421l342514k885818k748718j757164j071587m30069k49481r84955k49557
$$ 490205421 486862907 483977089 481228371 479471207 478399620 477969551 477720070 476735115 476485558
926.8D76485558n63508j211471m74548q61054q51631M61502J413345J185303P41158
$$ 476485558 475922050 474710579 474236031 473374977 472523346 472984848 474398193 475583496 476324654
935.5D76324654J049804J274376J429024J109352M72069J027298J842346J152420J305084
$$ 476324654 477374458 478648834 480077858 481187210 481659279 482686577 484528923 485681343 486986427
944.2D86986427K072716J528969J159973Q9417j073266j681442k246857l225669l721199
$$ 486986427 489059143 490588112 491748085 491837502 490764236 489082794 486835937 483610268 479889069
952.8D79889069k590485k591171l380585l796959m300003m308243m577522m425507
$$ 479889069 477298584 474707413 471326828 467529869 463229866 458921623 454344101 449918594
960.6D49918594m596748n766792n913964n876007n139808n050316n970574o162719
$$ 449918594 445321846 439555054 433641090 427765083 422625275 417574959 411604385 405441666
968.3D05441666o604920o605987p419854p642555p849502q172608q206329q478470
$$ 405441666 398836746 392230759 384810905 377168350 369318848 361146240 352939911 344461441
976C44461441o922493p331772p658310p858867p238884o710778p736873o563816o424408
$$ 344461441 337538948 330207176 322548866 314689999 307451115 300740337 293003464 286439648 280015240
984.7B80015240m884606m770031m621410m104157l881149j942463k855224j918583
$$ 280015240 275130634 270360603 265739193 261635036 257753887 255811424 252956200 251037617
992.4B51037617k403355j860561o99158j313667n73654o08597O90231j93844M47998
$$ 251037617 248634262 246773701 246074543 244760876 244187222 243578625 244268856 244075012 244523010
1001.1B44523010L89977k75669p2193j208363k43206j036472k18983j201859j570720
$$ 244523010 244912987 244637318 244565125 243356762 243113556 242077084 241858101 240656242 239085522
1009.7B39085522m24309j103954q86803k069130j39294j186580j431866o11477j862030
$$ 239085522 238661213 237557259 236670456 234601326 234462032 233275452 231843586 231232109 229370079
1018.4B29370079p66869m75845J356659k70843l9864N39799K83298J082287k97642
$$ 229370079 228603210 228127365 229484024 229213181 229173317 229713116 229996414 231078701 230781059
1027.1B30781059J472836K04544L88470O67858O61373J257744n532J202584p4883P70512
$$ 230781059 232253895 232458439 232846909 233514767 234176140 235433884 235428352 236630936 236556053 237326565
1036.7B37326565M4193L1281O34384o92025O91796m05350P98359P00283J267338N48973
$$ 237326565 237370758 237402039 238036423 237344398 238036194 237630844 238429203 239129486 240396824 240945797
1046.4B40945797q71944J255092K42367N65948m26731J038151K348442J733685J424904
$$ 240945797 240073853 241328945 241571312 242137260 241710529 242748680 245097122 246830807 248255711
1055.1B48255711J585388L808327K178688K859649J822529K783432M054260K751808
$$ 248255711 249841099 253649426 255828114 258687763 260510292 263293724 267347984 270099792
1062.8B70099792M799614L374062M032288L131370K515907K223263k35595j353875
$$ 270099792 274899406 278273468 282305756 285437126 287953033 290176296 289940701 288586826
1070.5B88586826l672313l251915m488659l923512l514194l503437j966858k522717
$$ 288586826 284914513 281662598 277173939 273250427 269736233 266232796 264265938 261743221
1078.2B61743221o91852j274281O71749L24898m9343J642628Q92582K492828J918926
$$ 261743221 261051369 259777088 260448837 260773735 260724392 262367020 263259602 265752430 267671356
1086.9B67671356L272839K911110L089847K491246J250610K801437J447926K416057
$$ 267671356 270944195 273855305 276945152 279436398 280687008 283488445 284936371 287352428
1094.6B87352428J219273J458817J697216J217784K088471L34930J240311L00045L21102
$$ 287352428 288571701 290030518 291727734 292945518 295033989 295368919 296609230 296909275 297230377
1103.3B97230377k38914J67942J704445N37948J242275P97692K523842J885776J359558
$$ 297230377 296991463 297159405 298863850 299401798 300644073 301441765 303965607 305851383 307210941
1112C07210941J691227J041355J690712k1381J236134O07147P21912J433392Q24833
$$ 307210941 308902168 309943523 311634235 311612854 312848988 313456135 314178047 315611439 316436272
1120.6C16436272J805248R98917J882190R45053J254845J622658J161041J100006O11
$$ 316436272 318241520 319240437 321122627 322067680 323322525 324945183 326106224 327206230 327206841
1129.3C27206841J174812J293564K197036Q00095L60489K19078j297836l45116k399788
$$ 327206841 328381653 329675217 331872253 332672348 333032837 333251915 331954079 331608963 329209175
1138C29209175j930008j830215k218895k253304k996902j763611k927799k459164l043156
$$ 329209175 327279167 325448952 323230057 320976753 317979851 316216240 313288441 310829277 307786121
1146.7C07786121k598896k260112k592297j564617k420674j100578j783504p69024
$$ 307786121 305187225 302927113 300334816 298770199 296349525 295248947 293465443 292696419
1154.4B92696419n98850k40460R63554r39521L71666J56612J432171J730556K147484
$$ 292696419 292097569 291857109 292820663 291881142 292252808 292409420 293841591 295572147 297719631
1163.1B97719631L910179L611584M439869L854027M820442M656429M802513M873505
$$ 297719631 301629810 305241394 309681263 313535290 318355732 323012161 327814674 332688179
1170.8C32688179M730797N569458N138626O156235N732002O341400O155357N398636
$$ 332688179 337418976 342988434 348127060 354283295 360015297 366356697 372512054 377910690
1178.5C77910690N399628M472237M467544L877945M377747M109382L898735M320031
$$ 377910690 383310318 387782555 392250099 396128044 400505791 404615173 408513908 412833939
1186.2D12833939M024238L688469K936821K749367J768494J474571J222839R77516
$$ 412833939 416858177 420546646 423483467 426232834 428001328 429475899 430698738 431676254
1193.9D31676254J214142O54450R41543J013794R57756L88680L57513O09207J49079
$$ 431676254 432890396 433544846 434486389 435500183 436457939 436846619 437204132 437813339 437962418
1202.6D37962418Q9302j32408J039505J172714R27200J503525J370964J317062Q49037
$$ 437962418 438051720 437919312 438958817 440131531 441058731 442562256 443933220 445250282 446099319
1211.3D46099319J287766J203423P04002P65877R95445J015167M45290R59778R81445
$$ 446099319 447387085 448590508 449294510 450060387 451055832 452070999 452516289 453476067 454457512
1220D54457512L95431l23753o47697n11895j263504j292762j133728j085511r82246
$$ 454457512 454852943 454529190 453881493 453369598 452106094 450813332 449679604 448594093 447611847
1228.6D47611847o18439l40538o95495o69022j049461j113778j506042j300201n13649
$$ 447611847 446993408 446652870 445957375 445288353 444238892 443125114 441619072 440318871 439805222
1237.3D39805222l87307R8839K51923P60498M32548M65775M16336r0866K56538J37940
$$ 439805222 439417915 439516754 439768677 440529175 440961723 441427498 441843834 441752968 442009506 442147446
1247D42147446J091385J504211J684036J560021J048355J658516J407966R38645N40275
$$ 442147446 443238831 444743042 446427078 447987099 449035454 450693970 452101936 453040581 453580856
1255.7D53580856N06783O18362O12145P49893N64995J203842J488457J088142R36508
$$ 453580856 454087639 454706001 455318146 456068039 456633034 457836876 459325333 460413475 461349983
1264.3D61349983R98192P36809L11241M93546Q77532P59011P11059J473732J509400
$$ 461349983 462348175 463084984 463396225 463889771 464767303 465526314 466237373 467711105 469220505
1273D69220505J229858J145973P03965L65562Q9226m0970l99323j84974O38618P76711
$$ 469220505 470450363 471596336 472300301 472665863 472755089 472714119 472314796 472129822 472768440 473545151
1282.7D73545151P46345Q46939Q59986O88476O02989L05748j12838k73018m12827n00488
$$ 473545151 474291496 475138435 475998421 476686897 477289886 477595634 477482796 477209778 476796951 476296463
1292.3D76296463k52151L83224O82602K14729n11932p23419p09343r56955o19049j43814
$$ 476296463 476044312 476427536 477110138 477324867 476812935 476089516 475380173 474423218 473804169 473660355
1301.9D73660355l06855j44806J77308K22930K75078J15357o22788p54432k80953o39610
$$ 473660355 473353500 473208694 473386002 473608932 473884010 473999367 473376579 472622147 472341194 471701584
1311.6D71701584q22983n75027p19223m02184m8218j84822l56521n70450r61495j252403
$$ 471701584 470878601 470303574 469584351 469182167 469133949 468949127 468592606 468022156 467060661 465808258
1321.2D65808258j217384j002808j044960q22143m38042m92935m04511n71861p61070
$$ 465808258 464590874 463588066 462543106 461720963 461282921 460789986 460385475 459813614 459052544
1329.9D59052544j021538j397972j232567j045761r26323j044159n52902J74980K68936
$$ 459052544 458031006 456633034 455400467 454354706 453428383 452384224 451831322 452006302 452275238
1338.6D52275238m92783n57823N84450K14386R384l65753m82368j39580k39945K11602
$$ 452275238 451782455 451224632 451809082 452023468 452032852 451667099 451184731 451045151 450805206 451016808
1348.2D51016808O6566O523L61900J7281n74722o66466q91266j148643l93601l48244
$$ 451016808 451083374 451089897 451451797 451469078 450894356 450227890 449336624 448187981 447794380 447446136
1357.9D47446136o79702m58679l89405k50053l26691j449241j255646n17960j026382
$$ 447446136 446766434 446307755 445918350 445668297 445341606 443892365 442636719 442118759 441092377
1366.6D41092377p09458p47757p61795M44908M40484O78901R1324q63380r07021m36554
$$ 441092377 440382919 439635162 438873367 439318275 439758759 440437660 440528984 439665604 438758583 438322029
1376.2D38322029o3057o86722J01738Q54226J552352J342926J203309J494064P75452
$$ 438322029 438258972 437572250 437673988 438528214 440080566 441423492 442626801 444120865 444896317
1384.9D44896317J186447Q98704L28713Q53614J073571J061859J107750J091194Q29544
$$ 444896317 446082764 446981468 447310181 448163795 449237366 450299225 451406975 452498169 453327713
1393.6D53327713J61247j099052K26517J00860m24995j873360q36754J106606k57798
$$ 453327713 453488960 452389908 452616425 452717285 452292290 450418930 449582176 450688782 450430984
1402.2D50430984j32026M01306q8730Q5259J52740j59874r74235m57001p27539r96781
$$ 450430984 450298958 450700264 450611534 450696793 450849533 450689659 449715424 449258423 448530884 447534103
1411.9D47534103p72705n40924j91002l12042J33705q6326M87442j519699j51291J727409
$$ 447534103 446761398 446220474 446029472 445717430 445851135 445764809 446252251 444732552 444581261 446308670
1421.5D46308670O50826P45506R1476J045113J147423K11830N12771k84233r34715
$$ 446308670 446959496 447705002 447796478 448841591 449989014 450200844 450713615 450429382 449494667
1430.2D49494667l84827L49579o58836l29247P18232J76429j095123k00691J644859
$$ 449494667 449109840 449459419 448800583 448471336 449189568 449365997 448270874 448070183 449715042
1438.9D49715042R4757j79367j33705o24619o6452n92765K54364j34659L49617j215439
$$ 449715042 449809799 449630432 449496727 448872108 448805656 448212891 448467255 448332596 448682213 447466774
1448.5D47466774r31549K29034j218719j235428k628136j020240j328202r10072M35524
$$ 447466774 446535225 446764259 445545540 444310112 441681976 440661736 439333534 438423462 438858986
1457.2D38858986k381897K755661r9907J932793M98237M88625J617737q07152J713333
$$ 438858986 436477089 439232750 439132843 441065636 441563873 442052498 443670235 442863083 444576416
1465.9D44576416R21936M414864N283661P798042P668609N611001R329643M987411
$$ 444576416 445498352 449913216 455196877 462994919 470663528 476274529 485604172 490591583
1473.6D90591583O312790L605690M350815M519691L664437M449539L654366M149131
$$ 490591583 496904373 500510063 504860878 509380569 513045006 517494545 521148911 525298042
1481.3E25298042K461434L226928K156411J256179J522751q06007O47278J696815J778260
$$ 525298042 527759476 530986404 533142815 534398994 535921745 535115738 535763016 537459831 539238091
1490E39238091O91947J705819J395187k594O19812j33133l373146l6888J87530j653595
$$ 539238091 539930038 541635857 543031044 543028450 543648262 543515129 540141983 540105095 540292625 538639030
1499.6E38639030M52958K90794n23033M77829N65948J14899n378609n105629K7619
$$ 538639030 539091988 539382782 538859749 539337578 539903526 540018425 534639816 529534187 529561806
1508.3E29561806k40746j461181n84450p60842k401161M387m64020r63134j170884
$$ 529561806 529321060 527859879 527275429 526514587 524113426 524117813 523653793 522690659 521519775
1517E21519775l704109J696739J112442k320594j511269R78508K292404J140022l94287
$$ 521519775 517815666 519512405 520624847 518304253 516792984 517771492 520063896 521203918 520809631
1525.7E20809631k72941L73230j056633p65572L05824q98017j56327q32786j730614
$$ 520809631 520536690 520909920 519853287 519087715 519393539 518495522 518339195 517506409 515775795
1534.3E15775795J573601O59713O19851J237793j409798o841240K036057L80172J91498
$$ 515775795 517349396 518009109 518628960 519866753 518456955 511615715 513651772 514031944 514223442
1543E14223442K707443J200028K97699J311683J580086J497536O12602l01475J384887
$$ 514223442 516930885 518130913 518428612 519740295 521320381 522817917 523430519 523129044 524513931
1551.7E24513931J745415J785851R36546O08787L873177M157295n62134J23787R91440
$$ 524513931 526259346 528045197 528981743 529590530 533463707 537621002 537058868 537182655 538174095
1560.4E38174095L457680J445846J269951R39370Q44421J673164J672745K238693J438523
$$ 538174095 541631775 543077621 544347572 545286942 546131363 547804527 549477272 551715965 553154488
1569.1E53154488p49779J096382J989403O67763M6730O33277n4550k323227J441841
$$ 553154488 552404709 553501091 555490494 556158257 556204987 556838264 556783714 554460487 555902328
1577.7E55902328J932717N73768Q14591k02065p35015m56772j176720j176338j391258
$$ 555902328 557835045 558408813 559223404 559021339 558286324 557829552 556652832 555476494 554085236
1586.4E54085236o14891o41213m36363n73769r43451j092338j445389j731110k730102
$$ 554085236 553470345 552829132 552392769 551819000 550875549 549783211 548337822 546606712 543876610
1595.1E43876610j713410j860199j753578j592788j337739j213760j830063j511421
$$ 543876610 542163200 540303001 538549423 536956635 535618896 534405136 532575073 531063652
1602.8E31063652k651024k596855k953529l055077l090477k292290k390327l585968
$$ 531063652 528412628 525815773 522862244 519807167 516716690 514424400 512034073 508448105
1610.5E08448105j723519k713890k682876l299904k196808k358513j0076675j133843
$$ 508448105 506724586 504010696 501327820 498027916 495831108 493472595 483395920 482262077
1618.2D82262077k350731k658653l374557k058564k704887o779747j846313k740326
$$ 482262077 479911346 477252693 473878136 471819572 469114685 462334938 460488625 457748299
1626D57748299j826210m919358m811248k709923l007393k242661l192405n57938q00476
$$ 457748299 455922089 451002731 446191483 443481560 440474167 438231506 435039101 434481163 433680687
1634.6D33680687n487900n592842n89065j484719j914520o70433k384873p3165j802254
$$ 433680687 428192787 422599945 422010880 420526161 418611641 417941208 415556335 415483170 413680916
1643.3D13680916l22266P94869j725884l38859l825417J331177k2812J595001J626473
$$ 413680916 413358650 414153519 412427635 412088776 408263359 409594536 409571724 411166725 412793198
1652D12793198l267022j823577r75724L666153J222992J944313R47647J099205J385117
$$ 412793198 409526176 407702599 406726875 410393028 411616020 413560333 414507980 415607185 416992302
1660.7D16992302J083107K298775J97563L525963K083625K112389K165146J994553
$$ 416992302 418075409 420374184 420571747 424097710 426181335 428293724 430458870 432453423
1668.4D32453423K614784P50541M009133J402244L209191L341980K005081J853065
$$ 432453423 435068207 435818748 439827881 441230125 444439316 447781296 449786377 451639442
1676.1D51639442K592583M192162K479133K978020J829186L427925M371032R08623
$$ 451639442 454232025 458424187 460903320 463881340 465710526 469138451 473509483 474418106
1683.8D74418106O66542K205773N721588L897667L451614L786278K963447L238755
$$ 474418106 475084648 477290421 483012009 486909676 490361290 494147568 497111015 500349770
1691.5E00349770K433357L138351L454895L496590L03040M305381N319176M758911
$$ 500349770 502783127 505921478 509376373 512872963 513176003 517481384 522800560 527559471
1699.3E27559471M151039k987060M596901L479614K347832J533432J720581N33333
$$ 527559471 531710510 528723450 533320351 536799965 539147797 540681229 542401810 542935143
1707E42935143R70077K735024J220665J118392J455155J070213J553650J50604l8414
$$ 542935143 543905220 546640244 547860909 548979301 550434456 551504669 553058319 553208923 553170509
1715.6E53170509K087555J804428k590522K530479K759666J385384Q46253J66969n24025
$$ 553170509 555258064 557062492 554471970 557002449 559762115 561147499 561993752 562160721 561636696
1724.3E61636696j044960j215592j718597j503563p58285l546143l634071k71264j144
$$ 561636696 560591736 559376144 557657547 556153984 555395699 551849556 548215485 547944221 547943077
1733E47943077n369110j2095566j868095k507324m420472l816032p152901q467636
$$ 547943077 542573967 530478401 528610306 526102982 521682510 517866478 510713577 502245941
1740.7E02245941j638679j369286m877129j642150N7067J981736L365326M192123N831528
$$ 502245941 500607262 499237976 494360847 492718697 492775764 494757500 498122826 502314949 508146477
1749.4E08146477N749702J0238114Q540001J0267715J0655518J0256233J0323486R090653
$$ 508146477 513896179 524134293 532674294 542942009 553597527 563853760 574177246 583267899
1757.1E83267899R747467P082901O803855O138154M650154N415649M996033M354362
$$ 583267899 593015366 600098267 606902122 613040276 617690430 623106079 628102112 632456474
1764.8F32456474L175011L731384K877350L06397K807693L611450J416016j163025
$$ 632456474 635631485 639362869 642240219 642546616 645354309 648965759 650381775 649218750
1772.5F49218750K19040L657074K932358O30417J978759J029892N51834M53797o71005
$$ 649218750 649437790 653094864 656027222 656657639 658636398 659666290 660218124 660671921 660000916
1781.2F60000916J283798J565780J420823K37197r9945J378327R61914Q44726J149750
$$ 660000916 661284714 662850494 664271317 664508514 664408569 665786896 666748810 667593536 668743286
1789.9F68743286J78986R6588j190567j40991K385788J061401j94473R15069J772995
$$ 668743286 668922272 669018860 667828293 667687302 670073090 671134491 670940018 671855087 673628082
1798.6F73628082P57065r09881P41424n61371k74353J224365M83475O18286N89600
$$ 673628082 674385147 673475266 674216690 673655319 673380966 674605331 675088806 675707092 676296692
1807.3F76296692K91519P60574J108017o28891k18048N25818q0643O59028L22113N91430
$$ 676296692 676588211 677348785 678456802 677827911 677609863 678135681 678055038 678714066 679036179 679627609
1816.9F79627609K20185M08630J133804K1363N84793K04925K33612M93393k302780
$$ 679627609 679847794 680256424 681390228 681411591 681996384 682201309 682434921 682928314 680625534
1825.6F80625534m16794J601715J499710L32261j709214Q02689J660080L50723n4016
$$ 680625534 680208740 681810455 683310165 683642426 681933212 682735901 684395981 684746704 684692688
1834.3F84692688n61600j05285L36456m46549L01896K65121O17600P16857J107789
$$ 684692688 684131088 684025803 684362259 683915710 684217606 684482727 685100327 685817184 686924973
1842.9F86924973L17993l686066Q73032R30252p91321j36108P54852N70144K94266
$$ 686924973 687242966 683556900 684429932 685360184 684568863 684432755 685187607 685757751 686052017
1851.6F86052017J074600J62812K8915n1041m99877k37580o69021j00403N9814M44412
$$ 686052017 687126617 687289429 687318344 687267303 686767426 686529846 685860825 685760422 685820236 686264648
1861.3F86264648L56446N32150P24335K24457M21981p32422l59802q83102j609726
$$ 686264648 686621094 687153244 687877579 688102036 688524017 687791595 687431793 686548691 684938965
1869.9F84938965N76172Q66775Q99887P37610M92172L7995o4163l73993k74735P8659
$$ 684938965 685515137 686381912 687281799 688019409 688511581 688549576 688485413 688111420 687836685 687915344
1879.6F87915344m67529o5384R6664M71039M48532K22474K09579k30103N58167j05972
$$ 687915344 687447815 687382431 687479095 687950134 688398666 688621140 688830719 688600616 689158783 689052811
1889.2F89052811j591950L8910O29044q9188N80368O36902k78091M55398k2430j01548
$$ 689052811 687460861 687499771 688128815 688039627 688619995 689256897 688978806 689434204 689411774 689310226
1898.9F89310226k02941o04325n5694K19116L94974k75879J2741L55682K14081M4632
$$ 689310226 689107285 688502960 688447266 688666382 689061356 688785477 688798218 689153900 689367981 689412613
1908.5F89412613n51682q95767k84500P22275k06604J92108K48795J46713J267853
$$ 689412613 688860931 687965164 687680664 688402939 688196335 688388443 688637238 688783951 690051804
1917.2F90051804j158524o34308N91736P6904P0572j340561p92007L55148O20728N18036
$$ 690051804 688893280 688258972 688850708 688927612 688998184 687657623 686865616 687220764 687841492 688359528
1926.8F88359528N26733K33307J31149J95618m04282k97012o75125n07813l86123r6894
$$ 688359528 688886261 689119568 689250717 689446335 689042053 688745041 688069916 687562103 687175980 687079086
1936.5F87079086L98255K85263P93533K62222M86451l27759j849289J6327j9989l86887
$$ 687079086 687477341 687762604 688556137 688818359 689304810 688977051 687127762 687144089 687124100 686737213
1946.1F86737213R461K32620M26102P02590N41611O7749k33383m38614j80130n93109
$$ 686737213 686746674 686979294 687405396 688107986 688649597 688717346 688483963 688045349 687865219 687272110
1955.8F87272110n10635J69601L03421K59247L29819N77468K49024j49460m14886q4839
$$ 687272110 686761475 686931076 687234497 687493744 687823563 688401031 688650055 688500595 688085709 688000870
1965.4F88000870l42484j003418m14047J58463N71212L65601N36346L56903r0179r2468
$$ 688000870 687658386 686654968 686240921 686399384 686970596 687336197 687872543 688229446 688139267 688046799
1975.1F88046799m86985j62277k62222k49176k65808l18985L12881K92282J37940m4327
$$ 688046799 687559814 687397537 687135315 686886139 686620331 686301346 686614227 686906509 687044449 687000122
1984.7F87000122L94440L45611m45175p35397m47312L28980k9831q31528k6397Q97140
$$ 687000122 687394562 687740173 687294998 686559601 686112289 686441269 686411438 685579910 685553513 686450653
1994.3F86450653L92990k93808m78363o70700k85339j31073j76773j43738J99814K40783
$$ 686450653 686843643 686549835 686071472 685400772 685115433 684984360 684807587 684663849 684863663 685104446
2004F85104446O4850J2665k35367P5684k57721m38004l29513l06168j70059m12369
$$ 685104446 685169296 685181961 684946594 685022278 684764557 684326553 683997040 683690872 683520813 683108444
2013.6F83108444j22986p4386L5858l51334m97665j20773n11780m27628l82766r3995
$$ 683108444 682985458 682911072 682946930 682595596 682097931 681977158 681465378 681037750 680654984 680560989
2023.3F80560989M0436K06299N2948n05905q2398m51355q08487n80291q8730K6474
$$ 680560989 680601425 680807724 680860672 680354767 680272369 679821014 679012527 678432236 678343506 678369980
2032.9F78369980k05307R7656k5864J57013J75019k19498n49393n13534o71540n20172
$$ 678369980 678164673 678262329 678236465 678393478 678568497 678348999 677799606 677286072 676614532 676094360
2042.6F76094360J21384l69339J20926M64554K20489l738l53928L07312j19858o71920
$$ 676094360 676215744 675846405 675967331 676431885 676652374 676648636 676294708 676602020 676482162 675810242
2052.2F75810242r47953n53970K8610j00097M17785N92881R80453K69775m54940j06507
$$ 675810242 674862289 674308319 674336929 674236832 674654617 675247498 676227951 676497726 676042786 675936279
2061.9F75936279l32870n04761j037598o77108M0817M95605P59354O54068M16489j068
$$ 675936279 675603409 675098648 674061050 673383942 673424759 673920364 674679718 675333786 675750275 675749207
2071.5F75749207o2790n90516m73709m15115l78571l2577r689M28390J57776L51944
$$ 675749207 675686417 675095901 674622192 674207077 673828506 673795929 673786240 674214630 674372406 674724350
2081.1F74724350N12009L27530j75019n99823L205n92881q21457k44064M36249O25076
$$ 674724350 675236359 675563889 675388870 674789047 674792252 674199371 673377914 673133850 673570099 674195175
2090.8F74195175K52075M04129L28980L76892m21143p51724m83780m03824o7825k19574
$$ 674195175 674447250 674851379 675180359 675557251 675136108 674384384 673900604 673496780 673428955 673209381
2100.4F73209381J91269N19791N09948K13852J52054k8992l79257p4005l43933k82440
$$ 673209381 673400650 673920441 674430389 674644241 674796295 674767303 674388046 674314041 673970108 673687668
2110.1F73687668l17078J69754N64575L15781M60281k53143l74832l98102j94626j84173
$$ 673687668 673370590 673540344 674104919 674420700 674880981 674627838 674253006 673854904 673660278 673476105
2119.7F73476105n52368l17765k77404M63333M80651M90265K83585k77634k55584o05622
$$ 673476105 672923737 672605972 672328568 672791901 673272552 673762817 674046402 673768768 673513184 672907562
2129.4F72907562j4724k23694l44620J84326J50986N50308M22668J0300k29034q3695
$$ 672907562 672892838 672669144 672324524 672508850 672659836 673210144 673632812 673643112 673414078 673330383
2139F73330383l74527n84030k48031r9946J13984R1171L66516K53677N5085r0485k99225
$$ 673330383 672955856 672371826 672123795 672023849 672137833 672229004 672595520 672849197 672904282 672813797 672514572
2149.6F72514572k16141j65405M425k87857m4937J85623L31345M21371K51770L05405
$$ 672514572 672298431 672133026 672137451 671849594 671804657 671990280 672321625 672742996 672994766 673300171
2159.3F73300171n06134m56162j01242k8228j13984k73437K55737J10779N04837R23996
$$ 673300171 672794037 672337875 672236633 672208405 672094421 671820984 672076721 672187500 672692337 673616333
2168.9F73616333Q23822K77252l80401m31290o20346R0256J96914O3782L93753N70679
$$ 673616333 674440155 674717407 674337006 673905716 673285370 673375626 673572540 673636322 674030075 674600754
2178.5F74600754Q71582K92740j23215j77994p8964k54135k77176R1247R0180J31226
$$ 674600754 675472336 675765076 675641861 675463867 675384903 675130768 674853592 674944839 675035019 675166245
2188.2F75166245L05938Q08716M44946L23029L54156l25393n51071n32532P7514j14364
$$ 675166245 675472183 676280899 676725845 677048874 677403030 677077637 676526566 675994034 676071548 675957184
2197.8F75957184k63901K01187N84870R74044O59790L61252l59726n44586l00064j38931
$$ 675957184 675693283 675894470 676479340 677453384 678113174 678474426 678114700 677570114 677270050 677131119
2207.5F77131119k8000k53372K10113L12958L71475N73197N85403K31476j66016j56707
$$ 677131119 677103119 676849747 677059860 677372818 677744293 678317490 678902893 679134369 678968353 678811646
2217.1F78811646k27356j45646o02874J63650J002503N03997O2333l84598p2098O5842
$$ 678811646 678584290 678438644 677835770 677999420 679001923 679505920 679568253 679183655 679111557 679177399
2226.8F79177399J75094l07388m42352K66494J05210J33133q469K17514J95007O0502
$$ 679177399 679352493 679045105 678602753 678869247 678974457 679107590 679099121 679316635 679511642 679572144
2236.4F79572144k1363l34930k40402n08881L35464M49753O8436K33917K54517N82275
$$ 679572144 679550781 679215851 678975449 678466568 678802032 679251785 679320221 679554138 679808655 680390930
2246F80390930l82309p22275j71279K51922q3313l82767O2638j5030O58111N80674
$$ 680390930 680008621 679286346 679115067 679366989 679283676 678900909 678963547 678948517 679606628 680187302
2255.7F80187302j0529l62244l86962p6371k16369R2163j90048J0528K33231L48129
$$ 680187302 680176773 679814529 679427567 679351196 679134827 679226990 679036942 679047470 679280701 679628830
2265.3F79628830L48816M7684M58602j84326k31247k69851l48282k72522l28598L52936
$$ 679628830 679977646 680025330 680483932 680299606 680068359 679798508 679450226 679177704 678849106 679202042
2275F79202042K83584P96814K99225Q4534K14004o69327n39474r98688l48511j15814
$$ 679202042 679485626 680282440 680581665 680666199 680880203 680210876 679671402 678672714 678324203 678208389
2284.6F78208389o7596O74209L86811Q87985P90558R7198m99725j43433j02920n32684
$$ 678208389 678140793 678815002 679201813 680089798 680880356 680977554 680477829 680334396 680231476 679698792
2294.3F79698792Q1939j89819M15344R01260Q79059P27463K36206K63443n74341o07223
$$ 679698792 679780731 679590912 680006256 680907516 681786575 682514038 682750244 683013687 682439346 681832123
2303.9F81832123m37012J84326M75769K13089J131897R01184Q84400P34863L76740
$$ 681832123 681395111 681579437 682055206 682268295 683400192 684301376 685185776 685920639 686297379
2312.6F86297379L31497n40085o85043k98615M20685J56555Q03604J712876J178054
$$ 686297379 686628876 686088791 685403748 685105133 685525818 685682373 686485977 688198853 689376907
2321.3F89376907J177369Q3313p83768O76575J793441n04760r59778P38144m99802
$$ 689376907 690554276 690637589 689853821 690530396 692323837 691819077 690859299 691597443 691097641
2329.9F91097641P74689J121139r9945L82767j05209O81076M69131n76248q30078l60031
$$ 691097641 691872330 692993469 692893524 693276291 693171082 693852158 694321289 693745041 692914963 692554932
2339.6F92554932M20532k54746O52771Q98896l8147j355133k576981l041458l017578
$$ 692554932 692975464 692720718 693373489 694272385 694234238 692879105 690302124 687260666 684243088
2348.3F84243088O62002L258362J538620J114502J417770J118851J911850K200546
$$ 684243088 684905090 688163452 689702072 690816574 692234344 693353195 695265045 697465591
2356F97465591J662140n66482o48880j83335J78833P53403K49176j264038k023697
$$ 697465591 699127731 698561249 697912369 697729034 697907867 698661270 698910446 697646408 695622711
2364.7F95622711r14001j460190j677094j370391j230088k210388k239685o79474j343613
$$ 695622711 694708710 693248520 691571426 690201035 688970947 686760559 684520874 683841400 682497787
2373.3F82497787j142425j056213j028367l0441j310043k014313q90884j009522j901550
$$ 682497787 681355362 680299149 679270782 679240341 677930298 675915985 675025101 674015579 672114029
2382F72114029j355972p79038p98187k16217R7046j23825k70920J984l9521J1978j59301
$$ 672114029 670758057 669979019 669180832 668964615 669061661 668937836 668666916 668668900 668629379 668641357 668482056
2392.6F68482056r42841n78689j24817M9743l1433k0294L27148k9144k21100n00717
$$ 668482056 667539215 666960526 666835709 666885452 666854019 666833725 667160873 667131729 666910629 666409912
2402.3F66409912n46188l31574j60370q5678k39792O5003P1869J66473O5537m56162
$$ 666409912 665863724 665532150 665371780 665286102 665046310 665111313 665183182 665349655 665415192 664959030
2411.9F64959030n79910k49252j57242o57501n16892l68881q0719K23694J52816J57090
$$ 664959030 664379120 664129868 663972626 663315125 662798233 662429352 662348633 662572327 662725143 662882233
2421.6F62882233j30234l05328o47660m40521l90930n80597k46582m9439J99051j49231
$$ 662882233 662751999 662446671 661799011 661358490 660967560 660386963 660140381 660090942 660289993 660140762
2431.2F60140762j71737k72446j97220J33286o72303p36999k37045k3499l27682n88761
$$ 660140762 659969025 659696579 659499359 659632645 658960342 658223343 657986298 657962799 657635117 657046356
2440.8F57046356m26712R6893M86222n98603p77435k47650k81982k97165m54789k94189
$$ 657046356 656619644 656716537 657202759 656604156 655826721 655579071 655297089 654999924 654545135 654250946
2450.5F54250946p0496j52k93732j09329J0757k78625k85645m02984l14865m31672
$$ 654250946 654180450 654180298 653886566 653777237 653787994 653509369 653223724 652820740 652505875 652074203
2460.1F52074203l97033j33515L10593l5629n82886J39694j64642p17316l14407J50833
$$ 652074203 651677170 651543655 651854248 651818619 651235733 651375427 651210785 650493469 650179062 650329895
2469.8F50329895l06168o17981l1662j29928L6545j76621l03497o3706k52151l35007
$$ 650329895 650023727 649405746 649374084 649244156 649280701 649104080 648800583 648736877 648484726 648149719
2479.4F48149719n71518j27411l15017k84729K53219j56326l04718l36838j58691j92642
$$ 648149719 647578201 647450790 647135773 646851044 647104263 646947937 646643219 646306381 646147690 645955048
2489.1F45955048j80970k55050m50974k08969j02615J39465k00729l32413K8992N0201
$$ 645955048 645774078 645519028 645068054 644859085 644756470 644895935 644695206 644362793 644391785 644441986
2498.7F44441986m6921k45437m73099n19791L3417k6093j51214K85416Q4533l15780
$$ 644441986 644395065 644149628 643676529 643156738 643190155 643164062 643012848 643298264 643382797 643067017
2508.3F43067017j95618l12042o63681l11280n06210j98746K39258m5166L16773j01243
$$ 643067017 642871399 642559357 641895676 641584396 641078186 640879440 641118698 641073532 641390305 641289062
2518F41289062m40063m41818k17972n3329k62528r7732l19901N302j76277k95753J6975
$$ 641289062 640848999 640407181 640189209 640135880 639873352 639775620 639455719 639461021 639284744 638988991 639005966
2528.6F39005966l7155R7008n12543m56314n02358n45730l58887l09295J97525k60392
$$ 639005966 638968811 639065819 638553276 638096962 637594604 637048874 636689987 636380692 636578217 636317825
2538.2F36317825r7084O4621j08719j74102o05126m86793m56925k00462n73502o05430
$$ 636317825 636220741 636285362 636176643 636002541 635397415 634910622 634453697 634253235 633679733 633074303
2547.9F33074303Q0871K4529J36719J92565j92794p41616l83072j97219n34707l13453
$$ 633074303 633155174 633179703 633316422 633508987 633316193 632574577 632191505 631994286 631459579 631146126
2557.5F31146126j05858j13945l91922j09940K7466J39237n8976r15832p44743k38915
$$ 631146126 631040268 630926323 630534401 630424461 630451927 630591164 630532188 629616356 628871613 628632698
2567.2F28632698M7150k89040k86636o5880k08092K0752k89535k57607j58958k87400
$$ 628632698 628679848 628390808 628104172 628038292 627830200 627850952 627561417 627303810 627144852 626857452
2576.8F26857452m69970o33126k85148k74887j74675l57819j04408M57458j05934m14467
$$ 626857452 626387482 625754356 625469208 625194321 625019646 624661827 624557419 625014877 624908943 624494476
2586.5F24494476j71241k00272n43404l89900l89061p02019n1612L21426k06490j29776
$$ 624494476 624323235 624122963 623579559 623189659 622800598 622098579 622046967 622368393 622161903 622032127
2596.1F22032127L8338m06952j50108k32239r22851o24390J68533L32985k73018l23639
$$ 622032127 622070465 621663513 621513405 621281166 620358315 619733925 619902458 620235443 619962425 619638786
2605.7F19638786j92985m31175k75460o4850m88281q03490l57627k18048q0491l54004
$$ 619638786 619445801 619014626 618739166 618674316 618186035 617382545 617024918 616806870 616726379 616372375
2615.4F16372375o09397k75917n14374l60832k83699k61002l43514q91456n00565K0600
$$ 616372375 615762978 615487061 614972687 614611855 614328156 614067154 613723640 612832184 612331619 612352219
2625F12352219j00022n48362o45600l02315n4702o41518j196861m12789j60217l94096
$$ 612352219 612252197 611703835 611058235 610755920 610701218 610059700 608862839 608450050 608289833 607895737
2634.7F07895737m01230l37525j02119l73077n95055n85327n72396o07872o12487m18778
$$ 607895737 607494507 607156982 607054863 606681786 606086731 605501404 604929008 604321136 603708649 603289871
2644.3F03289871j73111k60086n42221m02222m98771o97098m70810k49672l16086l97224
$$ 603289871 603116760 602856674 602314453 601912231 601413460 600716362 600245552 599995880 599679794 599282570
2654E99282570n31464o75964l83225l30314j05324m2191n69648n49774n06554o53496
$$ 599282570 598751106 598075142 597691917 597361603 597256279 597214088 596644440 596094666 595588112 594934616
2663.6E94934616o44798n24674m42466k60735j91841j94016j34048k39792J59569j75438
$$ 594934616 594289818 593765144 593322678 593061943 592870102 592676086 592542038 592302246 592461815 592286377
2673.3E92286377j036339r18083l99399l57513p48520l12348k2277k17095k07863j85775
$$ 592286377 591250038 590331955 589932556 589575043 588826523 588514175 588491898 588274803 588066940 587881165
2682.9E87881165l70408o32400j84822k54593m25186k37351m11110n94329m40293J62392
$$ 587881165 587510757 586878357 586693535 586438942 586013756 585776405 585365295 584770966 584330673 584493065
2692.5E84493065j99661n52445l56331j31492m1771p06673o44531l26996k34604p553
$$ 584493065 584293404 583740959 583384628 583253136 583211365 582504692 581860161 581533165 581298561 581291008
2702.2E81291008M9286m78706q86498k62222m25301n05257k08663n96734p30552m09966
$$ 581291008 581340294 580861588 579975090 579712868 579287567 578782310 578573647 577976913 577246361 576836395
2711.8E76836395K8153j02768j67389m10767o66961n32494p50122n06172m20761m65889
$$ 576836395 576864548 576761780 576594391 576183624 575516663 574984169 574234047 573727875 573307114 572841225
2721.5E72841225k49825n38788l24173L4867l86124l88336n22156p09953j72463l95050
$$ 572841225 572591400 572052612 571728439 571763306 571377182 570988846 570466690 569756737 569584274 569189224
2731.1E69189224m40101m18625n11513L204l25126l09105N5771k15378n63851o78978
$$ 569189224 568749123 568330498 567818985 567822189 567497063 567187958 567243729 567028351 566464500 565785522
2740.8E65785522m88700l50647l26310l90281L9329N3978k07977j62277j50185k21291
$$ 565785522 565296822 564946175 564619865 564229584 564268913 564322891 564114914 563952637 563802452 563581161
2750.4E63581161j003494r46083n46951k59552N1155k77100k27623k74315j97334m64477
$$ 563581161 562577667 561631584 561084633 560825081 560876236 560599136 560371513 560097198 559899864 559435387
2760E59435387m85878j00708m35601n91545o10962J28708J6632n71365j59569m01916
$$ 559435387 558949509 558848801 558413200 557821655 557210693 557339401 557356033 556784668 556625099 556223183
2769.7E56223183l89061j04256k60010m63562k75421m84047p28569l34053n63850o56357
$$ 556223183 555834122 555729866 555469856 555006294 554730873 554246826 553518257 553184204 552620354 551963997
2779.3E51963997n19219j90887R041j38130m66881r08623o05392o88210m64172l09830
$$ 551963997 551444778 551253891 551262932 551124802 550657921 549749298 549143906 548455696 547991524 547681694
2789E47681694n20515j14823l89557p36885q34808o91071p18307o18782n37644j003799
$$ 547681694 547161179 547046356 546656799 545919914 545085106 544394035 543675728 543056946 542519302 541515503
2798.6E41515503m77524k73056o26602o60095n57328r80835j471138p96546o80886
$$ 541515503 541037979 540764923 540138321 539478226 538920898 537940063 536468925 535672379 534991493
2807.3E34991493m99496m22936r88846j004791j258583j033325n23682o67114j187706
$$ 534991493 534491997 534069061 533080215 532075424 530816841 529783516 529259834 528592720 527405014
2816E27405014j273117p86552p81785j108016j545830j534996q48847q44841j757240
$$ 527405014 526131897 525345345 524563560 523455544 521909714 520374718 519525871 518681030 516923790
2824.7E16923790j803780j094665j354332k126122k077675j501159j740952j976165
$$ 516923790 515120010 514025345 512671013 510544891 508467216 506966057 505225105 503248940
2832.4E03248940j806069j854248j999435k545433k413140k453842l413773m013481
$$ 503248940 501442871 499588623 497589188 495043755 492630615 490176773 486763000 482749519
2840.1D82749519m580612m704742n060082o145324o701813p166710p658234q343200
$$ 482749519 478168907 473464165 468404083 462258759 455556946 448390236 440732002 432388802
2847.8D32388802q790017q111572p538185o873054n524560l920326j941795n5809J686439
$$ 432388802 423598785 415487213 407949028 401075974 395551414 391631088 389689293 389633484 391319923
2856.5C91319923K969666L169022L897857M453049M103393M297486L609733K568589
$$ 391319923 394289589 397458611 401356468 405809517 409912910 414210396 417820129 420388718
2864.2D20388718K325744J665879R98153K5559r16863o02531q11653r59359l35731
$$ 420388718 422714462 424380341 425378494 425404053 424487190 423884659 423073006 422113647 421777916
2872.9D21777916j62888K66571K53525J4229k52800p15065m60014n80597q53577r46503
$$ 421777916 421615028 421881599 422135124 422149353 421896553 421181488 420721474 420140877 419287300 418340797
2882.5D18340797j169929j315079j445045j520157j720581j721420j543999j320763
$$ 418340797 417170868 415855789 414410744 412890587 411170006 409448586 407904587 406583824
2890.2D06583824j619644k042732j941986j799126j759911k321853k424011j964112
$$ 406583824 404964180 402921448 400979462 399180336 397420425 395098572 392674561 390710449
2897.9C90710449j848030k197647k644615k187004k092972k582970k969818k994499
$$ 390710449 388862419 386664772 384020157 381833153 379740181 377157211 374187393 371192894
2905.7C71192894k781525l259658l713265m021988m192734m635353n317497n380135
$$ 371192894 368411369 365151711 361438446 357416458 353223724 348588371 343270874 337890739
2913.4C37890739n435142n772896o315155o148376n884934o306953n721875m792385
$$ 337890739 332455597 326682701 320367546 314219170 308334236 302027283 296305408 291513023
2921.1B91513023m435405l524857k446136j766301n02758J9951K37637J692791K803993
$$ 291513023 287077618 283552761 281106625 279340324 278837566 278857517 279095154 280787945 283591938
2929.8B83591938L396530L091870L501262M534760M613170M996243N256348N380115
$$ 283591938 286988468 290080338 293581600 298116360 302729530 307725773 312982121 318362236
2937.5C18362236N436592N609131N153923M949493N161820M447479M456597M224662
$$ 318362236 323798828 329407959 334561882 339511375 344673195 349120674 353577271 357801933
2945.2C57801933L903122L624268K750053K067757J455650J292267R97086P41386O27670
$$ 357801933 361705055 365329323 368079376 370147133 371602783 372895050 373892136 374633522 375261192
2953.9C75261192P75833R75228J372757J975059J949272K740326L049927K735024L296012
$$ 375261192 376037025 377012253 378385010 380360069 382309341 385049667 388099594 390834618 394130630
2962.6C94130630L682938L538361L766670M404983M315567M343529L832245L429298
$$ 394130630 397813568 401351929 405118599 409523582 413839149 418182678 422014923 425444221
2970.3D25444221M054871L955422L293609K936936L032684K873421L211403K795867
$$ 425444221 429499092 433454514 436748123 439685059 442717743 445591164 448802567 451598434
2978D51598434K143059K471619K060852K549820K253647J270714J587638J638565J899033
$$ 451598434 453741493 456213112 458273964 460823784 463077431 464348145 465935783 467574348 469473381
2986.7D69473381J882095J174889J028213J503411J146202M59213j1253o8817M47273
$$ 469473381 471355476 472530365 473558578 475061989 476208191 476667404 476656151 476587334 477034607
2995.3D77034607n4512n42908q02040o22520l24440q58269j096802j433220j407051
$$ 477034607 476980095 476437187 475635147 475012627 474688187 473829918 472733116 471299896 469892845
3004D69892845j416702j188660o93664r19419n45044k40631Q2894N90858P78923J179505
$$ 469892845 468476143 467287483 466593819 465674400 465129356 464888725 464971619 465562477 466341400 467520905
3013.7D67520905J421546J324959J031227Q66089R25598J124115P55806L56102N81360
$$ 467520905 468942451 470267410 471298637 472164726 473090324 474214439 474970245 475326347 475907707
3022.4D75907707P89566J73264n08957j12991J98669M95567j58081r77974n31883l72658
$$ 475907707 476697273 476870537 476361580 476248589 476447258 476942825 476784744 475806770 475274887 474902229
3032D74902229q0146n91927j243134p71331m44031o18134p07626l04375m48074p46918
$$ 474902229 474822083 474230156 472987022 472215691 471771660 471153526 470445900 470141525 469693451 468946533
3041.6D68946533j052666r13467l93333n95742r38797j206169q85734p55921q26187
$$ 468946533 467893867 466980400 466587067 465991325 465052528 463846359 462960625 462204704 461378517
3050.3D61378517p12280o30074p04345j083489q10203j189309j237640o23093q70514
$$ 461378517 460666237 460036163 459331818 458248329 457438126 456248817 455011177 454388084 453517570
3059D53517570r59396q97102q17871j162148o80961r1210p75032j066589j133385q02155
$$ 453517570 452558174 451661072 450843201 449681053 449000092 448908882 448133850 447067261 445933876 445131721
3068.6D45131721o85920r03969q21114p26394q06237q60977o31141p35436q32481q04596
$$ 445131721 444445801 443541832 442720718 441994324 441188087 440327110 439695969 438960533 438128052 437323456
3078.3D37323456n62554p95593j173096r40170j057052p14760m85001o84929j019211
$$ 437323456 436760902 435965309 434792213 433852043 432794991 432080231 431595230 430910301 429891090
3087D29891090j049308o02494p33223r59701j411553r11064j11465n43556j025162
$$ 429891090 428841782 428239288 427506065 426546364 425134811 424223747 424112282 423568726 422543564
3095.6D22543564j068268p83234q93173p17201o72417p99522q47817j393165j192398
$$ 422543564 421475296 420692062 419798889 419081688 418409271 417609749 416761932 415368767 414176369
3104.3D14176369p17545p06291j196213j077118n17959o00396r04159j104813p92465
$$ 414176369 413458824 412752533 411556320 410479202 409961243 409360847 408456688 407351875 406559410
3113D06559410q57391p45201r06945j002998m43382p77054o65741j083260j796379
$$ 406559410 405702019 404956818 404049873 403046875 402603493 401826439 401160698 400077438 398281059
3121.7C98281059j251106q86230j007271p04384o77872j235580p74613q62465j139946
$$ 398281059 397029953 396143723 395136452 394432068 393754196 392518616 391744003 390881538 389741592
3130.4C89741592r77783q84285o07300j298675j196556r37920o49223o84357j167717
$$ 389741592 388763809 387879524 387272224 385973549 384776993 383839073 383189850 382505493 381337776
3139C81337776n60379r56039j017533r65499r11637n79796j216316j333771j324920
$$ 381337776 380777397 379821358 378803825 377838326 376926689 376346893 375130577 373796806 372471886
3147.7C72471886q07648j002350j085777m18778r42993r89990q29201p34176r98764
$$ 372471886 371664238 370661888 369576111 369157333 368214340 367224350 366395149 365660973 364662209
3156.4C64662209j307412j268272j163750p33452r13581o73142o25458j137123j045303
$$ 364662209 363354797 362086525 360922775 360189323 359275742 358602600 357977142 356840019 355794716
3165.1C55794716p30286p15904q58955r00116j111641r32503j104469q60176l49884
$$ 355794716 355064430 354348526 353489571 352589455 351477814 350545311 349440842 348580666 348230782
3173.8C48230782r87130j249809q59528n80139r80529p63588p78542j255608p46231
$$ 348230782 347243652 345993843 345134315 344554176 343573647 342810059 342031517 340775909 340029678
3182.4C40029678o73828n92003q07647r04808p97081j048699q72574j177101j254730
$$ 340029678 339355850 338763847 337956200 337051392 336254311 335205612 334333038 333155937 331901207
3191.1C31901207r34143p57218p86399n84946m13437p77931r52530j403046j247062
$$ 331901207 330967064 330209846 329423447 328838501 328425064 327647133 326694603 325291557 324044495
3199.8C24044495m83971k46162p05529o25190l72734r35288o74515o41002q63247j036206
$$ 324044495 323560524 323314362 322608833 321983643 321610909 320675621 320001106 319360104 318496857 317460651
3209.4C17460651p94563l74412j066075p33948o11629r33132p75967o64081k71779
$$ 317460651 316666088 316291676 315225601 314491653 313880024 312946892 312170925 311506844 311235065
3218.1C11235065o35986j011734p82680m60015n26809m55647r51557j296654l73936
$$ 311235065 310599079 309587345 308804665 308344650 307817841 307362194 306410637 305113983 304740047
3226.8C04740047n31158o69346n83992n29137m25491m04739n34153j298599o31161
$$ 304740047 304208889 303539543 302955551 302426414 302000923 301596184 301062031 299763432 299132271
3235.5B99132271p77321j023941j48506l79734l61843m06266o74629j191559q35762
$$ 299132271 298354950 297331009 297182503 296802769 296440926 296034660 295360031 294168472 293332710
3244.2B93332710l44658p05108n45750r49268q11978m64382l31478n10445r43718m37011
$$ 293332710 292988052 292282944 291737194 290787926 289975948 289511566 289180088 288669643 287725925 287288914
3253.8B87288914o52104q49380m22287l09811o35223o91414k69947m40846p08236p17087
$$ 287288914 286636810 285787430 285365143 285055332 284420109 283728695 283458748 283017902 282309666 281592579
3263.4B81592579o54793o74648n44682n93185l89595j60504p92694q47797l66554j15490
$$ 281592579 280937786 280263138 279718456 279125271 278735676 278575172 277782478 276934681 276568127 276452637
3273.1B76452637q07782p18059j44348r42898q40092n88932n22480k86255j75495k45800
$$ 276452637 275644855 274926796 274782448 273839550 272999458 272410526 271888046 271601791 271426296 271180496
3282.7B71180496p01656n27878k74105r8133m12026k67181k66190q62922k08397k34356
$$ 271180496 270478840 269950962 269676857 269578724 269166698 268899517 268633327 267770405 267562008 267327652
3292.4B67327652m66499n01194m38881J6594n82142q62065l93161j07804m29611n76649
$$ 267327652 266861153 266359959 265921078 265937672 265355530 264493465 264100304 263992500 263562889 262986240
3302B62986240J47400J87092o30779m79317k56863p90729l44334k95047p43981m58641
$$ 262986240 263133640 263320732 262689953 262210636 261953773 261163044 260818710 260523663 259779682 259321041
3311.7B59321041n8536k79656r18922l86010k1362k69470k95677j87569n36003o16875
$$ 259321041 259262505 258982849 258063927 257677917 257656555 257387085 257091408 256903839 256367836 255750961
3321.3B55750961J36700n16891o68259o3858k38323o23169o78025m2877m18339m98142
$$ 255750961 255887661 255370770 254702511 254638653 254400330 253777161 253099136 253056259 252637920 252139778
3330.9B52139778l61137m66767l74221m37375j45568n40085j30921J3047l89138l67508
$$ 252139778 251778641 251311874 250937653 250500278 250354710 249814625 249683704 249696751 249307613 248940105
3340.6B48940105p53212l15895j84688l29933q06065q24623l53108n15956q6270o10332
$$ 248940105 248186893 247870998 247686310 247356377 246550312 245725689 245372581 244856625 244770355 244160023
3350.2B44160023p83158l0822M7321j78947o52962o95801k88734N5027n99442q03299
$$ 244160023 243376865 243346043 243393364 243214417 242561455 241865654 241576920 241631947 241032505 240229206
3359.9B40229206l52840l37754m2495l45078m80690l38802n54219n73291m96540j40076
$$ 240229206 239876366 239538612 239496117 239151039 238670349 238331547 237777328 237204037 236707497 236567421
3369.5B36567421j17092o49586l42617K23084l31498q46328r35669n12715j02138N7354
$$ 236567421 236450329 235800743 235458126 235681210 235349712 234503384 233567715 233055000 232952862 233010216
3379.2B33010216K07958k40726m27971p77111l53089j8577m19579K33288j9856k99682
$$ 233010216 233218174 232977448 232549477 231772366 231419277 231400700 230981121 231214409 231194553 230894871
3388.8B30894871l34511m16641p63k1572j44616k69107r2087l09525k26230j16539
$$ 230894871 230560360 230143719 230142956 230121384 229976768 229707661 229615574 229306049 229079819 228963280
3398.4B28963280l06816r6264m30947l04832K3403L29361Q7471l50094l85132m27703
$$ 228963280 228656464 228560200 228129253 227824421 227847824 228177185 228264656 227914562 227529430 227101727
3408.1B27101727R4604r5673J76316L51982j90754k78339m42963j93157K2926N35831
$$ 227101727 227196331 227100658 227276974 227628956 227438202 227159863 226716900 226523743 226546669 227082500
3417.7B27082500L46089j70231l72696m24957K89154L34053N64041P3223n06725J14345
$$ 227082500 227428589 227258358 226885662 226460705 226749859 227083912 227647953 227721176 227214451 227328796
3427.4B27328796N21775K08988j61781M89025L395k52133J77918L59402Q72745J03645
$$ 227328796 227850571 228059559 227897778 228386803 228390198 228138065 228315983 228675385 229548130 229651775
3437B29651775m30069J6957Q14018J65272l45269N24483M63066N69916Q0853R0904
$$ 229651775 229221706 229238663 230052681 230217953 229872684 230397167 230860233 231430149 231511002 231601906
3446.7B31601906J42784L64952P69501k67582N05085R06639L29819J28059R3536P07837
$$ 231601906 231744690 232109642 232879143 232611561 233116646 234023285 234353104 234481163 234574699 235282536
3456.3B35282536K51483N91355R16252K00424Q6250R2679J96723N98526O80848M34951
$$ 235282536 235534019 236125374 237041626 237242050 237328300 237420979 237617702 238216228 238897076 239332027
3466B39332027N77221L67794Q64067J299077O40678L11985L5801O03619N61313j53084
$$ 239332027 239909248 240277042 241141109 242440186 243080864 243392849 243428650 244032269 244593582 244440498
3475.6B44440498K20909N22309P50179Q87585R47132Q59966K22969k12383N23720J139202
$$ 244440498 244661407 245183716 245933895 246821480 247768612 248628578 248851547 248639164 249162884 250302086
3485.2B50302086J185112P92885L9940N38768O85101K90775Q97866J207866P88727
$$ 250302086 251487198 252280083 252320023 252858791 253543892 253834667 254732533 255940399 256729126
3493.9B56729126P56607P40166Q9988M13876J083202J076126O03619N44891O14205
$$ 256729126 257485733 258225899 258315887 258729763 259812965 260889091 261492710 262037601 262651806
3502.6B62651806J22795O52714N40466O85692J401329J171150O98719L58963J159992
$$ 262651806 262774601 263427315 263967781 264653473 266054802 267225952 267924671 268283634 269443626
3511.3B69443626J313477Q51402N54924L27378P65438J124458J084022N28012O17676
$$ 269443626 270757103 271608505 272163429 272490807 273256245 274380703 275464725 275992737 276610413
3520B76610413J027450J292305Q75359r3880M67987J357975J691475M38213L00656
$$ 276610413 277637863 278930168 279805527 279711647 280179634 281537609 283229084 283667297 283967953
3528.6B83967953J002693P37266J264515J623917J407986O72092J118031Q34045P4864
$$ 283967953 284970646 285707912 286972427 288596344 290004330 290676422 291794453 292628498 292703362
3537.3B92703362J123943J448517J476955O53572J143112J429310J004906Q23688K57798
$$ 292703362 293827305 295275822 296752777 297406349 298549461 299978771 300983677 301807365 302065163
3546C02065163J922302P29713Q34961J588631J535416J746769p57485R97677J434650
$$ 302065163 303987465 304717178 305552139 307140770 308676186 310422955 309665470 310663147 312097797
3554.7C12097797J272393J922416O82030J590481J368046J095333J096725K061501
$$ 312097797 313370190 315292606 315974636 317565117 318933163 320028496 321125221 323186722
3562.4C23186722J194038L67661L989906J510887m96254j61400L93296L707046K074242
$$ 323186722 324380760 324748421 328738327 330249214 329752960 329591560 329984856 333691902 335766144
3571.1C35766144J517792J787834J954879J549531J424446J956520N11017J959075
$$ 335766144 337283936 339071770 341026649 342576180 344000626 345957146 346468163 348427238
3578.8C48427238J658936J215401J778869J428757K207642J347046L299369J880379
$$ 348427238 350086174 351301575 353080444 354509201 356716843 358063889 361363258 363243637
3586.5C63243637q03261K792015N70221K257004K555389K801095J862106P81517L600006
$$ 363243637 362440376 365232391 365802612 368059616 370615005 373416100 375278206 376059723 379659729
3595.2C79659729n78766J695633L864861J063690K546196Q71086J204147K608109K487755
$$ 379659729 379080963 380776596 384641457 385705147 388251343 389122429 390326576 392934685 395422440
3603.9C95422440K202606K170219K275658p78999L315658Q80051j00632P101326K425194
$$ 395422440 397625046 399795265 402070923 401291924 404607582 405487633 405387001 412488327 414913521
3612.5D14913521j227608K514687n13344L771133M047776M1618K220611P70684R68323
$$ 414913521 413685913 416200600 415687256 419458389 423506165 423547783 425768394 426539078 427507401
3621.2D27507401L065910K437897K607803K707786K018700K951698N651970L0251r152451
$$ 427507401 430573311 433011208 435619011 438326797 440345497 443297195 448949165 448979416 439826965
3629.9D39826965L617058N264092M595070J177749k91748K888947K951812K506180
$$ 439826965 443444023 448708115 453303185 454480934 454189186 457078133 460029945 462536125
3637.6D62536125J210747J290741J737137K338180J513748l013K236824L470764N222969
$$ 462536125 463746872 465037613 466774750 469112930 470626678 470623665 472860489 476331253 481554222
3646.3D81554222L79906l212738M706268J228485j390991q97484L975411L717498L806725
$$ 481554222 481934128 478721390 483427658 484656143 483265152 482367668 486343079 490060577 493867302
3655D93867302N404205n807724Q48770M490624K037582K000847J13793J428527O57502
$$ 493867302 499271507 493463783 494312553 498803177 500840759 502841606 502955399 504383926 505041428
3663.6E05041428J801986K696648Q91304M070778K668114p50695j03454n605316K832794
$$ 505041428 506843414 509540062 510431366 514502144 517170258 516419563 516316109 510710793 513543587
3672.3E13543587Q232193P518997j333351j3568459K470055O890907M258843q76160
$$ 513543587 521775780 529294777 527961426 514392967 516863022 523753929 528012772 527136612
3680E27136612Q04100K639313J048584N21507R49936J004715L708992O273498o806144
$$ 527136612 527940712 530580025 531628609 532150116 533100052 534104767 537813759 544087257 537281113
3688.7E37281113m181137P425155m009475n60914N195008J125564J869736K49939k61612
$$ 537281113 533099976 540525131 536515656 535954742 541149750 542275314 544145050 544394989 544133377
3697.4E44133377J860695K94723K362595L172302m722480k684594M170990J777382
$$ 544133377 545994072 546288795 548651390 551823692 547101212 544416618 548587608 550364990
3705.1E50364990J74866Q84476K721748L394165o832466K728615L534088j1386414
$$ 550364990 550539856 551424332 554146080 557540245 550707779 553436394 556970482 545584068
3712.8E45584068M099465M087867O20270Q71430K305755J906281l452759J09863N666504
$$ 545584068 549683533 553771400 554391670 555263100 557568855 559475136 556022377 556132240 561798744
3721.5E61798744k145347m948845M267120J688309k01569k040520j93710L061829P54051
$$ 561798744 559653397 554704552 558971672 560659981 560458412 558417892 558224182 561286011 562040062
3730.2E62040062N288734j661949p472954O642456n89141p121697J093903J214370
$$ 562040062 567328796 565666847 558193893 564836349 564247208 557125511 558219414 559433784
3737.9E59433784K13547K978592L387108l194351K069092J1286392n379372j9242096
$$ 559433784 559647331 562625923 566013031 562818680 564887772 576174164 570794792 551552696
3745.6E51552696Q411370O652412O786652l187714j2010727J0471802l467026p239761
$$ 551552696 559964066 566616478 573403130 570215416 558204689 568676491 565209465 557969704
3753.3E57969704N274200M265099K922477n412139J693801N510979o371422j694832
$$ 557969704 563243904 567509003 570431480 565019341 566713142 572224121 565852699 564157867
3761E64157867L850022J353950K43912L221016k368279m914627K628556N108566J002998
$$ 564157867 568007889 569361839 569605751 572826767 570458488 565543861 568172417 573280983 574283981
3769.7E74283981q531112J245651L264427M01840R55468K0370O50139j64108K259292
$$ 574283981 565752869 566998520 570262947 570664787 571620255 571640625 572290764 572126656 574385948
3778.4E74385948J269570o441231J257095J837921R50775K691689k346802j417503
$$ 574385948 575655518 569214287 570471382 572309303 573260078 575951767 573604965 572187462
3786.1E72187462Q84552q202M72336j63422K01378L86200L24440n49164Q76847L612137
$$ 572187462 573072014 573063812 573536148 573372726 573574104 573960304 574284744 573735580 574612427 578224564
3795.8E78224564k555657l794403J590996L113403M607582o155739q984565M073105
$$ 578224564 575668907 571874504 573465500 576578903 581186485 575030746 566046181 570119286
3803.5E70119286L269691M028816N082627q140374m654426M334068J850014N88455
$$ 570119286 573388977 577417793 582500420 574360046 569705620 574039688 575889702 576478157
3811.2E76478157J194992M43840M88663M724197l64570j3769799L974610N766639M693757
$$ 576478157 577673149 578116989 578605652 583329849 582965279 569195480 573170090 578936729 583630486
3819.9E83630486K676200j5744018K72903M544144K021561K628784l91922m294968
$$ 583630486 586306686 570562668 570835571 575379715 577401276 580030060 579638138 575343170
3827.6E75343170M76418K140388K990723J573372q445130K183724P645340n143662
$$ 575343170 575819588 577959976 580950699 582524071 574078941 576262665 583908005 578764343
3835.3E78764343j670418O816254p120590l822823P371598m349900j038398N978317
$$ 578764343 577093925 583910179 576789589 572966766 580338364 575988464 574950066 580928383
3843E80928383j922493l371391K555084R25560n24140J749382j021804J862907O191902
$$ 580928383 579005890 575634499 578189583 579115143 578591003 580340385 579318581 581181488 587373390
3851.7E87373390m614105K587204j2358284k448082Q308983m6082n00793K027397J436844
$$ 587373390 582759285 585346489 572988205 570540123 578849106 578803024 578302231 580329628 581766472
3860.4E81766472J738129m612923N607O097565n140533n639801L108749M899101O591187
$$ 581766472 583504601 578891678 578897285 584994850 579854317 574214516 577323265 582222366 588813553
3869.1E88813553p320480r124070L266564N527954L550377r740067L94631M451103
$$ 588813553 581493073 572369003 575635567 581163521 584713898 574973831 575368462 579819565
3876.8E79819565J35498J789245M276581m161262o644936N503464R06639J279144M933052
$$ 579819565 579955063 581744308 586020889 581859627 575214691 580718155 581624794 582903938 587836990
3885.4E87836990j2607574N722M156647J742248M192467o98013p062722P35588K479821
$$ 587836990 575229416 575235138 579391785 581134033 585326500 584628487 577565765 578301353 580781174
3894.1E80781174j693650Q61473P06025J926613J637878q499031N057983K778015m646110
$$ 580781174 579087524 579948997 580655022 582581635 584219513 575720482 580778465 583556480 578910370
3902.8E78910370L046913m535027j018219J482621O84433J837310k29682K83355k73895
$$ 578910370 581957283 577422256 576404037 577886658 578571091 580408401 580178719 580462074 580188179
3911.5E80188179j60828N25437K35290J510506J461067l910599l306846M493789O37208
$$ 580188179 580027351 580552788 580788078 582298584 583759651 579849052 576542206 581035995 581673203
3920.2E81673203l975335J564408J448211N86205j995735k177773J762428J142045
$$ 581673203 577697868 579262276 580710487 581296692 579300957 577123184 578885612 580027657
3927.9E80027657O96601q28323M44450K067528l070106j832352J378899O16378L84140
$$ 580027657 580724258 579895935 580340385 582407913 579337807 577505455 578884354 579500732 579884872
3936.6E79884872J50643l70674k52457k94266Q67005J184883l424797q76389J749230
$$ 579884872 580035515 579664841 579412384 579118118 579985123 581170006 577745209 576868820 578618050
3945.2E78618050J106987J207618k526741P29599J433068k547455J097946O8665j011582
$$ 578618050 579725037 580932655 578405914 579135513 580568581 578021126 579119072 579187737 578176155
3953.9E78176155O77834N29518K16331n32112j63879p92198K82135R84802r78012j03798
$$ 578176155 578853989 579383507 579599838 579067726 578903847 578111649 578393784 579378586 578400574 578296776
3963.6E78296776L07083j47209O70814P26281K56309r97696j458511J144714J396561
$$ 578296776 578603859 578456650 579127464 579853745 580110054 579112358 577653847 578798561 580195122
3972.2E80195122j027413r50660J28898q4190n99175L28064K54059k82097J9875j64757
$$ 580195122 579167709 578217049 578345947 578261757 577662582 577990646 578244705 577962608 577982483 577817726
3981.9E77817726m9591K62604P49206j13563n47409k67830o19393P9499J56975M19
$$ 577817726 577768135 578030739 578779945 578666382 578118973 577851143 577231750 577311249 577468224 577468643
3991.5E77468643k1400P15828P75261n29137k20184L96423N61409l37715n47867
$$ 577468643 577447243 578163071 578938332 578409195 578189011 578585434 579146843 578809128 578261261
4000.2E78261261
$$ 578261261
##END=$$ End of the data block
