##TITLE=$$ Begin of the data block
##JCAMP-DX=5.00 $$ ACD/SpecManager v 10.08
##SPECTROMETER/DATA SYSTEM=Varian
##DATE=04 Dec 2012 14:00:48
##DATA TYPE=INFRARED SPECTRUM
##DATA CLASS=XYDATA
##ORIGIN=
##OWNER=
##NPOINTS=3735
##FIRSTX=399.26403809
##LASTX=4000.35498047
##MAXX=4000.35498047
##MINX=399.26403809
##MAXY=70.14274597
##MINY=29.14103317
##XFACTOR=1.0000000000
##YFACTOR=0.000000100000000
##FIRSTY=53.89631271
##DELTAX=0.96440572
##XUNITS=1/CM
##YUNITS=TRANSMITTANCE
##XYDATA=(X++(Y..Y))
399.3E38963127m275322l313713Q857346k257614j2487832k961540o91948J5375710
407E37208214Q760261j1168251m412613j005821L85857M913177M296570p97119n83534
415.7E37596741l56827q258133j0659828N755577N230522P12814l618354l32337J536522
424.3E27606697l518677K229996J682358k63634O480713q12607p102051k64358R50127
433E26988564k00921J730919O79055m158020L93600J548996J040344M427681l884277
441.7E28565941l142128M318733j237526j614075p78389K939949K527695k577934o3438
450.4E28938828J562500J4457J111145K770958p30858o238289n415420j605454L788262
459.1E24196129N009193M911423K172279o94694J747894p24525q102837q869362l497886
$$ plain form
399.3 538963127 534687805 531374092 540231438 537973824 525485992 522524452 521832504 537208214
407 537208214 545968475 534800224 530387611 529381790 529767647 534680824 538977394 538180275 537596741
415.7 537596741 537239914 528981781 518321953 524077530 529308052 530020866 526402512 526070175 527606697
424.3 527606697 524088020 526318016 528000374 527736740 534217453 533404846 526302795 526038437 526988564
433 526988564 526787643 528518562 529197617 525039597 525433197 526982193 528022537 532450218 528565941
441.7 528565941 525423813 529742546 528505020 526890945 526112556 529052505 531580200 529002266 528938828
450.4 528938828 530501328 530515785 531626930 534397888 533667030 527428741 522013321 520407867 524196129
459.1 524196129 529205322 534116745 536289024 535594330 537342224 536617699 528514862 519645500 516147614
467.7E16147614M351806L502007j65825n474587k150306R885978J862297n090751j0420838
476.4E12447395l822670N022736L752441N624199j295852n629921K5444J653099J256675
485.1E19033546j407012p78084k002411k936402m43344j016540o62995M48876L425941
493.8E13661575J602021m17748J690941k76604k379188l807869j114731j224060o182442
502.5E01551895o50635K909279J137619j661110j94626R4567j684036j397477l359718
511.1D96745758k691994j036644l6964J035232K70310j52016P95403L24058k615623
519.8D92637520l61748j460571m843407j163406q95844k411346J448898L216744O94503
528.5D86861343O57769Q25843j153373k00920Q42247j109467j951179N19714K590027
$$ plain form
467.7 516147614 520499420 524001427 523835602 518361015 516210709 526096687 527958984 522868233 512447395
476.4 512447395 508624725 513647461 517399902 523024101 521728249 516098328 516123772 517776871 519033546
485.1 519033546 517626534 516848450 514846039 511909637 511466293 510449753 509786758 510235634 513661575
493.8 513661575 515263596 514845848 516536789 516260185 513880997 510073128 508958397 507734337 501551895
502.5 501551895 500901260 503810539 504948158 503287048 503092422 503186989 501502953 500105476 496745758
511.1 496745758 494053764 493017120 492980156 494015388 494285698 494133682 494929085 495253143 492637520
519.8 492637520 492275772 490815201 485971794 484808388 483912544 481501198 482950096 486166840 486861343
528.5 486861343 487519112 488344955 487191582 486990662 487832909 486723442 484772263 485291977 487882004
537.2D87882004L092613K828255L381157K937584K66342j657830k737083j5755P7k041626
546.8D93935738M27970J708375K623291m05846r33685K357521L67660j085777j324463
555.5D97670784k215004l218765j891785N33333O36864J654586J267090J248780O7977
564.2D95753860l353843l633347m531593m508515j968536j006698j325722n5733N4054
572.9D75423927P66335J914749P49359J77536p16514k51618o61430j649094o0348J445541
582.5D77138443K250099K678261M441071L921623K347107P84301o30989l96423o02417
591.2D91931076j263199j462593K68555K128563K605133K844963K259903L46222j352730
599.9D98305893q11234k200698l092347q2206J078987l80440Q4305K676773L215904
$$ plain form
537.2 487882004 490974617 493802872 497184029 500121613 500387955 498730125 495993042 495977287 495977364 493935738
546.8 493935738 494363708 496072083 498695374 498289528 497355843 499713364 500081024 498995247 497670784
555.5 497670784 495455780 492237015 490345230 490878563 491515427 493170013 494437103 495685883 495753860
564.2 495753860 492400017 488766670 484235077 479726562 477758026 476751328 475425606 475369873 475423927
572.9 475423927 476190262 478105011 478854370 479031906 478315392 478063774 477402344 475753250 475692902 477138443
582.5 477138443 479388542 482066803 486507874 490429497 492776604 493560905 492929916 492533493 491931076
591.2 491931076 490667877 489205284 489473839 491602402 494207535 497052498 499312401 499658623 498305893
599.9 498305893 497494659 495293961 492201614 492119408 493198395 492817955 492902260 495579033 498794937
608.5D98794937K106972o17561j365967p57942k300797r21707l40157k19421K494240
617.2D96872597L302231L396377L727112K608681J326217R38340n50576r76066r77364
625.9E09667549M60282K432365J818542K764702K164002J585464K455483J081772L94325
634.6E24824486j346588k204514q21991J01204J04027R11674M146080L639412J904373
643.3E31258163J547051l03879j550331k200737j553497j145859l55187J228409P64199
651.9E27688332K653160M054413J702041j59187o24924k37732j798172k676773j279526
660.6E29321632N4512J122399J498794J989327J832199J797180K297249j292114j471215
669.3E37149963k159500k209472l00446k54555O11992J494446K444725K865410J149254
$$ plain form
608.5 498794937 500901909 500284348 498918381 498160439 495859642 494937935 494597778 494378357 496872597
617.2 496872597 500174828 503571205 507298317 509906998 511233215 512171555 511620979 510644913 509667549
625.9 509667549 510127831 512560196 514378738 517143440 519307442 520892906 523348389 524430161 524824486
634.6 524824486 523477898 521273384 520451393 520552597 520656624 521568298 525714378 529353790 531258163
643.3 531258163 532805214 532501335 530951004 528750267 527196770 526050911 525695724 526924133 527688332
651.9 527688332 530341492 534395905 536097946 535938759 535313835 535076103 533277931 530601158 529321632
660.6 529321632 529376144 530498543 531997337 533986664 535818863 537616043 539913292 538621178 537149963
669.3 537149963 534990463 532780991 532480545 532225990 532837982 534332428 536777153 539642563 540791817
678E40791817M74968N37109o80046j660423k226219k200242q3007J532821J699219
686.7E38185997K966537L089219P22427q30421r71718j197014j975403k453346j111603
695.3E36424675J67770K18315k60467L52745K057648J057625j533127k060089j312180
704E35112915k173271k979889j245155J64566R78164J010819P19871K017823K461738
712.7E36067581J681061r3346j318206o53306n51643j038818J98326K324524K229652
721.4E38845825K492447L625794K756881J632653J106567Q64334O828L38250J819801
730.1E53489380J302986J233521L366928M226303L068161J877517O43120J99127j57012
738.7E69250031o68374n45997N64689J165429O08368J266021J598358J643525o1760
$$ plain form
678 540791817 541266785 541803894 541123848 539463425 537237206 535036964 534953957 536486778 538185997
686.7 538185997 541152534 544241753 544964180 544133759 543162041 541965027 539989624 537536278 536424675
695.3 536424675 536592445 536810760 536550293 536903038 538960686 540018311 538485184 536425095 535112915
704 535112915 532939644 529959755 528714600 528879166 529857330 530868149 531588020 533605843 536067581
712.7 536067581 537748642 537655296 536337090 535683784 535132141 534093323 534291649 536616173 538845825
721.4 538845825 541338272 544964066 547720947 549353600 550460167 551324501 551331329 551669579 553489380
730.1 553489380 554792366 556025887 559392815 563619118 566687279 568564796 569207916 569407043 569250031
738.7 569250031 568581657 568035660 568600349 569765778 570374146 571640167 573238525 574882050 574820290
747.4E74820290j886292j181030k106400k123260j939354j921120J28479P70531M31251
756.1E64993095N18723j2474j347618j576538j179161j105004n72471k18048J9645
764.8E59520149O87599J503525J080971J427078K729874K432861J867829O62918J94778
773.5E72107582O95038R02977J703720L061676L536377K370949J976433K044830K740250
782.1E91139832J963539m97818m46778J94702R06716J715546J512832N60837J098556
790.8E98147964K106171R27353L47328P88803R73626M32853O04248Q71773J073341
799.5F06273460K334786K436104J382103N39550J037980R51194Q46863Q38127M75159
808.2F17115326N34477M50668J532593M95758P01027J264229L77007J107330l62434
$$ plain form
747.4 574820290 572933998 571752968 569646568 567523308 565583954 563662834 563791313 564561844 564993095
756.1 564993095 565511818 565499344 564151726 562575188 561396027 560291023 559718552 559500504 559520149
764.8 559520149 560207748 561711273 562792244 564219322 566949196 569382057 571249886 571912804 572107582
773.5 572107582 572802620 573705597 575409317 578470993 582007370 584378319 586354752 588399582 591139832
782.1 591139832 593103371 592605553 592158775 592353477 593260193 594975739 596488571 597049408 598147964
790.8 598147964 600254135 601181488 601528816 602317619 603291245 603724098 604328346 605200119 606273460
799.5 606273460 608608246 611044350 612426453 612966003 614003983 614955177 615802040 616640167 617115326
808.2 617115326 617649803 618100471 619633064 620128822 620829849 622094078 622471085 623578415 623215981
816.9F23215981n36499n7831M68368k00729j405678l44772r86710m0703K76871l51410
826.5F20036888j254120k207832j643181j622009j04866j334419k291718j577797j696091
835.2F06304855k56958o07147j549187j967773j273422r14421j279068o99425j100159
843.9E96657295r68170m99039r01413j502761j19248L51792j253701p69348m99077
852.5E90496330o73675r9068R07364M64058r66950n82389j72768j1520J57394P87811
862.2E90306587J335449J423531J787415K396431K662773J830749K597428L293762
869.9F07634125K097740J411209K344780K094574J360817K438011J092453J333466
877.6F21807175K005043O62613k30980j143608o31180j739159k084846k107354j710319
$$ plain form
816.9 623215981 622679482 622621651 623090019 622889290 621483612 621138840 620152130 620111427 620388298 620036888
826.5 620036888 618782768 616574936 614931755 613309746 613204880 611870461 609578743 608000946 606304855
835.2 606304855 606047897 605440750 603891563 601923790 600650368 599735947 598456879 597757454 596657295
843.9 596657295 595689125 595190086 594288673 592785912 592666664 593018456 591764755 590995407 590496330
852.5 590496330 589822655 589723587 590630951 591095009 590128059 589545670 589372902 589361382 589518776 590306587
862.2 590306587 591642036 593065567 594852982 597249413 599912186 601742935 604340363 607634125
869.9 607634125 609731865 611143074 613487854 615582428 616943245 619381256 620473709 621807175
877.6 621807175 623812218 624474831 624243851 623100243 622469063 620729904 618645058 616537704 614827385
886.3F14827385m08783m47884n43441j965905j501693j860009k234916j846924l266487
895F00751343j979866j281586r62868o89811p42226K1057p27119j007309k331429l438072
904.6E87612114k804794k486420k063828k246017k230568j417122j437454j438828
912.3E71487083j384697k699317l063012k954597l419304l012810l008079k837029
920E49108238k107467j465264m99038k38495r0752j12495j096154j137352j219520
928.7E41141701j821022n62821N06859O48193J902962K163887R20677J97678O71463
937.4E45769577J471100N80978k06794j68686k68860N45997J760865J807670J224404
946.1E52516251J436691R24225n24369k186241l678436l310242k234115k392388k918625
$$ plain form
886.3 614827385 614418602 613970718 613427277 611461372 609959679 608099670 605864754 604017830 600751343
895 600751343 598771477 597489891 596527023 595837212 595094986 595116043 594388924 593381615 591050186 587612114
904.6 587612114 584807320 582320900 580257072 578011055 575780487 574363365 572925911 571487083
912.3 571487083 570102386 567403069 564340057 561385460 557966156 554953346 551945267 549108238
920 549108238 547000771 545535507 545036469 544797974 544707222 544594727 543498573 542361221 541141701
928.7 541141701 539320679 538757858 539264717 539912910 541815872 543979759 544900436 545098114 545769577
937.4 545769577 547240677 547821655 547614861 547446175 547177315 547723312 549484177 551291847 552516251
946.1 552516251 553952942 554877167 554352798 552166557 548488121 545177879 542943764 540551376 537632751
954.8E37632751k513389j463852j808357l020478l428649l298607l649063m984704
962.5E13465652n818252o122704n146408m102516m318504m178887m606514m853096
970.2D74318771n901031o537590o455193o941642p160950p582970o885071p202415
977.9D19651909o752854n767555n174026m792595n723496n858268o571007n520783
985.6C73491325m916381m195214l202934l496590k741203k604027j034851j005897
993.3C50294228r76258j237983j421395o92291j501808m97208r03778O1417K92930
1002C43417854L48969J501732K16903M18129o21071r72480j745186j731224j056824
1010.7C39776802j583137j074524k234154j028023o28738K17437K66343j005516o6147
$$ plain form
954.8 537632751 535119362 533655510 531847153 528826675 525398026 522099419 518450356 513465652
962.5 513465652 507647400 501524696 496378288 492275772 487957268 483778381 479171867 474318771
970.2 474318771 468417740 461880150 455424957 448483315 441322365 433739395 426854324 419651909
977.9 419651909 412899055 407131500 401957474 397164879 391441383 385583115 379012108 373491325
985.6 373491325 368574944 364379730 361176796 357680206 354939003 352334976 351300125 350294228
993.3 350294228 349317970 348079987 346658592 345966301 344464493 343967285 343063507 343124924 343417854
1002 343417854 343766823 345268555 345485458 345903587 345282516 344310036 342564850 340833626 339776802
1010.7 339776802 338193665 337119141 334884987 333856964 333228226 333445663 333712006 332706490 332640343
1019.4C32640343j337433j296387j325226j23558m7531L63999J410980L8223J936073
1028.1C32259483J303940O87065l20968l50876O60591r54323L4256J32179J065293
1036.7C34516640j33858n14221J281967J103516L75938j347923k4109p78008m30946
1045.4C34048996j72310m72183R38911J52054K371407J820945J251755J074028J020050
1054.1C42033653J875992N79681J264267J091385K524681K587624L394928M480400
1061.8C59832611L266335L577499L048859L786354K103233J255493k6130j549073p91893
1070.5C74503288k576675k069016k467918k372398k613526k697677j359826k300033
1078.2C56046219j645889k082940k99568J43624P22656K048416J124229K452279K688293
$$ plain form
1019.4 332640343 331302910 330006523 328681297 328557739 328510208 328874207 330285187 330323410 332259483
1028.1 332259483 333563423 334250488 333929520 333578644 334239235 333284912 333319168 333451347 334516640
1036.7 334516640 334382782 333868561 335150528 336254044 336629982 335282059 335257950 334479942 334048996
1045.4 334048996 333876686 333404503 334343414 334495468 336866875 338687820 339939575 341013603 342033653
1054.1 342033653 343909645 344489326 345753593 346844978 349369659 351957283 355352211 359832611
1061.8 359832611 363098946 366676445 369725304 373511658 375614891 376870384 376844254 375295181 374503288
1070.5 374503288 371926613 369857597 367389679 365017281 362403755 359706078 358346252 356046219
1078.2 356046219 354400330 352317390 352017822 352161446 352884102 354932518 356056747 358509026 361197319
1086.9C61197319L100929J655350J949120J123771N91889K487373J021957K738991
1094.6C75866699J987267P16934R78394J599044K131157j0986N76286n8441l43399
1103.3C83442955n77049M25148J667022O99883K255745K080879K058258J419029J372490
1112C94844360Q37860o05659L88412J25847O33011O44341J619568J930885J805000
1120.6D02223625J751862M49905J269608O55136J099129N57823M46624R12743M6158
1129.3D09412613K011108J816330J656189R17282J78795k41241j132546q48274k416573
1138D11353683k227973k612076k067299q39348j047287j108017k336006j530533k449341
1146.7C95135803k300720k063751k644081j989098k428627j234589j700630p39975
$$ plain form
1086.9 361197319 364298248 365953598 367902718 369026489 369618378 372105751 373127708 375866699
1094.6 375866699 377853966 378570900 379549294 381148338 383279495 383268509 383844795 383786354 383442955
1103.3 383442955 382865906 383291054 384958076 385657959 387913704 389994583 392052841 393471870 394844360
1112 394844360 395682220 395076561 395464973 395590820 396223831 396868172 398487740 400418625 402223625
1120.6 402223625 403975487 404425392 405695000 406350136 407449265 408007088 408453712 409366455 409412613
1129.3 409412613 411423721 413240051 414896240 415813522 415992317 415751076 414618530 413770256 411353683
1138 411353683 409125710 406513634 404446335 403606987 402559700 401451683 399115677 397585144 395135803
1146.7 395135803 392835083 390771332 388127251 386138153 383709526 382474937 380774307 380034332
1154.4C80034332k98385J88713L23486j112862Q79631P43599Q25196L98330J335411
1163.1C83317451K334176K390709M279060L444481M573326M580078M239349M361077
1170.8D13519707M268913M797821L663025L990898L850212N111008N375938M510346
1178.5D49087868N230636M771805M623528M129219L513527K772102K438316K620850
1186.2D79187851K764854K730446K469635K980767K808761K518158J690674Q98056
1193.9D98049202O26640K83280N35049J06354J86729O01998M41513P20100J447144
1202.6E02998009J867599J383438M62952l47710J0414J5259N1232N68618O04744J111908
1212.3E08726463J464577K232094J946373J083031P76138N1460k72446n49125m24538
$$ plain form
1154.4 380034332 379735947 379924660 380248146 379135284 380014915 380758514 381583710 381982040 383317451
1163.1 383317451 385651627 388042336 392321396 395765877 400339203 404919281 409158630 413519707
1170.8 413519707 417788620 422586441 426249466 430240364 434090576 439201584 444577522 449087868
1178.5 449087868 454318504 459090309 463713837 467843056 471356583 474128685 476567001 479187851
1186.2 479187851 481952705 484683151 487152786 490133553 492942314 495460472 497151146 498049202
1193.9 498049202 498675842 498959122 499494171 499600525 499787254 500389252 500830765 501550865 502998009
1202.6 502998009 504865608 506249046 506711998 506364288 506374702 506389961 506441193 507009811 507614555 508726463
1212.3 508726463 510191040 512423134 514369507 515452538 516228676 516280136 516007690 515458565 515034027
1220.9E15034027m92592m72145M730l28598l75328L9521L7765p18231j161080j531257
1230.6E10036812j755257j442146j752129j368789l39508N17044M62074M10080O03981
1239.3E05372162M6387q6289o32133m12560r1209m15917m8141O62384J657867K058449
1248.9E08111000K413826J685829J109467J100769L59001k00920n96199k10228N93948
1257.6E14366493J462898J289292J143341J807365J703568J392860N76821L96385k88277
1266.3E23850746o13022L05252L31116R85260J488800J712990J595764J147957J196365
1274.9E32001228O51818k1248n11131o29387k78893K0218M42810J011543J517716J694793
1284.6E35899467J388474P81021M39491q0833n36270q03604p47185l57895N0354P44476
$$ plain form
1220.9 515034027 514541435 514069290 514074020 513745422 513370094 513409615 513447380 512729149 511568069 510036812
1230.6 510036812 508281555 506839409 505087280 503718491 503378983 503896027 504358101 504768181 505372162
1239.3 505372162 505418549 505332260 504700127 504287567 504196358 503780441 503732300 504394684 506052551 508111000
1248.9 508111000 510524826 512210655 513320122 514420891 514779892 514578972 513982773 513772545 514366493
1257.6 514366493 515829391 517118683 518262024 520069389 521772957 523165817 523742638 524139023 523850746
1266.3 523850746 523237724 523542976 523874092 524859352 526348152 528061142 529656906 530804863 532001228
1274.9 532001228 532653046 532631798 532120667 531491280 531212387 531232605 531675415 532686958 534204674 535899467
1284.6 535899467 537287941 538068962 538508453 538427620 537891350 537087746 536340561 535982666 536033020 536777496
1294.2E36777496Q53501N19256N03846K62565m46014q23021r16481j465798j353683
1302.9E33911667n56603p2097Q40492J221924P72285O49109K73552o93474j146812
1311.6E35200043j113625j301460j486664q86421j34239K32238N79682R52110Q27637
1320.3E32869301p0496r23271j259155j560974j640358j376343r14917l81050j831
1328.9E24740906L89404J54076j49193n24178j120681j125679j015664j272964j693649
1337.6E18382378j272965o58073K99606J867333J451606P33834M74472J46942q30269
1346.3E20594864j313667q33893n80864k77939j35574L9367Q8845N96466Q78029k05307
1355.9E18850327p48673j142006j180153j075058j529655j042099m18472l96271M9209
$$ plain form
1294.2 536777496 537630997 538150253 538654099 538916664 538470650 537647629 536731148 535265350 533911667
1302.9 533911667 533355064 533282967 534123459 535345383 536117668 536766777 537040329 536346855 535200043
1311.6 535200043 534086418 532784958 531298294 530411873 530277634 530509872 531089554 532041664 532869301
1320.3 532869301 532798805 531875534 530616379 529055405 527415047 526038704 525123787 524742737 524740906
1328.9 524740906 525130310 525284386 525135193 524611015 523490334 522364655 521348991 520076027 518382378
1337.6 518382378 517109413 516451340 516750946 518618279 520069885 520803719 521278191 521425133 520594864
1346.3 520594864 519281197 518447304 517866440 517588501 517452927 517492294 517581139 518177605 519055634 518850327
1355.9 518850327 518101654 516959648 515779495 514704437 513174782 512132683 511714211 511317940 511367149
1364.6E11367149M83857N8670m502n44586j170425p58095j175003n33180o81229j091919
1374.3E05950737j29204L43361N90286K42615Q90007O26907K47078J50223K2316L54614
1383.9E09288940M07410J697311J928330J621284K105256K020874J033325J51825P8392
1392.6E20332947o8627j235466j995773J31645N37567Q3733m28085Q53424J266708
1401.3E19478073k87857j96037k28653j272774n14183L3951L1280j99813N187L5668
1410.9E16884842o9122l95470k57797p62940j530456p54891r3460j5297k159500J229019
1420.6E12074928K443810J102600Q19282K43340Q93936M91104l82728n1995r39483
1429.2E16694794j332283n303O62842j88179K28462P42798k82783k794419p51762J347732
$$ plain form
1364.6 511367149 511851006 511909676 511905174 511360588 510190163 509432068 508257065 507723885 507042656 505950737
1374.3 505950737 505821533 506164894 506755180 506997795 507887802 508514709 508761787 508912010 508934326 509288940
1383.9 509288940 509696350 511393661 513321991 514943275 517048531 519069405 520102730 520254555 520332947
1392.6 520332947 520264320 519028854 517033081 517164726 517702293 517786026 517357941 518211365 519478073
1401.3 519478073 519190216 518994179 518765526 517492752 516978569 517012520 517043800 516843987 516849174 516884842
1410.9 516884842 516815720 516420250 516162453 515399513 513869057 513114166 513020706 513005409 510845909 512074928
1420.6 512074928 514518738 515621338 516440620 516683960 517577896 518069000 517686272 517634277 516694794
1429.2 516694794 515362511 515357208 516020050 515831871 516060333 516803131 516520348 513725929 512974167 514321899
1438.9E14321899l13835o37397l78685m38004L18527j24893L97873r8915n78842j715775
1448.5E10751953n14068l21274j891289j577683j969184m89350j137581r52720k750359
1457.2D99148445k836685L887253N65490J787720J71852O40869J475296j863594J302109
1465.9E04278755J513863M463196M788475P203865P410736N129623O634979L982888
1473.6E45406380P120704M059754L954963M590683L965111L934326K443238K628555
1481.3E78103714J459122K174415J633492J269150J442489n06477J080170J782951
1489E88439026J65100j030388J959114J746254k2316K57301j088256l111687J443825
1497.7E88757973P1373j609040O74668k3194o14967K00882K57950n989n017662p990532
$$ plain form
1438.9 514321899 514008064 513370667 512991982 512553978 512872505 512747612 513145485 513046570 512467728 510751953
1448.5 510751953 510237885 509916611 508025322 506447639 504478455 503989105 502851524 501898804 499148445
1457.2 499148445 496311760 500199013 500764503 502552223 502724075 503364944 504840240 502976646 504278755
1465.9 504278755 505792618 510255814 515044289 522248154 529658890 534788513 541423492 545406380
1473.6 545406380 552527084 556586838 560541801 565132484 569097595 573031921 575475159 578103714
1481.3 578103714 579562836 581737251 583370743 584639893 586082382 585575905 586656075 588439026
1489 588439026 588604126 587573738 589532852 591279106 591256790 591514091 590425835 587314148 588757973
1497.7 588757973 588829346 587220306 587894974 587871780 587256813 587457695 587715645 587709656 582691994 574701462
1507.3E74701462J42746R91440J48849Q56247j000404k152481M36172r21364j805229
1516E71397438k813301k744560K551231J842156k144852l774986J079063K974396J552315
1524.7E69918900j522408p17049k22206k174530l60832O40488k16980N4435j763229
1533.4E63636589k370338J681251R21631P45277J158791k891083o964988J867370l8681
1542.1E57745819K01798K386589P15828O7215J858329J760025J105385o40983r74274
1550.7E64225731J938362J707954J031228p6676J744652M411201L325806l083992l694687
1559.4E71529579K459335N462456K596588J705399L01933r46197J284485K768058L051377
1568.1E90213013O05659k103615K460213K249069K20337K71721O96144j767006m058265
$$ plain form
1507.3 574701462 574844208 575835648 575984497 576840744 575840340 573687859 574124031 573202667 571397438
1516 571397438 568584137 565839577 568390808 570232964 568088112 564313126 565392189 568366585 569918900
1524.7 569918900 568396492 567679443 567457237 565282707 564921875 565562363 565345383 565399818 563636589
1533.4 563636589 561266251 562947502 563869133 564614410 565773201 562882118 555917130 557784500 557745819
1542.1 557745819 557947617 560334206 561050034 561117249 562975578 564735603 565840988 565200005 564225731
1550.7 564225731 566164093 567872047 568903275 568826599 570571251 574982452 578308258 575224266 571529579
1559.4 571529579 573988914 579451370 582047958 583753357 584055290 583109093 584393578 587161636 590213013
1568.1 590213013 590818672 588715057 591175270 593424339 593644676 593916397 594612541 592845535 588787270
1576.8E88787270K899932K702752R79919R21478J46981n00184m73937p74384j178131
1585.5E93511696j731110r13009o43464k29835m52042m39186m72183p03468q66394
1594.1E87061005k092171j963615k536202j834183j868362j675339j175041j639977
1601.9E72276115r81750j554298q34618j676064l055572l635445l171158l166046l775749
1610.5E50425415j795158k147026j449967j987648j346969k478486j0041847l30734
1618.2E28847580k098122l058014l410835k027626l371124o058502n10331j593704
1626E06719322j175575m469109l305931j972351l300094k863388l751946r80263k245254
1634.6D82655411o215706k231712P40585K98004r51996p9765k024574n50652j964951
$$ plain form
1576.8 588787270 591687202 594389954 595369873 596291351 596438332 595938148 595464211 594689827 593511696
1585.5 593511696 591780586 590867577 590224113 589994278 589542236 589103050 588630867 587927399 587061005
1594.1 587061005 584968834 583005219 580469017 578634834 576766472 575091133 573916092 572276115
1601.9 572276115 571294365 569740067 568905449 567229385 564173813 560538368 557367210 554201164 550425415
1610.5 550425415 548630257 546483231 545033264 543045616 541698647 539220161 529178314 528847580
1618.2 528847580 526749458 523691444 520280609 518252983 514881859 508823357 508313026 506719322
1626 506719322 505543747 501074638 497768707 495796356 492496262 489632874 485880928 484900665 482655411
1634.6 482655411 476439705 474207993 474948578 475246582 474294586 474214821 472190247 471639595 469674644
1643.3D69674644m47387K09923l658257l84674j143150K637329P52487K153511K272797
1652D72067223m883576n907440O14166M622002J504249J551476J432075K151757K530746
1660.7D75682678J649971K407456J08871K664261J742592J596451J624107J307297
1668.4D88783684J524315Q73069M466477K701263L508644L507309J067772M58718K634658
1677.1E09525909L330193J647339J913757J448364L614693M447289J153602M22745
1684.8E27503891L329124N340805K815743J560593K338218J616326K543144K694664
1692.5E49742508L568420L603669K747421K93007M647445N035096M103584l72505m771462
1701.2E68597183N578156L929786K500992J031571R38224J471100K613449K890511
$$ plain form
1643.3 469674644 469227257 469437180 465778923 465394249 464251099 466888428 467640915 469794426 472067223
1652 472067223 467183647 461276207 461890373 466512375 468016624 469568100 471000175 473151932 475682678
1660.7 475682678 477332649 479740105 479848976 482513237 484255829 485852280 487476387 488783684
1668.4 488783684 490307999 491181068 495647545 498348808 501857452 505364761 506432533 506891251 509525909
1677.1 509525909 512856102 514503441 516417198 517865562 521480255 525927544 527081146 527503891
1684.8 527503891 530833015 536173820 538989563 540550156 542888374 544504700 547047844 549742508
1692.5 549742508 553310928 556914597 559662018 559955025 564602470 569637566 573741150 573368645 568597183
1701.2 568597183 574175339 578105125 580606117 581637688 582575912 584047012 586660461 589550972
1708.9E89550972P78732m05502L88336O47469J93901r61075P89185K644195L64151
1717.6E93990364l289528M100800L167343J107368j28631j489449j768570o80961r21402
1726.3E94087334j707955q04710p99408l920746l237266l51601j178856q985672j4043694
1734.9E59057426j536750l063279n207748m066315p490806q674507k213974k843781
1742.7E23960266o189804j753426k88009N42984J076851K899322O565056N916367J0217819
1751.3E42947426R810028J0811424J0549584J0221672J0272140Q590698R774399P346230
1759F20323601P062111N952949M229126N686684N426407N011062L602372L453826J950760
1767.7F62698898K84577K606277K407913L81165j899567J001816L525391K049331R67789
$$ plain form
1708.9 589550972 590329704 589924202 590312538 590960007 591153908 590192833 590982018 593626213 593990364
1717.6 593990364 590700836 594801636 597968979 599076347 598947716 597458267 595689697 595008736 594087334
1726.3 594087334 592379379 591574669 590775261 586854515 583617249 583265648 582086792 573101120 559057426
1734.9 559057426 557520676 554457397 549249649 545183334 537692528 529018021 526804047 523960266
1742.7 523960266 517770462 516017036 515729027 516272011 517348862 520248184 526813240 532729607 542947426
1751.3 542947426 552757454 563568878 574118462 584340134 594612274 603202972 612977371 620323601
1759 620323601 627385712 633338661 637567787 643254471 648680878 653691940 657294312 660748138 662698898
1767.7 662698898 662983475 665589752 667997665 668378830 666479263 667481079 671006470 673055801 674023590
1776.4F74023590K502136J528626O88782L47366r74426M35943Q18100O69708l3950
1785.1F80005875Q17947K173386J002731P81097R69544L2043L85208j975708r36431
1793.8F83255692J813964J92948j65634J680069J804733L77655O485J241989n63507
1802.4F89644394j17264R16214l00827r766R1095Q8883J028366P92923k95868Q70361
1812.1F92708511J055527K10114K43301k15683R9640k88391j17874N00946K70996R09424
1821.7F95376511O35528R41162J76773k600784K41776J716308Q16879j332931k873535
1830.4F93097687J429825K083816N87311M95453M73556p9040n03159j50146M02145
1839.1F97837448k44751Q927J17340J028595l12119l694076K297897K168732l93067
$$ plain form
1776.4 674023590 676525726 678054352 678743134 679090500 678116074 678552017 679370117 680039825 680005875
1785.1 680005875 680823822 682997208 683999939 684781036 685750580 685782623 686167831 684192123 683255692
1793.8 683255692 685069656 685262604 685096970 686777039 688581772 688959427 688965912 690207901 689644394
1802.4 689644394 689527130 690443344 690142517 690132751 690223846 690312729 691341095 692134018 691838150 692708511
1812.1 692708511 693764038 693974152 694217453 694001770 694101410 693813019 693695145 694196091 694467087 695376511
1821.7 695376511 696012039 696953201 697129974 694529190 694770966 696487274 697304153 695971222 693097687
1830.4 693097687 694527512 696611328 697198639 697694092 698167648 698088608 697585449 697435303 697837448
1839.1 697837448 697592697 697601624 697718964 698747559 698435440 694741364 697039261 699207993 698814926
1847.8F98814926o15921O96869O27594n57938k25906j49307L87573J51901j87759O67572
1857.4F99609604L84750J29090q0414m1733l89862l97415j12305J64871M05045k88162
1867.1F99383469J56479r59244o22177J207580R20181N45807j74255q2855j67084N9662
1876.7G00267563j51978l45535N05753J33514K0981j18561J70670r7046m82636O21796
1886.3G00524521L92761M7073o49261j030655O70700P90024K1515J67236O3248k63062
1896G00734100K07062j67541J07193L10440K3574j59988n96771q3695J11924O16607
1905.6G01102905L24555n06287M9286k8534m62799l4790L09296l75824p5837J14823
1915.3G00416794K23694N00641j845627k67487J399155M15268N6076r77249m06876
$$ plain form
1847.8 698814926 698199005 698895874 699523468 698965530 698739624 698590317 698977890 699129791 698942032 699609604
1857.4 699609604 699994354 700123444 700043030 700001297 699611435 699214020 699101715 699266586 699671631 699383469
1867.1 699383469 699539948 698580704 697958527 699166107 700086288 700632095 700457840 700374985 700207901 700267563
1876.7 700267563 700115585 699770050 700275803 700409317 700430298 700311737 700482407 700385361 699902725 700524521
1886.3 700524521 700917282 700964355 700315094 699284439 699955139 700745163 700766678 700933914 700997162 700734100
1896 700734100 700941162 700773621 700880814 701191254 701214828 701054840 700458069 700374374 700486298 701102905
1905.6 701102905 701427460 700921173 700970459 700941925 700479126 700444336 700753632 700377808 700301971 700416794
1915.3 700416794 700640488 701141129 699295502 699028015 700427170 700842438 700898514 699921265 699514389
1923.9F99514389O52237K41547k50092j39618P706o5155J67084K88848O0578j52359
1933.6G00325165Q2702j30386l34549k41089J221R4070p8506L69186p61184j043854
1943.2F98282776P67822M26254j78756m19998j56937J96152R0332o714J94473K26746
1952.9F99422150L3188O0272j70136p0038J374Q7890m9896l50113N1727J5030n9127
1963.5F98972321r7352N0431K97088k13928k56653M37317K27509o35071k68707j25199
1973.1F98387756j34582M20456J61285L5782K17285O7291k58331j62430k45666k73438
1982.8F98215408j36413m48609p3394J49459J17264o5994k0676M70505k39334r43604
1992.4F97024612j70822K85645j80512r8648J06278l8986J36489j73263N4931L24097
$$ plain form
1923.9 699514389 700166626 700408173 700158081 700018463 700026169 699961014 700128098 700416946 700477524 700325165
1933.6 700325165 700407867 700277481 699942932 699701843 699703064 699797134 699718628 700087814 699326630 698282776
1943.2 698282776 699050598 699476852 699298096 698878098 698721161 698917313 699007645 699000931 699195404 699422150
1952.9 699422150 699455338 699515610 699345474 699275436 699276810 699364700 699314804 698964691 699016418 699031448 698972321
1963.5 698972321 698874969 698925400 699222488 699008560 698751907 699189224 699416733 698781662 698512955 698387756
1973.1 698387756 698253174 698673630 698834915 698870697 699087982 699155273 698896942 698734512 698488846 698215408
1982.8 698215408 698078995 697630386 697556992 697706451 697823715 697757721 697737045 698207550 697968216 697024612
1992.4 697024612 696853790 697139435 696958923 696860275 696966553 696927567 697064056 696890793 696945724 697269821
2002.1F97269821n6000m16565m03442m21982o37512j79596R1019L47900J47934r1629
2011.7F95649948l662l50647j20850l27911p38144n31387k8153r7351j95541J44272
2021.3F93400574q3313J35727j71204l92837j23597l19900k62833k77939M2496j95618
2031F91751556j58538J11770q850J35117k50779j54037l31955o83212m89426l05252
2040.6F89616394k73209J374L71551J42365M41818k69623o79169J57166j84097m70887
2050.3F88853683m79354j81733R8191L92380L7689j79215N39856J13754j29089l97186
2059.9F88668976j96076J28785m26026l08380k47955q6746J13220O80084M54102j31913
2069.6F88648071R4834j04905J1063m73556m73099j03226r7275K33002J37329K82898
$$ plain form
2002.1 697269821 697213821 696797256 696393814 695971832 695334320 695154724 695245743 695593643 695741577 695649948
2011.7 695649948 695646286 695295639 695174789 694846878 694108734 693577347 693549194 693451843 693256302 693400574
2021.3 693400574 693317261 693452988 693281784 692888947 692765350 692445450 692182617 691904678 691947174 691751556
2031 691751556 691593018 691704788 691695938 691831055 691580276 691426239 691094284 690411072 689921646 689616394
2040.6 689616394 689343185 689344559 689716110 689858475 690300293 690030670 689351501 689508667 689324570 688853683
2050.3 688853683 688374329 688192596 688290787 688683167 688720856 688541641 689081497 689195251 689066162 688668976
2059.9 688668976 688472900 688601685 688175659 687867279 687619324 687532578 687645798 688325882 688779984 688648071
2069.6 688648071 688742905 688638000 688649063 688175507 687702408 687599182 687501907 687734909 687872238 688155136
2079.2F88155136j24588l10211j59302p4463J84098J52664J1139n18952m0283L58276
2088.9F87633514J30539O8055J14822J78070l49121j88294j65176l39661k34222L31726
2098.5F87180252Q02002L0823O5079K43606n188k42615k3727J3809q45337m33502K3346
2109.1F86808548K50473M49982J35421J5336k60392n0506J74713L3188j48163k94724
2118.7F87113876l54538j82342j10321j37863M03442M21753K42920K48337n4398l99856
2128.4F87191010l76206l28522l63922j6479l28903Q6288O36749K09809O9503k20718
2138F86558609k18048k72369J21917k670n25970M6997O2179J51978K00882K40326L34777
2148.6F86698608K42310P9346n74265m86679l26538k29645k05993q4153J86158J44729
$$ plain form
2079.2 688155136 688030548 687720337 687561035 687486572 687670670 687823334 687834473 687315521 687275238 687633514
2088.9 687633514 687764053 687832108 687946930 688125000 687775879 687587585 687422409 687082748 686848526 687180252
2098.5 687180252 687982254 688013077 688078156 688321762 688316574 688073959 688050232 688064041 687218704 686785202 686808548
2109.1 686808548 687059021 687509003 687644424 687659760 687399368 687348862 687523575 687556763 687408600 687113876
2118.7 687113876 686759338 686576996 686466675 686328812 686732254 687154007 687396927 687645264 687590866 687191010
2128.4 687191010 686814804 686486282 686122360 686105881 685776978 685863266 686500015 686709824 686779327 686558609
2138 686558609 686340561 686068192 686190109 686187439 685661469 685708466 685770645 685922623 686123505 686363831 686698608
2148.6 686698608 686940918 687020264 686445999 685959320 685632782 685403137 685197144 685112991 685299149 685443878
2158.3F85443878M50516K81525K15149j00556m47388j29470r1858R8343K86788M65622
2167.9F86472549K86408K90146K75955k10342k57721k64054n5237N4932Q469k8687
2177.6F86572418J61514K64054J46255L02506J19476J48621L2043L8300L7155k89917
2187.2F87532425j86920j43280J44806K43454O84967M25415l17231K82364K22016k25373
2196.9F88662643l16772o5231m9210M1275J90811k01492N13458Q27561M98962J04446
2206.5F90206451m02221l55072l30200j58921k58484J53L24249L63465K71225L128
2216.1F89663773K87780J14060j60523k06833j41677j46866k31705K33383M33350K79541
2225.8F90124283L21274L01208n57556m18625M23966r1172l26614k30789k58255J3504
$$ plain form
2158.3 685443878 685894394 686175919 686391068 686290512 685843124 685713654 685621796 685720139 686006927 686472549
2167.9 686472549 686758957 687049103 687325058 687114716 686856995 686592941 686537704 686592636 686601105 686572418
2177.6 686572418 686733932 686997986 687144241 687446747 687566223 687714844 687746887 687785187 687822342 687532425
2187.2 687532425 687345505 687202225 687347031 687590485 688275452 688700867 688383636 688666000 688888016 688662643
2196.9 688662643 688345871 688280640 688231430 688272705 688463516 688262024 688775482 689603043 690102005 690206451
2206.5 690206451 689804230 689449158 689118958 688960037 688701553 688701706 689025955 689389420 689660645 689663773
2216.1 689663773 689951553 690065613 689905090 689698257 689556580 689409714 689178009 689411392 689844742 690124283
2225.8 690124283 690445557 690746765 690189209 689770584 690194550 690103378 689776764 689545975 689287720 689301224
2235.4F89301224N16815J22375r5443O08444P7057m72870l62015j46026k90452k60772
2245.1F88998337J57623J79138L18299K1743K20337Q2856j95923L40194o0272m88815
2254.7F89573517m11911J36871N4245j21918L18680L50113J20392j58768K33307k33688
2264.4F89860840n18799j69525o4240J71585j40914K12173j42899p9116N89676K64205
2274F89982986p5225n26886r3766l94210k70920K06146J3580M69971J31073J18790
2283.7F89561539R2163K11563j65634o73981J10397k28958j23062j1520j40229J7014
2293.3F88649292K53906O93894k90528k50854M33960M1199m77906l62549p247K593
2302.9F88685760L18909K28806M92096J96685K56653O87638k12021J1596k32849r0561
$$ plain form
2235.4 689301224 689818039 689940414 689844971 690453415 690530472 690057602 689695587 689549561 689259109 688998337
2245.1 688998337 689155960 689335098 689653397 689675140 689895477 689978333 689782410 690122604 690062332 689573517
2254.7 689573517 689161606 689298477 689352722 689230804 689549484 689899597 690019989 689861221 690094528 689860840
2264.4 689860840 689342041 689172516 689108276 689279861 689138947 689351120 689208221 689129105 689718781 689982986
2274 689982986 689907761 689380875 689287109 688892899 688621979 688828125 688841705 689311676 689442749 689561539
2283.7 689561539 689653702 689865265 689699631 689025650 689136047 688907089 688784027 688772507 688632278 688649292
2293.3 688649292 688903198 689597092 689306564 689055710 689489670 689530869 689052963 688690414 688683167 688685760
2302.9 688685760 689004669 689233475 689725571 689922256 690178909 690866547 690654526 690666122 690433273 690342712
2312.6F90342712J14212p76901k57644J60064N47028R43832J017990m8217r25904o9351
2322.2F91047821K24304K10114k09122k8381J80587L53470R97238K15912o86798j147613
2331.9F91157532n52445p0572K5711O83136O32935M26407k09961n90439P6141O34919
2341.5F92213364M54788o74820r83582o84967n91278r06830j221084N10330K252808
2350.2F90368729O87561r16672M81415P46383j04446N78384Q59375P2556L25622N81360
2359.8F93680267J249085J02539k161560k632904n86167J828843l95432j312637k34909
2368.5F89537125n03083r45511j336975n09567m79431n43137j831q9264o44683r44367
2378.2F83539276m65164m29306p65457p78656o5308j18332n93796p2708m2648J46942
$$ plain form
2312.6 690342712 690456924 689680023 689422379 689582443 690129471 691073303 692091293 692043076 691117172 691047821
2322.2 691047821 691272125 691482239 691273117 691244736 691425323 691778793 692776031 692991943 692305145 691157532
2331.9 691157532 690605087 690534515 690560226 691243362 691876297 692302704 692092743 691502304 691578445 692213364
2341.5 692213364 692668152 691993332 691009750 690324783 689733505 688826675 687605591 688115921 690368729
2350.2 690368729 691056290 690139618 690621033 691367416 691262970 691841354 692700729 692773285 693098907 693680267
2359.8 693680267 694929352 695031891 692870331 690237427 689651260 691480103 691084671 689772034 689537125
2368.5 689537125 689034042 688088531 686751556 686241989 685762558 685219421 685217590 685128326 684483643 683539276
2378.2 683539276 683074112 682644806 681879349 681100693 681035385 680917053 680323257 680250549 680207901 680354843
2387.8F80354843n4245m34494j91879l37982j44883k72750r1401L03650O1341l1205
2397.4F79160995j56631j05286l06320m03137l42407j65711J93177k78550n35431j19247
2407.1F76941452K38266L43475Q3390k60163m23050m90646m15268k98462k08206j58081
2416.7F75352707j85547L02124J30310l65753j5259k82516o04630l92380n4397Q7890
2426.4F73972549k49939m20761j15280o9122l43704O2027N3253k18430k13623m70352
2436F71986618l72162k34527j74408l38517P7057L05405l47061k93122l16238j86233
2445.7F70106812q7281m76303n17120l11966J7776K18888l8376n25208j76086p1945
2455.3F68139191j55640q3542n94787l94135j04370J39389j66931n51377j15966l1739
$$ plain form
2387.8 680354843 680300598 679866104 679674225 679336243 679191360 678918610 678827209 679130859 679192200 679160995
2397.4 679160995 679004364 678899078 678592758 678189621 677847214 677681503 677874680 677596130 677060699 676941452
2407.1 676941452 677179718 677523193 677606583 677346420 676923370 676432724 676017456 675718994 675510788 675352707
2416.7 675352707 675167160 675469284 675599594 675233841 675218582 674936066 674331436 673939056 673884659 673972549
2426.4 673972549 673722610 673301849 673186569 673117447 672773743 672835770 672889023 672670593 672456970 671986618
2436 671986618 671614456 671379929 671205521 670867004 670944061 671249466 670902405 670609283 670293045 670106812
2445.7 670106812 670019531 669543228 669026108 668714142 668731918 668950806 668912430 668387222 668211136 668139191
2455.3 668139191 667983551 667900009 667305222 666911087 666806717 666946106 666779175 666227798 666111832 666080093
2465F66080093L82996M6463n30167l82537l86277k40631j44729q9570l47747k41852
2474.6F64146042l4866P8125J97296k61002k45209k15759k66495l77197n56259k07749
2484.2F62256927n2413k747J40915o7215l54004J66855K41089l19214m29306n28107
2493.9F61052780k40173k19879l50037j38779P8354M3335k00348L3112j48392j18790
2503.5F59791183J60447l06321n77011k96325R5749j05362j39618N6839M4708O5918
2513.2F58790207o7597l8299m52881p69348l02811j46789l39890j76468J54496J51824
2522.8F56802444K1439j17416l58658m18091k5864j93328m04511J11771k86942n40924
2532.5F54589920N0049J24588j92413j98288J67541j05514o09589o24619k93350L662
$$ plain form
2465 666080093 666463089 666509552 665979385 665596848 665210571 664969940 664825211 664735641 664387894 664146042
2474.6 664146042 664111176 664189301 664386597 664125595 663880386 663664627 663398132 663020935 662464676 662256927
2484.2 662256927 662204514 662201767 662342682 662275467 661921463 662088318 662329407 662010193 661580887 661052780
2493.9 661052780 660812607 660592728 660242691 660103912 660182266 660225601 660025253 660058365 659909973 659791183
2503.5 659791183 659951630 659645309 659068298 658771973 658867722 658762360 658622742 658679581 658724289 658790207
2513.2 658790207 658722610 658684311 658231430 657462082 657159271 657012482 656672592 656496124 656650620 656802444
2522.8 656802444 656823883 656706467 656347809 655929718 655903854 655710526 655306015 655417786 655130844 654589920
2532.5 654589920 654639969 654764557 654572144 654373856 654541397 654435883 653826294 653201675 652908325 652911987
2542.1F52911987k73819m26941j75857p5684k9220K21634n5848n18722k35825k96936
2551.7F51044769m76913j00403j89056m88129j81503L26843K22931l57056m89426k80838
2561.4F49031219p3928k39716n55725k04239k06451j58615R5901l43475j12610P2326
2571F47304687l40881k03323l8529m11224m94537j15128l51639l31878k4643j66550
2580.7F44826355q1940l3951J1826n0125m15955n40313k02103N4169k17286m38308
2590.3F42912369l19672j65558K2507Q3008j55258o0349j15051m39911m71420l72086
2600F40918579j24664l01895k5101j87988p68547J39083K56539j40343l85628o24160
2609.6F38755875J7624p5112p56798p61833j27334J34697J34811J41182k95944m37622
$$ plain form
2542.1 652911987 652638168 652211227 652035370 651959686 651930466 652152100 652096252 651577530 651341705 651044769
2551.7 651044769 650567856 650467453 650278397 649790268 649608765 649935608 650158539 649801483 649312057 649031219
2561.4 649031219 648957291 648717575 648161850 647957611 647751160 647592545 647688446 647344971 647232361 647304687
2571 647304687 646963806 646760483 646721954 646310730 645816193 645701065 645349426 645017548 644992905 644826355
2580.7 644826355 644744415 644710464 644722290 644672165 644256210 643715897 643513794 643567963 643350677 642912369
2590.3 642912369 642592697 642427139 642449646 642532654 642377396 642317047 642201996 641762085 641290665 640918579
2600 640918579 640793915 640492020 640466919 640278931 639510384 639649467 639906006 639765663 639380035 638755875
2609.6 638755875 638773499 638698387 637941589 637179756 637052422 637187119 637321930 637463112 637167168 636729546
2619.3F36729546m43573n07470p62748q33626j95122L14522m96l50723l07465n99403
2628.9F33043442j79711J37253m59366p19642p37267m56238m01878l46489k88505m63906
2638.5F29127693k80952q1978j63040l60108l68347o71272n84068j60943j80015k58484
2648.2F26018486l39737o5880k46620k65922p0420o27250r90525o94236m6196p8431
2657.8F22593269k58064p16171o81114J08833k16599l30543l68347l10860k43683k24571
2667.5F19352150J89934o31409r87778n38864k59476j54991l66439k85340l03955p0877
2677.1F15942955l8567r2964J412l31917n48477m07410j52550l23181l26080l98827
2686.8F13324394l40729L08877K56042l48282o34918l05481l08914o16341m13132O0769
$$ plain form
2619.3 636729546 636285973 635778503 635015755 634182129 633987007 634301529 634301033 633950310 633642845 633043442
2628.9 633043442 632863731 633000984 632541618 631821976 631084709 630628471 630226593 629880104 629591599 629127693
2638.5 629127693 628846741 628764763 628601723 628241615 627873268 627201996 626617928 626456985 626276970 626018486
2648.2 626018486 625678749 625612869 625366249 625100327 625029907 624402657 623412132 622717896 622671700 622593269
2657.8 622593269 622335205 621619034 620937920 621046753 620830154 620499611 620131264 619820404 619576721 619352150
2667.5 619352150 619542084 618910675 617922897 617384033 617124557 616969566 616603127 616317787 616013832 615942955
2677.1 615942955 615904388 615811424 615812836 615480919 614932442 614525032 614372482 614049301 613723221 613324394
2686.8 613324394 612983665 613292542 613548584 613200302 612565384 612259903 611950989 611334648 610921516 610982285
2696.4F10982285Q9416l40538m04663n41687k71721j56555n03044m67186k66991J69678
2706F08288994m81987o54335O9694l08036n15442k87400j96724m12407k9602K09618
2715.7F05682373p62749j072845n13306k23350l93486j24092r9793k62146K15111K14996
2725.3F02660713j08833p83119q90656l52554m51279n71670n95131k23999J06353j91192
2735E98598633k92778J03645K46277j45798m12445p94868p23381j05858k25372o31905
2744.6E95616150l44811O73485O44112q24013r04846k8725k52304o38428o33125l52516
2754.3E92954979j43890r3270K2240l52211k34566J09673p0114J28631k19421p72972
2763.9E91329079o13556n90172n64308l36113N646Q8806k85073p3814L33519J9340
$$ plain form
2696.4 610982285 611071701 610731163 610326500 609784813 609513092 609356537 608853493 608386307 608119316 608288994
2706 608288994 607807007 607152672 607222366 606914330 606398888 606111488 605914764 605502357 605472755 605682373
2715.7 605682373 604919624 603846779 603333473 603110123 602716637 602592545 602492752 602230606 602445717 602660713
2725.3 602660713 602551880 601768761 600878105 600525551 600074272 599502602 598907471 598683472 598789825 598598633
2735 598598633 598305855 598409500 598655777 598509979 598097534 597302666 596579285 596473427 596248055 595616150
2744.6 595616150 595271339 595944824 596588936 595764923 594860077 594831352 594579048 593940620 593307495 592954979
2754.3 592954979 592811089 592717819 592740059 592387848 592153282 592262955 592192841 592321472 592102051 591329079
2763.9 591329079 590715523 590125351 589561043 589224930 589230576 589319382 589034309 588960495 589294014 589313354
2773.5E89313354o03599j090965r13086o77109n14030K6474J59111R7274L5363k13814
2783.2E85618973m77524o68449p72515n46264k31057p40547p97958l79982m49333k78664
2792.8E80276680k29645j0681j44501r93080q30841k97737o84128j136665r44977n51186
2802.5E74453239m92439m36210p9651l93296p83500m73557n88722j208572j502762
2811.2E68494530q00362o20384q72116l26920n34706n50918m11454j069908j065330
2819.8E62242432r75800j594810j762467j115227j020622j329269j396141j226349
2827.6E51821747q70438j107559j475067j811485k239876k309265k107163k163925
2835.3E37736969k438889k154235k235489k937851l500099m123650m714623n393943
$$ plain form
2773.5 589313354 588709755 587618790 586705704 586028595 585514565 585541039 585700150 585797424 585832787 585618973
2783.2 585618973 585141449 584473000 583700485 583154221 582923164 582182617 581384659 581004677 580555344 580276680
2792.8 580276680 580047035 580036354 579891853 578898773 578067932 577770195 577086067 575949402 575004425 574453239
2802.5 574453239 573960800 573524590 573444939 573051643 572268143 571794586 571205864 569997292 568494530
2811.2 568494530 567694168 567073784 566201668 565874748 565340042 564789124 564377670 563307762 562242432
2819.8 562242432 561266632 559671822 557909355 556794128 555773506 554444237 553048096 551821747
2827.6 551821747 550951309 549843750 548368683 546557198 544317322 542008057 539900894 537736969
2835.3 537736969 535298080 533143845 530908356 527970505 524470406 520346756 515632133 510238190
2843E10238190o400414p083931p344551q297462q923607q467369q099480p532692o813965
2851.7D41274719n586548l813934k000618J52092J693573L233948M570656M741249
2859.4D44265137M414100M957886N438576L961563L275986L155670K045593R89266
2867.1D72503777K26364J2703m61884p58514k42386K93503N16891N97992N16548N82390
2876.7D73787384P73811q1138o63529o51207j008949r51118p04041p71713j160927
2885.4D68568573j282387j475143j587181j322747j725044k151451k228775k000542
2893.1D54795303j854972j984864j739769j679687k096405k436867k274742k331581
2900.8D38396416k630844k692910k658958k879372l374252l213120l466377l877411
$$ plain form
2843 510238190 503837776 496753845 489409294 481111832 472188225 463720856 455621376 448088684 441274719
2851.7 441274719 435688171 431874237 429873619 430025711 431719284 434953232 439523888 444265137
2859.4 444265137 448679237 453637123 459075699 463037262 466313248 469468918 471514511 472503777
2867.1 472503777 472730141 472742844 472280960 471522446 471280060 471573563 472090454 472688446 473204994 473787384
2876.7 473787384 474561195 474480057 473816528 473165321 472156372 471205254 470501213 469729500 468568573
2885.4 468568573 467286186 465811043 464223862 462901115 461176071 459024620 456795845 454795303
2893.1 454795303 452940331 450955467 449215698 447536011 445439606 443002739 440727997 438396416
2900.8 438396416 435765572 433072662 430413704 427534332 424160080 420946960 417480583 413603172
2908.6D13603172l820152m059410m390068n334778n829010o045685o483993o698037
2916.3C70942039o935157o442948o310615o147804n192566m440384l970108k788506
2924C28713951j452026p92847M62799J251564K036705K817497K801972L731003M771919
2932.7C44342537N042114N328675N501747N305748N660514O079979N789757N338288
2940.4C88389359N283432N275917M864959M451790L911400L558617L137474K553177
2948.1D21426125J751709J176948J156044O05660O38542M62036L07655J261902J381073
2956.8D30167694J363869J828079K295609K210159K746353L771935L423385L365097
2964.5D51172180L735619M074135M093170L943557L933983L555069L859291L823204
$$ plain form
2908.6 413603172 409783020 405723610 401333542 395998764 390169754 384124069 377640076 370942039
2916.3 370942039 364006882 357563934 351253319 345105515 339912949 335472565 331502457 328713951
2924 328713951 327261925 326469078 326931877 328183441 330220146 333037643 335839615 339570618 344342537
2932.7 344342537 349384651 354713326 360215073 365520821 371181335 377261314 383051071 388389359
2940.4 388389359 393672791 398948708 403813667 408265457 412176857 415735474 418872948 421426125
2948.1 421426125 423177834 424354782 425510826 426116486 426755028 427217064 427524719 428786621 430167694
2956.8 430167694 431531563 433359642 435655251 437865410 440611763 444383698 447807083 451172180
2964.5 451172180 454907799 458981934 463075104 467018661 470952644 474507713 478367004 482190208
2972.2D82190208K898903K716446L036804L083687K870064K034836J648788K375450
2979.9E02855186K299386J766204J766968J863556J692429J221084R95674J238938
2987.6E15699425J379814R44862R10645P55195L85552M46243k9297J55640M95911j60370
2997.3E20983620r39637j590881j199493p82929q94317j105957j772767j382293q95844
3006E10419502q43620p6523k24380o61316L0708P17201P90673R64241J179885Q24929
3015.6E13121300J439895K054482J242561R81484R20829N13726m654J0185N25703L31727
3025.2E21137238q1482l53470Q7585K92168q2474l58086p49855k14920j22299n95474
3034.9E18958931o28853o42052m17404m12101j13450l50990j067848l82462q6097p95212
$$ plain form
2972.2 482190208 485089111 487805557 490842361 493926048 496796112 498830948 500479736 502855186
2979.9 502855186 505154572 506920776 508687744 510551300 512243729 513464813 514460487 515699425
2987.6 515699425 517079239 518024101 518934746 519689941 520075493 520521736 520492439 520648079 521143990 520983620
2997.3 520983620 520043983 518453102 517253609 516470680 515576363 514470406 512697639 511315346 510419502
3006 510419502 509575882 509499359 509274979 508613663 508644371 509361572 510152245 511116486 512296371 513121300
3015.6 513121300 514561195 516615677 517858238 518839722 519760551 520274277 520269623 520279808 520805511 521137238
3025.2 521137238 521055756 520702286 520789871 521082039 520999565 520641479 519891624 519676704 519554405 518958931
3034.9 518958931 518330078 517688026 517270622 516858521 516745071 516394081 515326233 514943771 514857674 514062462
3044.5E14062462j008377j072426r60655m55284j57280l97644r65004q99010m29764
3053.2E07717018m07905m93813p30858q98247r11598r84917p42607o96334r92394l16277
3062.9E00542068K35405n33218q19969q81195q61473q26035j299896r13429n64308
3071.5D94077950l31383j15776n23720l23639j84479o43539o99120p21359j326866
3080.2D89208069j248818n98182j91002j79634o54183n63850o35910o93321n28717
3088.9D83914452o27442o00662j117439j119538p44247n14984n71823n19982m2305
3097.6D78056030o45637o21987n15976p06863j10702o93017j496238j369820q39996
3106.2D71055794o04782n74379p71065r79195m30259j42060n07774j026306n05142
$$ plain form
3044.5 514062462 513054085 511981659 511021004 510565720 510408440 510010796 509045792 508146782 507717018
3053.2 507717018 507309113 506815300 506084442 505186195 504274597 503289680 502547073 501850739 500858345 500542068
3062.9 500542068 500777473 500244255 499424286 498543091 497681618 496855583 495555687 494642258 494077950
3071.5 494077950 493746567 493630791 493107071 492783432 492598953 491955414 491256294 490534935 489208069
3080.2 489208069 487959251 487361069 487170067 486990433 486336250 485772400 485136490 484443169 483914452
3088.9 483914452 483287010 482686348 481568909 480449371 479705124 479190140 478618317 478098335 478056030
3097.6 478056030 477410393 476788406 476272430 475565567 475454865 474761848 473265610 471895790 471055794
3106.2 471055794 470451012 469876633 469105568 468126373 467696114 467554054 467046280 466019974 465514832
3114.9D65514832p14684j575470o76651n13191p65114m17557l15742r19647j296769
3123.6D58320007m72107o26411r48029r42764j146889r21096q94547o36825l27225
3132.3D51404114n64270p63359n62821p79037j056404r32389q84819p95288j005478
3141D44060249q60023n55878o01539o66008o64216n16052o85653q25921j068725j080017
3150.6D36536217q79479q63304q20808r81026n50346k41051m13437q74596j219101
3159.3D29693069q18367r43565j175308j198158j027108p78160p64236m08707m70314
3168D22109146p88040o58646m61998q67729j252746j137467j344910j077766k29263
3176.6D14290581l66020q52471l48358m01917o82716l60527q75473j159477p44591
$$ plain form
3114.9 465514832 464800148 463224678 462548027 462034836 461269722 460852165 460536423 459616776 458320007
3123.6 458320007 457847900 457221489 456273460 455330696 454183807 453262711 452368164 451731339 451404114
3132.3 451404114 450839844 450076485 449513664 448734627 447678223 446745834 445861015 445065727 444060249
3141 444060249 443200226 442644348 442042809 441376801 440712585 440196533 439510880 438684959 437616234 436536217
3150.6 436536217 435656738 434793434 433972626 432991600 432441254 432200203 431786766 430912170 429693069
3159.3 429693069 428874702 427931137 426755829 425557671 424530563 423752403 422988167 422579460 422109146
3168 422109146 421321106 420662460 420200462 419332733 418079987 416942520 415597610 414519844 414290581
3176.6 414290581 413924561 413072090 412723732 412321815 411639099 411278572 410403099 409243622 408499031
3185.3D08499031r85184j551170r47723l60108n81512k78626p41539j101150p86362
3194D01165657p54127m80767q73260j097565n37186l19786o35795j265335j014481
3202.7C94187355o6643m71496q35724k83127r11636j134110p48558p45277o21910p36542
3212.3C87632332n33829p11021p32422j74217j57700o55060j034698q13675q20961
3221C81998749p01714o31752o21490m64554o09856k54440l52058p18918o73600p58628
3230.7C76211739m76456j78146p95479j257057p65229o60515l81622j01929l35655
3239.3C71259651p03277j075707p25670p51152p77092n88913l60794r3193o39992p15942
3249C64827919n65338p76672q77228o61545o03561o68145m83207o87981m84505m47540
$$ plain form
3185.3 408499031 407513847 405962677 405014954 404654846 404073334 403794708 403053169 401952019 401165657
3194 401165657 400411530 399930763 399057503 397959938 397422752 397102966 396467171 395201836 394187355
3202.7 394187355 394120712 393649216 392813492 392530365 391618729 390484619 389736061 388990784 388368874 387632332
3212.3 387632332 387098503 386387482 385655060 385480843 385323143 384668083 383633385 382819710 381998749
3221 381998749 381297035 380665283 380043793 379579239 378969383 378714943 378362885 377643967 376970367 376211739
3230.7 376211739 375735283 375557137 374761658 373504601 372739372 372078857 371697235 371595306 371259651
3239.3 371259651 370556374 369480667 368754997 368003845 367226753 366637840 366277046 366183853 365543861 364827919
3249 364827919 364262581 363485909 362608681 361947136 361343575 360675430 360192223 359504242 359019737 358572197
3258.6C58572197m20456m72298r83238q45451o35872n4932k53143o48613k05498n54657
3268.3C53498039j038208p33833P0076q1139n24902r98077j191025k82707k44103m08630
3277.9C48065491n46646o47240k51236l39584n16091m83894j40267l47633o04134k28004
3287.5C43960762m48112m76609M3412o20308j190491k68631j62087l97186M234q1558
3297.2C40363426q47244p03812J58768o21185p80068N1728K17971j58424r25636n95856
3306.8C36159668m28543l64113k63634n81588l15743n28793n17960n31349p47376k75230
3316.5C31605339l55110p38526k50854J34430l19290l83301m13818n58396m12941k99644
3326.1C28007889n20210p19300n0316l03611o40755l92609r65118o42395m7112l43513
$$ plain form
3258.6 358572197 358151741 357679443 356696205 355850754 355214882 355159950 354906807 354258194 354052696 353498039
3268.3 353498039 352459831 351725998 351796074 351714935 351190033 350191956 349000931 348718224 348474121 348065491
3277.9 348065491 347518845 346871605 346620369 346280785 345764694 345280800 345140533 344792900 344188766 343960762
3287.5 343960762 343512650 343036041 343079453 342459145 341268654 341000023 340837936 340440750 340444984 340363426
3297.2 340363426 339516182 338812370 338971138 338349953 337569885 337621613 337839584 337681160 336755524 336159668
3306.8 336159668 335731125 335367012 335103378 334521790 334206047 333677254 333159294 332627945 331880569 331605339
3316.5 331605339 331250229 330511703 330260849 330395279 330075989 329692688 329278870 328720474 328307533 328007889
3326.1 328007889 327487679 326768379 326718063 326414452 325773697 325381088 324415970 323773575 323726463 323382950
3335.8C23382950q01697o36139l2883l70140q51211m30031k21558p26051n79777N5962
3345.4C18789425j00422n79948n96371p14111q91686p41482p65838m00429j35288k60601
3355.1C13603249l14618p06844l67527J17321n40504j062813n42259k41032n12791
3363.7C09432182m37507l62149o25972p45221m00733m37298o04248m69303m26827o01139
3373.4C04321785j183910o12851K10324j18199m81052p55634n26982j88675l43799
3382.1C00321007l64113k16732o48499n79128j5430j75953n7717k18620o30569q66814
3391.7B96547432n22442M59404K00768n56794o60019J6003L3474k48527j75858k69051
3401.3B94824390Q5297m87404o73542J50528k5387o23588m48685k1477k7923P3757
$$ plain form
3335.8 323382950 322581253 321945114 321912231 321542091 320690880 320260849 320039291 319313240 318733463 318789425
3345.4 318789425 318689003 318109055 317512684 316798573 315906887 315165405 314399567 313999138 313863850 313603249
3355.1 313603249 313288631 312581787 312214260 312331581 311791077 310728264 310186005 309944973 309432182
3363.7 309432182 308994675 308632526 308006554 307261333 306860600 306423302 305819054 305349751 304922924 304321785
3373.4 304321785 303137875 302525024 302735348 302617149 302136097 301380463 300853481 300664806 300321007
3382.1 300321007 299956894 299740162 299091663 298512535 298497105 298321152 298263435 298044815 297414246 296547432
3391.7 296547432 296024990 296484394 296685162 296128368 295468349 295484352 295517826 295269299 295093441 294824390
3401.3 294824390 294909687 294422283 293748741 293899269 293873882 293250294 292801609 292780132 292752209 292825966
3411B92825966n31654j64757O33163K44560L17212l44906o50578k51236J27220J65024
3420.6B92370014o52504l07178M49714N50023j35289l71151p2879J75590O35433j46503
3430.3B92495270l86448J71070J90392M82177L21636K0295L47194L25108k1248M6158
3439.9B93991604L23639N39455N7621R7771J47457J44405Q60958o217K25391P42760
3449.6B97124844L11241N06000J34278l0651j2608R94701J018257j81064j41125R117
3459.2B99732990O22406Q14514J282978P29733j50776N06420J42975M75006M81014
3467.9C04637260L61748Q62026L98446L85952N46188P59373N52730N74932O82965J05819
3477.5C09867439L04013O37455R31892J014366J48125K16541J208553O22654K56405
$$ plain form
3411 292825966 292294312 292129555 292762718 293007278 293324490 292979584 292329006 292077770 292204990 292370014
3420.6 292370014 291717510 291410332 291860046 292410069 292274780 291903629 291830750 292006340 292641773 292495270
3430.3 292495270 292108822 292279892 292470284 292952461 293274097 293294392 293641586 293966694 293945446 293991604
3439.9 293991604 294315243 294854698 294912319 295010090 295157547 295301952 296162910 296156693 296382084 297124844
3449.6 297124844 297436085 297942085 298076363 298045712 298033104 299027805 300046062 299864998 299723873 299732990
3459.2 299732990 300355396 301169910 302452888 303182621 303031845 303538265 303681240 304156246 304637260
3467.9 304637260 304999008 305861034 306259480 306645432 307191620 307950993 308503723 309078655 309761620 309867439
3477.5 309867439 310171452 310808907 311740799 312755165 312903290 313119831 314328384 314951038 315207443
3486.2C15207443R72462Q05588N00660O25896J119194J019611L94516J72730R12170
3494.9C21730270J284333L82385O11114M54026O20727J239319N84259M29344M40636
3503.6C27776413M23317K19421N67513J252289J384163Q51898L10669Q10623O59408
3512.2C34255714J195946J106644K51808O97212J049690Q27179N28336J370163J408043
3520.9C42690735J224861Q49152j4496N31196K89574P87735R84917J256752J233940
3529.6C49834366N15289J146431Q94203J150284P44629N27039Q99238P87926J356544
3538.3C57855949P96242R28841R34562J429024J885491J097908L94439j8043J382179
3547C66686592K96402P83386K048722J969757J503868l46070J420136J198425J099434
$$ plain form
3486.2 315207443 316179905 316985493 317486153 318112049 319231243 320250854 320645370 320818100 321730270
3494.9 321730270 323014603 323396988 324008102 324462128 325082855 326322174 326906433 327335777 327776413
3503.6 327776413 328199730 328419151 328986664 330238953 331623116 332475014 332785683 333596306 334255714
3512.2 334255714 335451660 336558304 336810112 337507324 338557014 339384193 339912529 341282692 342690735
3520.9 342690735 343915596 344764748 344750252 345281448 345571022 346358757 347343674 348600426 349834366
3529.6 349834366 350349655 351496086 352390289 353540573 354285202 354812241 355711479 356499405 357855949
3538.3 357855949 358652191 359581032 360515594 361944618 363830109 364928017 365322456 365304413 366686592
3547 366686592 366982994 367766380 369815102 371784859 373288727 372942657 374362793 375561218 376660652
3555.6C76660652J584206P44133J916809Q93631L78609P57751J929550J701775O05240
3564.3C87172356K817688O75544L12424P64732L47100K832908J880837J483116J417961
3573C99704666J605721P91015R48143K040711J021805K504921J682929O67420J566276
3581.7D12533607J640511K388992J491509L016281K095184j259727J358719P25059
3589.4D23990135K292404K339936K451172J989898P45316K501449p55462J530990L953781
3598.1D41039619Q01430J671715J276817J102829K353440K253799K243843K859917
3605.8D55603409K255974j206932K440872K96058n68885N860710J469536j458016K675553
3614.5D67368279N34782M065742L614960n27611J050187M56848J958656K740707J441307
$$ plain form
3555.6 376660652 378244858 378988991 380905800 381799431 382178040 382935791 384865341 386567116 387172356
3564.3 387172356 389990044 390665588 390978012 391742744 392089844 394922752 396803589 398286705 399704666
3573 399704666 401310387 402101402 403049545 405090256 406112061 408616982 410299911 410967331 412533607
3581.7 412533607 414174118 416563110 418054619 421070900 423166084 421906357 423265076 423990135
3589.4 423990135 426282539 428622475 431073647 433063545 433808861 436310310 435554848 437085838 441039619
3598.1 441039619 441841049 443512764 444789581 445892410 448245850 450499649 452743492 455603409
3605.8 455603409 457859383 456652451 459093323 459389381 458820496 464681206 466150742 464692726 467368279
3614.5 467368279 467903061 471968803 475583763 475056152 476106339 476563187 478521843 481262550 482703857
3623.1D82703857J925126K591819J699868J229782M777107K666550p408371K099762
3630.9D92285500L691101M059562J615486n95245K097397J758728J415825J156769
3638.6E07485123J622772K091522J905136Q67539J41182K022628K748986M028015n72090
3647.3E22340813l024941M497261N90363j684799j19667M153251L791199L175316M056625
3655.9E37775421o310997L56217L891983R53941J381378N43099J959686J355400J037102
3664.6E42943230J400871M95987L223495K228241k56920Q2322m742852J391488O387710
3673.3E53153572P360573j09673j3848304J505203O230774M274788r50737R6740K132149
3682E59845085J641464J236802L15094p7630K909203O036339n623856m298744N919228
$$ plain form
3623.1 482703857 484628983 487220802 488920670 490150452 494927559 497594109 490185738 492285500
3630.9 492285500 495976601 500036163 501651649 501056404 503153801 504912529 506328354 507485123
3638.6 507485123 509107895 511199417 513104553 513972092 514113274 516135902 518884888 522912903 522340813
3647.3 522340813 519315872 523813133 524403496 522718697 522599030 526752281 530543480 533718796 537775421
3655.9 537775421 531464424 531820641 535712624 536666565 538047943 538591042 540550728 541906128 542943230
3664.6 542943230 544344101 544840088 548063583 550291824 550034904 550117226 545374374 546765862 553153572
3673.3 553153572 560514145 560404472 546556168 548061371 554292145 558566933 557616196 557712936 559845085
3682 559845085 561486549 562723351 563038445 562960815 565870018 571906357 566282501 561983757 567902985
3690.6E67902985l524895q8081L854904O41670J665611M4823n9471J538963N78766
3699.3E72555275J986618K267456l631401k540092L482017J787071K00959L71627K014733
3708E78494263L964729m963570J610718K002945j1642380L640519M284782P69043Q94966
3716.7E79056015J858826J325569k371597M98313M975701k274857n595398L177224
3724.4E80649796J654281l01514k547721N29174L892556P32307M313927r75228n809555
3733.1E82138023N959130m72374p140656m39682J949692J009369J789017K455062k390975
3741.8E84856606K502937R750442q222503j5626831Q843002N622520N397377k859382
3749.5E90264168j2050972Q140106j508751m623451M499283K960586K829781l546143
$$ plain form
3690.6 567902985 564378090 564290009 568144913 568786583 570452194 570497017 570437546 571976509 572555275
3699.3 572555275 574541893 576809349 573177948 570637856 574119873 575906944 576107903 576479530 578494263
3708 578494263 582458992 577495422 579106140 581109085 569466705 573107224 577392006 578161049 579056015
3716.7 579056015 580914841 582240410 579868813 580367126 585342827 583067970 577472572 580649796
3724.4 580649796 582304077 582002563 579454842 579984016 583876572 584608879 588922806 587947578 582138023
3733.1 582138023 588097153 587624779 580484123 580044441 581994133 583003502 584792519 587247581 584856606
3741.8 584856606 587359543 597109985 588887482 573260651 582103653 587726173 593123550 590264168
3749.5 590264168 578213196 586353302 584844551 580221100 584720383 587680969 590510750 586964607
3757.2E86964607R20906M233399m903794j528358K748566O94465l06091K927208j022873
3765.9E90728035m119835K227058M492760J003380p547493P01103L047905J36833L72696
3774.5E91042442k12822M77867K86103J852264N48363n470009J216965J901588L39470
3783.2E91982231J057968k559738p30171J761360L08876M47731Q95271J87951p62253
3791.9E92589226M04663L01018P56530K515717l162575l380470K232857L593826M204559
3800.6F00055351o327324p965583L875007L010941L194771L487930p770844m432907
3808.3E87127342M062004K443466L28331L37029M49753O11191L379173o81458j0443458
3817E87613373L965530N016976K955970K70501j4762307J783676N477982J926689K413178
$$ plain form
3757.2 586964607 587885513 592118912 587215118 585686760 588435326 589129791 588823700 591750908 590728035
3765.9 590728035 586608200 588835258 593328018 594331398 586783905 587485008 590532913 590669746 591042442
3774.5 591042442 590829620 591307487 591593590 593445854 593994217 588524208 589741173 591642761 591982231
3783.2 591982231 593040199 590480461 589750290 591511650 591820526 592268257 593163528 593351479 592589226
3791.9 592589226 592993889 593294907 594051437 596567154 593404579 590024109 592256966 595850792 600055351
3800.6 600055351 593728027 585762444 589637451 592648392 595843163 599331093 591560249 587127342
3808.3 587127342 591189346 593632812 593961143 594298172 594747925 595359116 598738289 598056831 587613373
3817 587613373 591578903 596595879 599551849 599822350 585060043 586843719 592321701 594248390 596661568
3825.7E96661568K45590l936081j45416J826477K852859J579209o708527J447220N066376
3834.3E98889275n177460R7160P232590n713883m257164N100632m159775n07125N349540
3843E96853790j434593l180809K023048R12209k23427J935730n1765K092399M757233
3851.7F03683815n297432K92778j2540321M9591Q766746N93949j195298R91745J858788
3860.4E97204361K862701m524536j277809N443497m045639n174332K967758L279343
3868.1E96735344L722877m461326n725670L100548N209656L647041p984123j361771
3875.8E92882576K188492l55950J662140K661553n039292m496307N522003J329956
3883.5E96355171J347122M199982j0454140O17524L786964O16837K787399j379700
$$ plain form
3825.7 596661568 596907158 592971077 592825661 594652138 597504997 599084206 592375679 593822899 598889275
3834.3 598889275 593711815 593808975 601041565 595327682 591070518 596171150 592011375 591504250 596853790
3843 596853790 595419197 592238388 594261436 595173645 594950218 596885948 596834183 598926582 603683815
3851.7 603683815 598386383 598679161 586138840 586188431 594955177 595549126 594353828 595345573 597204361
3860.4 597204361 600067062 595542526 594264717 599708214 595662575 590488243 593456001 596735344
3868.1 596735344 600458221 595996895 590271225 593371773 598581429 602228470 594244347 592882576
3875.8 592882576 595071068 594715118 596377258 599038811 593999519 589503212 595025215 596355171
3883.5 596355171 597702293 601902275 591448135 592065659 595852623 596469460 599256859 597877159
3891.2E97877159n946121R50775K532845l73002R12476N87730J791878K448960p386628
3899.9E93396072J990052J417961m668503K729797j632309p84874J028290N21813J303863
3908.6E95302162K39563N88875j87149o4774k06489o47888J300888J238098l127556
3917.3E94435730k249413L807679O34002l472404J246147J148911m4213j327019j488227
3926E92691193J163749Q57735Q69141q9417l30849R79996k056274j600914P11784j602
3935.6E93194542K60773M32396k404K90490K73666J303329O38466l324165k73934J530037
3945.2E94323196P01752O78368k048378K75116N77621j920166Q73947N82848N4016
3953.9E94098320J49879N5695J94168q90198J3352l47252r0447L59765r35898M51851
$$ plain form
3891.2 597877159 591931038 592881813 595414658 595041656 595954132 596541862 598333740 600782700 593396072
3899.9 593396072 595386124 596804085 592135582 594865379 593233070 592448196 593476486 593998299 595302162
3908.6 595302162 595541725 596130600 595943451 595878677 595672188 595024300 596325188 597563286 594435730
3917.3 594435730 592186317 595993996 596627998 593155594 594401741 595550652 595506439 594179420 592691193
3926 592691193 593854942 594712677 595581818 595492401 595161552 596141548 594085274 592484360 593196144 593194542
3935.6 593194542 593455315 593887711 593885307 594175797 594449463 595752792 596391258 593067093 592793159 594323196
3945.2 594323196 595024948 595703316 593654938 593930054 594507675 592587509 593461456 594044304 594098320
3953.9 594098320 594248199 594303894 594498062 593607864 593621216 593273964 593183517 593543282 592607384 593059235
3963.6E93059235N10673j45912M09470L34243M8714j062775q23326L51258J58500j40457
3973.2E92699623j73225m8752m48685n0888R79157J92947l00407l1052o1569n38101
3982.8E92219048k26746R27963K19422l29171k38456P8582R3537n50499J78489j9989
3992.5E92352180J14213j27144r30786O82907O52732o11991n38407L49770
4000.2E91943474
$$ plain form
3963.6 593059235 593569908 593423996 593833466 594167709 594216423 593153648 592330322 592681580 592840080 592699623
3973.2 592699623 592526398 592477646 592028961 591978073 592957230 593150177 592849770 592818718 592757149 592219048
3982.8 592219048 591992302 592920265 593139687 592810516 592572060 592650642 592744179 592193680 592372169 592352180
3992.5 592352180 592466393 592339249 591408463 592091370 592744102 592132111 591593704 591943474
4000.2 591943474
##END=$$ End of the data block
