##TITLE=$$ Begin of the data block
##JCAMP-DX=5.00 $$ ACD/SpecManager v 10.08
##SPECTROMETER/DATA SYSTEM=Varian
##DATE=04 Dec 2012 14:00:38
##DATA TYPE=INFRARED SPECTRUM
##DATA CLASS=XYDATA
##ORIGIN=
##OWNER=
##NPOINTS=3735
##FIRSTX=399.26403809
##LASTX=4000.35498047
##MAXX=4000.35498047
##MINX=399.26403809
##MAXY=70.60755920
##MINY=29.46159935
##XFACTOR=1.0000000000
##YFACTOR=0.000000100000000
##FIRSTY=54.19838715
##DELTAX=0.96440572
##XUNITS=1/CM
##YUNITS=TRANSMITTANCE
##XYDATA=(X++(Y..Y))
399.3E41983871P368546O488571M298477o495170j0122643q53615j907692O59638J320877
$$ 541983871 549352417 555840988 560139465 553644295 543521652 542668037 540760345 541419983 542740860
407.9E42740860o12602k054978K286225M697494j716194l337822l264122J647301M587364
$$ 542740860 542128258 540073280 542359505 547056999 545340805 542002983 538738861 540386162 544973526
416.6E44973526N021095K59209n332642j737747q289566k740593M542732M427452k37503
$$ 544973526 549994621 550253830 544921188 543183441 534893875 532153282 536696014 541123466 540885963
425.3E40885963n336265N95627k841149l22837M193115m971848m590454P36656J373864
$$ 540885963 535549698 536145325 533304176 532981339 537174454 532202606 527612152 528348808 529722672
434E29722672K046508N319901L083534k282028o10199j123161k865792k998047K565270
$$ 529722672 531769180 537089081 540172615 537890587 537280388 536157227 533291435 530293388 532858658
442.7E32858658K495613m002609k476616j879502L711815N172997l11928J781883J92032
$$ 532858658 535354271 531351662 528875046 526995544 530707359 535880356 535568428 537350311 537542343
451.3E37542343m212379J69677L068963m58336k668991j312561J194343J888886l76091
$$ 537542343 533329964 533499641 536568604 536110268 533441277 532128716 533323059 535211945 534835854
460E34835854J794471K584572j555176J724320k034493p808799k337380j003685k681045
$$ 534835854 536630325 539214897 537659721 539384041 537349548 529540749 527203369 526199684 523518639
468.7E23518639j120949K979889M793014M523506M19007l272057r10339k876320p533875
$$ 523518639 522397690 525377579 530170593 534694099 535113106 531841049 530930710 528054390 520520515
477.4E20520515l454170K206764K335320J436577J449890j39198j181832O50482J226807
$$ 520520515 517066345 519273109 521608429 523045006 524494896 524355698 523173866 523824348 525051155
486.1E25051155l387146o313858k494087J654205O22559J53312M173775K555123p0916
$$ 525051155 521664009 515350151 512856064 514510269 515132828 515286140 519459915 522015038 521944122
494.7E21944122J554566m40865k559089l679085l993187l217697l811875k912864L015213
$$ 521944122 523498688 523057823 520498734 516819649 512826462 509608765 505796890 502884026 505899239
503.4E05899239N647468M3450l965493n35583J14860k52800j275138j932183k299232
$$ 505899239 511546707 511590157 507624664 507089081 507203941 506951141 505676003 503743820 501444588
512.1E01444588k993622k73743P44820J549415J512452k981110l308411j442909l22380
$$ 501444588 498450966 498177223 498922043 500471458 501983910 499002800 495694389 494251480 493929100
520.8D93929100k278099m754562k988816J63384J780586K275467J400261O00052K182464
$$ 493929100 491651001 486896439 483907623 484071007 485851593 488127060 489527321 490127373 492309837
529.5D92309837Q84705p33185J065941Q83369k212677l941459j28136L665390K764511
$$ 492309837 493194542 492461357 493527298 494410667 492197990 488256531 488128395 491793785 494558296
538.1D94558296K143288L925972L183441l35312l182831m655838L14064L443756n82542
$$ 494558296 496701584 500627556 503810997 503475685 500292854 495637016 495951080 499394836 498812294
546.8D98812294m58565K477913L211632J58958R4109J960144p09305k149696k588425
$$ 498812294 498353729 500831642 504043274 504202232 504296341 506256485 505547180 503397484 500809059
555.5E00809059l353271k624436j872864j230506l85247K268601K719040Q4572o56548
$$ 500809059 497455788 494831352 492958488 491727982 491342735 493611336 496330376 496414948 495758400
564.2D95758400j310425k999840l173713k931977k828369k041092j841964m88930J116295
$$ 495758400 494447975 491448135 488274422 485342445 482514076 480472984 478631020 478142090 479258385
572.9D79258385J361999l26385m71039J054649j401825j839637m75464J91803N95588
$$ 479258385 480620384 480293999 479822960 480877609 479475784 477636147 477160683 477352486 477948074
581.5D77948074J629258L800926L549995L181648K775498K498169J315613r33152k112999
$$ 477948074 479577332 483378258 486928253 490109901 492885399 495383568 496699181 495766029 493653030
590.2D93653030k077140n62592J336060K451591J022492K98423J883126J719513N26390
$$ 493653030 491575890 491013298 492349358 494800949 495823441 496121864 498004990 499724503 500250893
598.9E00250893o79322l74717o39420j424599o17103m56772m41513P5302J606522K485695
$$ 500250893 499571571 499196854 498557434 497132835 496515732 496058960 495617447 495692749 497299271 499784966
608.5D99784966J689796J028557o13365k521477k254791r38912J41602Q13331K113686
$$ 499784966 501474762 502503319 501889954 499368477 497113686 496174774 496316376 497129707 499243393
617.2D99243393M358902M174461K581368J394806J408119J896438L62893r64470j788025
$$ 499243393 503602295 507776756 510358124 511752930 513161049 515057487 515420380 514455910 512667885
625.9E12667885o53267J428299K213020L289337L990555K689819Q63610J227646n2948
$$ 512667885 512014618 513442917 515655937 518945274 522935829 525625648 526489258 527716904 527663956
634.6E27663956j991997q09403j13449l47252J47629J634903K168961K472458K875442
$$ 527663956 525671959 524862556 524749107 524401855 524549484 526184387 528353348 530825806 533701248
643.3E33701248J403656l05862j160431j045113j349525j132736R4757O90651J172142
$$ 533701248 535104904 534799042 533638611 532593498 531243973 530111237 530205994 530896645 532068787
651.9E32068787K770080L395615O72073q60328n71862n54886j425171j862144r92928
$$ 532068787 534838867 538234482 538906555 538046227 537474365 536919479 535494308 533632164 532639236
660.6E32639236l87306Q79708J655807J441155J699791L049201M716073j717568l829117
$$ 532639236 532251930 533131638 534787445 536228600 537928391 540977592 545693665 543976097 540146980
669.3E40146980k558250k444458J27182J83487Q63876J908074J820831P77435J156693
$$ 540146980 537588730 535144272 535271454 535454941 536318817 538226891 540047722 540825157 541981850
678E41981850K382011P40166r41048j273231j077004j005745j288223o12335J314392
$$ 541981850 544363861 545104027 544162979 542889748 541812744 540806999 539518776 538906441 540220833
686.7E40220833K449798K384987K240563O40983j299095j712608j842880k665062j486550
$$ 540220833 542670631 545055618 547296181 547937164 546638069 544925461 543082581 540417519 538930969
695.3E38930969R7885K38419J265182J258851L53698k14691p53860j274376k236328
$$ 538930969 539028854 539267273 540532455 541791306 542145004 541930313 541176453 539902077 537665749
704E37665749k538033j831055j127472r39903R26895K297211R67712J200715J751213
$$ 537665749 535127716 533296661 532169189 531229286 532156181 534453392 535421104 536621819 538373032
712.7E38373032O72836m93965n57137k22587p69272o41556J274071K644386J983643
$$ 538373032 539045868 538551903 537994766 537772179 537002907 536361351 537635422 540279808 542263451
721.4E42263451K727356L464431K121392R43946J187478J502952M8943M75464J036758
$$ 542263451 544990807 548455238 550576630 551520576 552708054 554211006 554259949 554735413 555772171
730.1E55772171R98993K477951L251762L616486K951469J724472M70734N18227M57725
$$ 555772171 556771164 559249115 562500877 566117363 569068832 570793304 571264038 571782265 572239990
738.7E72239990q96644p39518N22385Q87718J67275J329422K539215J682205q23555
$$ 572239990 571343346 570603828 571126213 572013931 572181206 573510628 576049843 577732048 576908493
747.4E76908493j019630M95452k820892l244591j995163k103309P13692J253814N58090
$$ 576908493 575888863 576384315 573563423 570318832 568323669 566220360 566934052 568187866 568745956
756.1E68745956J27335j055031j409073j091041r65996m60014k77405j741257p42760
$$ 568745956 568873291 567818260 566409187 565318146 564352150 563892136 563614731 561873474 561130714
764.8E61130714J080208J756935K388573J846047K360954K172928J104507J507416
$$ 561130714 562210922 563967857 566356430 568202477 570563431 572736359 573840866 575348282
772.5E75348282J363106j47629K82287J984978K625122K919884K415466K378693J989822
$$ 575348282 576711388 576563759 576846046 578831024 581456146 584376030 586791496 589170189 591160011
781.2E91160011K070122J774406K79542M86793M37889K79007M84543J570244J239776
$$ 591160011 593230133 595004539 595284081 595770874 596208763 596487770 596972313 598542557 599782333
789.9E99782333L59078J832466J984291J019707R9754P16744P47947O70853J075363
$$ 599782333 600141411 601973877 603958168 604977875 605077629 605794373 606542320 607213173 608288536
798.5F08288536L05748K008972K564316J713181J496048J308937R15756Q9035J83563
$$ 608288536 608594284 610603256 613167572 614880753 616376801 617685738 618601494 618690529 618874092
807.2F18874092q8844Q95691J345863J92642L166J226769J769867J163597P74956r63097
$$ 618874092 618785248 619680939 621026802 621219444 621222610 622449379 624219246 625382843 626157799 625194702
816.9F25194702p42493J69030N78918K08550j459694o91643j76315n2719o11573q42819
$$ 625194702 624452209 624621239 625200157 625408707 623949013 623257370 623081055 623028336 622416763 621573944
826.5F21573944q26530j636544r88159j368484j521454k054939k059784n09377r62067
$$ 621573944 620747414 619110870 618122711 616754227 615232773 613177834 611118050 610608673 609646606
835.2F09646606j213264j113281j758576j271705k98653r86366j521149j478424j510620
$$ 609646606 608433342 607320061 605561485 604289780 603991127 603004761 601483612 600005188 598494568
843.9E98494568j069679j354180j144562p15637m7722K91291m81949o44264r07593
$$ 598494568 597424889 596070709 594926147 594210510 594162788 594454079 593972130 593327866 592420273
852.5E92420273m04587L06435o6491l5324N34592m1351o81572J09138L23601L51791
$$ 592420273 592015686 592322121 592255630 592220306 592754898 592713547 592031975 592141113 592464714 592816505
862.2E92816505Q02498J744881J987190K224655L152962K044754K014809K671737K023087
$$ 592816505 593619003 595363884 597351074 599575729 602728691 604773445 606788254 609459991 611483078
870.9F11483078J494217J878319J978683J335030K148170J264992J821785K907791
$$ 611483078 612977295 614855614 616834297 618169327 620317497 621582489 623404274 626312065
878.6F26312065J30577j298790m62913n21012k266693k348022j945954j043548o58760
$$ 626312065 626442642 625143852 624680939 624159927 621893234 619545212 617599258 616555710 615896950
887.3F15896950r84802j29776j583596k159767j835441j671525j959342k952576k094383
$$ 615896950 614912148 614782372 613198776 611039009 609203568 607532043 605572701 602620125 600525742
895.9F00525742j640358j259690j087341j94550N04876n96619j640129k716789k322808
$$ 600525742 598885384 597625694 596538353 596343803 596848679 596252060 594611931 591895142 589572334
904.6E89572334k746238l000069k184754k682456j933480o76574j068383k160377k462502
$$ 589572334 586826096 583826027 581641273 578958817 577025337 576348763 575280380 573120003 570657501
913.3E70657501k343292k818527l475456l358803l174248l428268k571831j578560
$$ 570657501 568314209 565495682 562020226 558661423 555487175 552058907 549487076 547908516
921E47908516j302300q51020p6981O28853m0054p47071q00133j795539j982079o66275
$$ 547908516 546606216 545755196 545678215 546307068 546267014 545519943 544719810 542924271 540942192 540275917
930.7E40275917K73705R81903J827011J276817O78749J760521J528587K39068p6485
$$ 540275917 540549622 541531525 543358536 544635353 545314102 547074623 548603210 548842278 548765793
939.3E48765793N3253K12135L26577P30171J190300J248817J651802J679192L84827
$$ 548765793 548819046 549031181 549357758 550087929 551278229 552527046 554178848 555858040 556242867
948E56242867q68340j859474k476158l056031l244629k760849k571525k097969k131119
$$ 556242867 555374527 553515053 551038895 547982864 544738235 541977386 539405861 537307892 535176773
956.7E35176773l101768l495560l066864k682152m067230n633392n200577n067139
$$ 535176773 532075005 528579445 525512581 522830429 518763199 513129807 507929230 502862091
964.4E02862091m390068m177780n284424m816475m444313m651642n739097o414261
$$ 502862091 498472023 494294243 489009819 484193344 479749031 475097389 469358292 462944031
972.1D62944031o978188p612304o735993o796074p084427p184181o276550n691185
$$ 462944031 455965843 448353539 441617546 434821472 427737045 420552864 414276314 408585129
979.8D08585129n357285n500602n909348n305443o285133n360451n004654m753456
$$ 408585129 403227844 397727242 391817894 386512451 380227318 374866867 369862213 365108757
987.6C65108757m284058l636512j153031j815109j735573j077118n29442j504592j311379
$$ 365108757 360824699 357188187 356035156 354220047 352484474 351407356 350877914 349373322 348061943
996.2C48061943l11737k164459p65000m05769k86407j29395L92914J301040M23813
$$ 348061943 347750206 345585747 344820747 344414978 344128571 343999176 344392090 345693130 346116943
1004.9C46116943Q59375n46875q74328j689682k072029j546975j735534j096001j847801
$$ 346116943 346976318 346429443 345555115 343865433 341793404 340246429 338510895 337414894 335567093
1013.6C35567093j93367l01705J23826K56614j529350j038971j313744p65724r44481
$$ 335567093 335373726 335072021 335195847 335452461 333923111 332884140 331570396 330804672 329860191
1022.3C29860191K18659n4054K69355Q65937J49459K339058N64041L55149K82669M62150
$$ 329860191 330078850 330024796 330294151 331160088 331309547 333648605 334212646 334567795 334850464 335312614
1031.9C35312614M45786j362228O4048l68843J164971K65693r765Q38165j00441J288376
$$ 335312614 335758400 334396172 334460220 334091377 335256348 335522041 335512276 336350441 336250000 337538376
1041.6C37538376n95780m43344o86416m62761o9351l28865O83746L20244K614135J442490
$$ 337538376 336942596 336499252 335812836 335350075 335280724 334951859 335635605 335955849 338569984 340012474
1051.2C40012474J416931J851311J048202J049080L95546J996270P51686K055244L018341
$$ 340012474 341429405 343280716 344328918 345377998 345773544 347769814 348521500 350576744 353595085
1059.9C53595085L074608L942947L600045M138946K497559K776184J998329J768799
$$ 353595085 356669693 360612640 364212685 368351631 370849190 373625374 375623703 377392502
1067.6C77392502J216507r70841j384887k605553j976433k704811k854690k642708
$$ 377392502 378609009 377638168 376253281 373647728 371671295 368966484 366111794 363469086
1075.3C63469086k412873k503700l245506j126595j129913N50652J98974L76320J893959
$$ 363469086 361056213 358552513 355307007 354180412 353050499 353601151 353800125 354176445 356070404
1084C56070404J855965L034515J694908K326317J829872K371712J793289J276322K353897
$$ 356070404 357926369 360960884 362655792 364982109 366811981 369183693 370976982 372253304 374607201
1092.7C74607201L66516K267647J185455R22127K017898J143074J631813N76172K77062
$$ 374607201 374973717 377241364 378426819 379348946 381366844 382509918 384141731 384717903 384994965
1101.4C84994965n88379M55360n58052l31840J951904J138611K060890J316910J980095
$$ 384994965 384406586 384861946 384303894 383972054 385923958 387062569 389123459 390440369 392420464
1110C92420464K197418J342201K11906k76222J271973K7122O23589P07092J163445
$$ 392420464 394617882 395960083 396171989 395895767 397167740 397194862 397818451 398525543 399688988
1118.7C99688988K029457J764564J805191N54238R13810M74663J126328O49795J30005
$$ 399688988 401718445 403483009 405288200 405842438 406756248 407230911 408357239 409007034 409137039
1127.4D09137039J501846J003190J933670K021103J228752J83868N56679L80325j301765
$$ 409137039 410638885 411642075 413575745 415596848 416825600 417009468 417566147 417946472 416644707
1136.1D16644707j375580k247696k306328k249756j223793j435432k427941k070159
$$ 416644707 415269127 413021431 410715103 408465347 407241554 405806122 403378181 401308022
1143.8D01308022k113533q13294j902771k003326k537499k903862j737099k078704
$$ 401308022 399194489 398381195 396478424 394475098 391937599 389033737 387296638 385217934
1151.5C85217934j060715j870270n81398j60560n29557J81809q6251Q37975j26305
$$ 385217934 384157219 382286949 381705551 381544991 381015434 381197243 381110992 381948967 381822662
1160.2C81822662R20639J335984J809539K286988K626800M159355L258400M067841
$$ 381822662 382743301 384079285 385888824 388175812 390802612 394961967 398220367 402288208
1167.9D02288208M340477M828491M202118M211121M763450L460694M075966L329010
$$ 402288208 406628685 411457176 415659294 419870415 424633865 428094559 432170525 435499535
1175.6D35499535M408187N595284N497818M709434M271813N475998M009857L128738
$$ 435499535 439907722 445503006 451000824 455710258 459982071 465458069 469467926 472596664
1183.3D72596664K629242K876549K873230K228508K943421K588272K803192K510223
$$ 472596664 475225906 478102455 480975685 483204193 486147614 488735886 491539078 494049301
1191D94049301K299881K136917J299172N19104j50376L75862k861J40458O57310O59828
$$ 494049301 496349182 498486099 499785271 500304375 500153999 500529861 500527000 500667458 501324768 501984596
1200.7E01984596J067047J156235J366310Q27713O86417N37529K09617K45896K81181
$$ 501984596 503051643 504207878 505574188 506401901 507088318 507625847 507835464 508081360 508362541
1209.4E08362541N13993M86030J069870J533814K083549J768646R10607J022186M86221
$$ 508362541 508876534 509362564 510432434 511966248 514049797 515818443 516729050 517751236 518237457
1218E18237457j93062q04290r90143m68216k76489k05651j03759j78185m8180J92910
$$ 518237457 518044395 517240105 516249962 515781746 515505257 515299606 515195847 515017662 514969482 515162392
1227.7E15162392q63076j371498j363105j933403j541710j160736p67594n15556k32353
$$ 515162392 514299316 512927818 511564713 509631310 508089600 506928864 506161270 505645714 505413361
1236.4E05413361J28555M64592N96580J15128K07291n92995p98073j678J21955O3439
$$ 505413361 505541916 506006508 506603088 506718216 506925507 506332512 505534439 505532761 505654716 505718155
1246E05718155K09045J545334K458267K318383J466217J111221Q67538K28310J77040
$$ 505718155 505927200 507472534 509930801 512249184 513715401 514826622 515694160 515922470 516099510
1254.7E16099510J40076K72179J39770O09551J232795J441345J679879J224746J265259
$$ 516099510 516239586 516511765 516651535 517261086 518493881 519935226 521615105 522839851 524105110
1263.4E24105110J240387N43175m03061k26707K34832l9253Q47702J480599J593322
$$ 524105110 525345497 525888672 525485611 525258904 525493736 525454483 526302185 527782784 529376106
1272E29376106J791954J392098Q62541O73904J99128l43018l23105o62880m39873P58782
$$ 529376106 531168060 532560158 533422699 534096603 534295731 533952713 533629608 532966728 532526855 533285637
1281.7E33285637J270523J134796J399231J592064R22050K79847k07405j70708k29683
$$ 533285637 534556160 535690956 537090187 538682251 539604301 539884148 539676743 539506035 539276352
1290.4E39276352o14319n05981k79122P5722O56853J073646Q37326L08342k03323r57794
$$ 539276352 538662033 538156052 537876930 537952652 538609505 539683151 540520477 540828819 540625496 539667702
1300E39667702j535950j280746p93000o58836k0828O13594O37550R14803J053238P11631
$$ 539667702 538131752 536851006 536058006 535399170 535378342 535991936 536629486 537544289 538597527 539309158
1309.7E39309158l00522j253700j551933j617012j348534p43446m02794k7161M55704
$$ 539309158 539008636 537754936 536203003 534585991 533237457 532494011 532091217 532064056 532519760
1318.3E32519760O22749N93758K82135l63541j115684j671867j501618j125030j029740
$$ 532519760 533142509 533736267 534018402 533654861 532539177 530867310 529365692 528240662 527210922
1327E27210922n47218K5330J52702J02653J57585k31628q05435j161614j518936j843796
$$ 527210922 526663704 526689034 526841736 526944389 527101974 526870346 526064911 524903297 523384361 521540565
1336.7E21540565j456260l67470j23444m4899J184121J284141P18460J10512k45705
$$ 521540565 520084305 519716835 519593391 519548492 520732613 522016754 522735214 522845726 522600021
1345.3E22600021n35507o86493r88884j011734l92837J78566P00683N52254M50439
$$ 522600021 522064514 521378021 520389137 519377403 518984566 519163132 519863815 520416069 520866508
1354E20866508J22719k12021l00064j176681j419029j340714j749267j463204m86793
$$ 520866508 520989227 520777206 520477142 519300461 517881432 516540718 514791451 513328247 512841454
1362.7E12841454K92396O21719P10869l59115k51732m47922j179657m94957j046448
$$ 512841454 513133850 513755569 514466438 514107323 513855591 513407669 512228012 511733055 510686607
1371.4E10686607r18197r58329j048202k11372O32782Q41827j12762O39572R43260
$$ 510686607 509768410 508810081 507761879 507550507 508183289 509025116 508912354 509551926 510495186
1380.1E10495186O24161J71280l11928J14517P51724J852608J292534J134033K361259
$$ 510495186 511119347 511290627 510978699 511093216 511844940 513697548 514990082 516124115 518485374
1388.7E18485374K152672J138382N67436K28653l97682j544494j802559K90565L06397
$$ 518485374 520638046 521776428 522343864 522572517 522174835 520630341 518827782 519118347 519424744
1397.4E19424744J7776o21223O99348J566277j21422J030k74811j726875l70026M11072
$$ 519424744 519442520 518821297 519520645 521086922 520965500 520966530 520691719 518964844 518594818 519005890
1407.1E19005890J34926m52996r9945P8965P3585r1705m52996q95652j278649r05113
$$ 519005890 519140816 518687820 518587875 518666840 518740425 518648720 518195724 517300072 516021423 515116310
1416.7E15116310j91193J44463k109032J342774K459907J254578N82695k57912J281739
$$ 515116310 514925117 515069580 512960548 514303322 516763229 518017807 518600502 518342590 519624329
1425.4E19624329R24759m18015n98373j035691j154861m50859P93953K3346K33993
$$ 519624329 520549088 520131073 519532700 518497009 517342148 516891289 517685242 517708588 517942581
1434.1E17942581J147537j81846l360291m09698J425247m60205m84238k92434o02990
$$ 517942581 519090118 518908272 515547981 515138283 516563530 516103325 515619087 515326653 514723663
1442.7E14723663K21558J15890O08025r3231m04053j918564n91964k35978k090988
$$ 514723663 514945221 515061111 515669136 515575905 515171852 513253288 512661324 512425346 510334358
1451.4E10334358j753235j980018m24805j321030j461486l010292j802903M342041
$$ 510334358 508581123 506601105 506176300 504855270 503393784 500383492 498580589 502922630
1459.1E02922630K28043J878128L15361L58276J138344j904831J496430J349144M510269
$$ 502922630 503150673 505028801 505344162 505702438 506840782 504935951 506432381 507781525 512291794
1467.8E12291794N122070P350006P617607N907250O843796L394775O912994L887215
$$ 512291794 517413864 524763870 532381477 538288727 545132523 548527298 555440292 559327507
1475.5E59327507L681488M175758L990822M118119K229118K700233J860466K071953
$$ 559327507 563008995 567184753 571175575 575293694 577522812 580223045 582083511 584155464
1483.2E84155464J569672J486969J533584l7803R19876O21414k65579k16561K117691
$$ 584155464 585725136 587212105 588745689 588707886 589627762 590249176 589983597 589767036 591884727
1491.9E91884727J502419o7062L94783j297684l342629J665574O23970j824570N10940
$$ 591884727 593387146 593320084 593714867 592417183 589074554 590740128 591364098 589539528 590050468
1500.6E90050468L39318r14307J67694P16744j05477o466064o954384J265869O65627
$$ 590050468 590389786 589475479 589643173 590359917 590254440 583788376 576833992 578099861 578765488
1509.3E78765488m59481N45197r16100j959037L40156j199226j925202k498207k557258
$$ 578765488 578306007 578851204 577935104 575976067 576316223 575116997 573191795 570693588 568136330
1518E68136330K487335J492729k068214k906533J59722K904587K005043j579476j322555
$$ 568136330 570623665 572116394 570048180 567141647 567301369 570205956 572210999 570631523 569308968
1526.6E69308968R0217q78753k07291K60086j95160J21803k154655k603798J758232
$$ 569308968 569399185 568520432 568313141 568573227 568378067 568499870 566345215 563741417 565499649
1535.3E65499649J058769P48863J233025j593895q533478J108399J040764Q83331K150116
$$ 565499649 566558418 567307281 568540306 566946411 558412933 559521332 560562096 561445427 563595543
1544E63595543O9084j44653K274360K185021J366844l03497r89571J616974J313629
$$ 563595543 563664627 563519974 565794334 567979355 569346199 569042702 568053131 569670105 570983734
1552.7E70983734J69335m97513K555389M529190K220383o237869q4916M754410M741097
$$ 570983734 571153069 570655556 573210945 577740135 579960518 573722649 573637733 578392143 583133240
1561.4E83133240K076416J155777L95965Q1063J335830K298470K820930K33841k332458
$$ 583133240 585209656 586365433 586761398 586842461 588178291 590476761 593297691 593531532 591199074
1570E91199074K891655K482719J47858P4005R24797o99387l705406J826706K312241
$$ 591199074 594090729 596573448 596721306 596795311 597720108 597020721 593315315 595142021 597454262
1578.7E97454262J082954R30710Q8387j50910l46489q58917r79271j972504j300888
$$ 597454262 598537216 599467926 599556313 599405403 599058914 598199997 597220726 595248222 593947334
1587.4E93947334o84662j93252l65067k88086l94935r70116r24682k003174k037011
$$ 593947334 593262672 593069420 592704353 592416267 592021332 591051216 590126534 588123360 586086349
1596.1E86086349k326698j873932k035331j631623j087379j521073j058235j761818
$$ 586086349 583759651 581885719 579850388 578218765 577131386 575610313 574552078 572790260
1603.8E72790260j052169j717759k710838l231049l426628l618354l424836j655998
$$ 572790260 571738091 570020332 567309494 564078445 560651817 557033463 553608627 551952629
1611.5E51952629k473411j691552k350616j400185j821480r733429p29484j824379
$$ 551952629 549479218 547787666 545437050 544036865 542215385 532481956 531752472 529928093
1619.2E29928093k488022l508797k314491l178177o369476p56493j594886r29070m182434
$$ 529928093 527440071 523931274 521616783 518438606 512069130 511312637 509717751 508788681 504606247
1627.9E04606247l689232j871796l132743k912789l679123j088676j605339m755669
$$ 504606247 500917015 499045219 495912476 492999687 489320564 488231888 486626549 481870880
1635.6D81870880l492584J24206k18620j047096j24436k136192l42216j974144p62978
$$ 481870880 478378296 478502502 478283882 477236786 477112350 474976158 474633942 472659798 471896820
1644.3D71896820j12114l703041O62651p54318K218437P51762K237206K446709k779313
$$ 471896820 471784706 468081665 468744316 467989998 470208435 470960197 473197403 475644112 472864799
1653D72864799n197830n81627L374443Q50068J402969J240120J977272K337990J581573
$$ 472864799 467666969 467085342 470459785 471309853 472712822 473952942 475930214 478268204 479849777
1661.6D79849777K465477K75002K972221J632462J622085J924095J366196J805039
$$ 479849777 482315254 482590256 485562477 487194939 488817024 490741119 492107315 493912354
1669.4D93912354O97135M034958K321778L523025L543244O66351J425247K885170K956619
$$ 493912354 494609489 498644447 500966225 504489250 508032494 508698845 510124092 513009262 515965881
1678E15965881J576615K214279J643333L027611M208412J435890q66737M341316N492630
$$ 515965881 517542496 519756775 521400108 524427719 528636131 530072021 529205284 533546600 539039230
1686.7E39039230K765656J583328K164269J652526K581521K607688L378106L666153
$$ 539039230 541804886 543388214 545552483 547205009 549786530 552394218 555772324 559438477
1694.4E59438477L604507J323013L709069M310836M180336N00260m792519N060501
$$ 559438477 563042984 564365997 568075066 572385902 576566238 577066498 572273979 577334480
1702.1E77334480L277245K152786J406403J405029J357651K305488K655869N74188
$$ 577334480 580611725 582764511 584170914 585575943 586933594 589239082 591894951 592469139
1709.9E92469139j81579N31959P29065K51122j794777L22914L563423J472969l402176
$$ 592469139 592287560 592819519 593548584 593799706 592004929 592327843 595891266 597364235 593962059
1718.5E93962059L942642L126450J186790l7536j558533j616631p26738j118507j548462
$$ 593962059 597904701 601031151 602217941 602180405 600621872 599005241 598278503 597159996 595611534
1727.2E95611534o23207q65631m342918l444787p4119r32732q862457j3878098j397552
$$ 595611534 594988327 594122696 589779778 586334991 586260872 585328140 576465683 562587585 561190033
1735.9E61190033k747803n348015m499626p349014q522110k040596k266197n550766
$$ 561190033 558442230 553094215 548594589 541245575 532723465 530682869 528416672 522865906
1743.6E22865906j726685n90210N54543J504707K943535O035805O108322J0488548
$$ 522865906 521139221 520549011 521103554 522608261 525551796 531587601 537695923 548184471
1751.3E48184471R073906J0919037J0769768J0136718J0575257Q365097R305229P328072
$$ 548184471 557258377 568177414 578947182 589083900 599659157 608024254 617329483 624657555
1759F24657555O750335N756607M490166N736237N255966M980392L687973L676453K372589
$$ 624657555 631407890 637164497 641654663 647390900 652646866 657627258 661315231 664991684 667364273
1767.7F67364273J19476K425614K572250L93677j814041P79495L473129K366028R41239
$$ 667364273 667483749 669909363 672481613 672875290 671061249 671840744 675313873 677679901 678621140
1776.4F78621140K144851J516266Q62351J82342r69696O18515P66907N90362j00250
$$ 678621140 680765991 682282257 683144608 683326950 682357254 682975769 683742676 684333038 684232788
1785.1F84232788O19431J923370J172104J206817J073990N8823K95792k166291q82644
$$ 684232788 684852219 686775589 687947693 689154510 690228500 690287323 690583115 688416824 687534180
1793.8F87534180J997909N84793l25241J274491J957855N83038O9504J359558o21796
$$ 687534180 689532089 690116882 689791641 691066132 693023987 693607025 693676529 695036087 694414291
1802.4F94414291m66156O26831j20391R8953J92337M35562Q75473O38733l31421P34863
$$ 694414291 693948135 694574966 694454575 694553528 694745865 695181427 696056900 696695633 696364212 697099075
1812.1F97099075J099472J43128K52609L0670K68631l31802j78375L66897J13602R42535
$$ 697099075 698198547 698341675 698594284 698624954 698893585 698561783 698383408 698750305 698863907 699806442
1821.7F99806442N47104J013260K43454k860413M08097J767730Q32901j219253k985993
$$ 699806442 700353546 701366806 701610260 698749847 699157944 700925674 701758575 700539322 697553329
1830.4F97553329J610489K042084L50037K65350L75595N26962o0730l61175M77905
$$ 697553329 699163818 701205902 701555939 701821289 702196884 702723846 702663116 702301941 702779846
1839.1G02779846p8735K26669J05972N19562n34973l626556J947632J923141J09711
$$ 702779846 702701111 702927780 703033752 703553314 703018341 699391785 701339417 703262558 703372269
1847.8G03372269j29471L18985N35354j48544j31988l49579K49557K69623Q4915N55039
$$ 703372269 703242798 703561783 704097137 703948593 703816605 703467026 703716583 703986206 704071121 704626160
1857.4G04626160k52762k00730J35956J41449m11300j46027L71933K8686K02713j34963
$$ 704626160 704373398 704172668 704308624 704450073 704038773 703892746 704264679 704293365 704496078 704361115
1867.1G04361115o3630p08160j37177P57599L72849O03103l7765l18146k30179R6817
$$ 704361115 704297485 703589325 703452148 704209747 704582596 705185699 705147934 704829788 704599609 704696426
1876.7G04696426K03629p1030J93482J72805L08915n2643p095m8295l18985K66190
$$ 704696426 704900055 704829025 705022507 705195312 705504227 705451584 705444489 705396194 705077209 705343399
1886.3G05343399J97983P0877o07605j165085L57056Q65249L52097M88281l6850o07986
$$ 705343399 705541382 705612259 705004654 703839569 704196625 705061874 705413971 705902252 705865402 705257416
1896G05257416M24881K30102q2016l0899O7215j72958l92609O8131r0103L80325K33230
$$ 705257416 705682297 705912399 705830383 705799484 705866699 705693741 705301132 705369263 705279160 705659485 705892715
1906.6G05892715k19192k9602J2741j14136j03912L55606l84064j01852L357J10550
$$ 705892715 705673523 705643921 705656662 705542526 705438614 705794220 705410156 705308304 705311661 705422211
1916.2G05422211O53381j761703m37088J259536N26047k13394j077194r6665N29328
$$ 705422211 706075592 704313889 703876801 705136337 705662384 705448990 704371796 704275131 704804459
1924.9G04804459M41055l23334m15039J79749J59607M20074K29492j47476j48697J85318
$$ 704804459 705245514 704922180 704507141 704686890 704846497 705266571 705496063 705348587 705199890 705385208
1934.6G05385208k62604m98733r1400J7700Q8272n0430M33120o39801j124191R26666
$$ 705385208 705122604 704623871 704532471 704550171 704638443 704588013 705021133 704381332 703257141 704183807
1944.2G04183807M70734l00522n0659J74179q3923l41187j49460J24283K15378R2773
$$ 704183807 704654541 704354019 704303360 704477539 704393616 704052429 703902969 704027252 704242630 704335403
1953.8G04335403j43814k86941L29666L04489j65024k78167l37143p4082O2332K77176
$$ 704335403 704191589 703904648 704234314 704538803 704373779 704095612 703758469 703684387 703746719 704023895
1963.5G04023895J755j54343K02256j17951l15780K98843J68762l82309j05743n05524
$$ 704023895 704025650 703871307 704073563 703955612 703639832 703938675 704107437 703725128 703619385 703113861
1973.1G03113861j16196P53327N4474m15192m1428M30069q8119j58157j84327m42199
$$ 703113861 702997665 703750992 703805466 703390274 703348846 703778915 703690796 703532639 703348312 702906113
1982.8G02906113R4528j59836J19476J87226l69339o6605L16086L26462l98102r75952
$$ 702906113 703000641 702840805 702960281 703147507 702778168 702711563 703027649 703354111 702956009 701980057
1992.4G01980057j76239L46222o1188j29776k00577K5330N26657j11923j31531p4463
$$ 701980057 701803818 702150040 702088852 701959076 701758499 701783829 702310486 702198563 702067032 701992569
2002.1G01992569j57623j35041l66363k72827m05884o332J73339j30310j55563L3417
$$ 701992569 701834946 701699905 701333542 701060715 700654831 700648499 700821838 700691528 700535965 700569382
2011.7G00569382J6327j19172L7690l76435o12030n93795k70539k08511r4147L86200
$$ 700569382 700585709 700466537 700504227 700127792 699515762 698921967 698651428 698442917 698348770 698734970
2021.3F98734970j907M959k71301k34070J14517l09067m51202n25055j81961k42844
$$ 698734970 698733063 698738022 698466721 698232651 698347168 698038101 697586899 697061844 696879883 696637039
2031F96637039k2812J14441j0376J72196l58811k00042l21351n22461k51312k80914
$$ 696637039 696614227 696728668 696718292 696890488 696531677 696331635 696010284 695487823 695236511 694955597
2040.6F94955597k62833N8060L04642q0109K86789j73264m69436K83279j91650m17481
$$ 694955597 694692764 694750824 695055466 694975357 695262146 695088882 694619446 694902725 694711075 694293594
2050.3F94293594k85492l5324k7389o2027l49655k65732M44717j2436O3324N7602n4626
$$ 694293594 694008102 693972778 693945389 693883362 693533707 693267975 693712692 693700256 693763580 693821182 693766556
2060.9F93766556o2790k54746K0523l43017k6245K96478L28522L21274L2882k26135
$$ 693766556 693703766 693449020 693469543 693126526 693100281 693396759 693725281 694046555 694079437 693853302
2070.5F93853302n93719j6404J67618r8801l21044k19269J94320L43857M69132k66419
$$ 693853302 693259583 693243179 693410797 693311996 692990952 692771683 692966003 693309860 693778992 693512573
2080.2F93512573m98962j35193j8234j88141q6899J38550k77634Q8120K41699K14691
$$ 693512573 693013611 692878418 692860184 692672043 692585144 692723694 692446060 692534180 692775879 692990570
2089.8F92990570J70288o1722O0501j9760l6163l43857j44729k09656k8610N03463
$$ 692990570 693160858 693099136 693159637 693139877 693103714 692759857 692615128 692405472 692376862 692880325
2099.5F92880325J24970K27127J10016n7068k16446l3112j75476p37076p8201J75247
$$ 692880325 693005295 693232422 693342438 693285370 693068924 693035812 692860336 692123260 692045059 692220306
2109.1F92220306K98081K24686J46484J99432j22757l10135k88238K40402j34354j87683
$$ 692220306 692518387 692743073 692889557 693088989 692966232 692656097 692367859 692608261 692473907 692286224
2118.7F92286224P325p3777J37024l8528K56042q4762j66779J52207j8082k31323m18854
$$ 692286224 692293549 692219772 692356796 692318268 692574310 692489548 692322769 692474976 692456894 692225571 691806717
2129.4F91806717l69644n47257L40729O46057J67389L7232o6987L69111L814j20849
$$ 691806717 691437073 690889816 691230545 691876602 692043991 692081223 692014236 692383347 692387161 692266312
2139F92266312k11335m65087l61252j65177L35923K11105J18866m7989J14670J15967
$$ 692266312 692054977 691589890 691228638 691063461 691399384 691610489 691729355 691681366 691796036 691912003
2148.6F91912003r5673K04697k82822n05142l39890k83661p4157L76968L99857M30984
$$ 691912003 691816330 692021027 691738205 691233063 690893173 690609512 690535355 690912323 691312180 691743164
2158.3F91743164N55496j29165n5924l55759m10537L1738k69394N722K53143N66636
$$ 691743164 692298660 692169495 692113571 691757812 691347275 691379013 691109619 691115341 691368484 691935120
2167.9F91935120K05154o7902K74964J13983K73819K43835p8964n07583m96216j54038
$$ 691935120 692140274 692072372 692347336 692461319 692735138 692978973 692900009 692392426 691896210 691742172
2177.6F91742172J58310L03650L80936M92630P7057J45263N8060Q774k2431k80609
$$ 691742172 691900482 692204132 692585068 693077698 693154755 693300018 693358078 693366852 693344421 693063812
2187.2F93063812j1902j2817J78299K39334O49185N54962r9792j4801j47400k8229
$$ 693063812 693051910 693039093 693217392 693456726 694105911 694660873 694561081 694546280 694398880 694370651
2196.9F94370651l16238k36435J07193Q3160K42844K82135M55704p8507J4649L78799
$$ 694370651 694054413 693817978 693925171 694008331 694251175 694533310 694989014 694910507 694925156 695303955
2206.5F95303955J46103l40424p89566j38015L09753L21655j32141Q5526N47027L08152
$$ 695303955 695450058 695109634 694320068 694182053 694491806 694813461 694681320 694766846 695313873 695622025
2216.1F95622025K77404n4321K9602m07638m59061o4392p3471L79028J13297J48391
$$ 695622025 695899429 695845108 695874710 695467072 695008011 694943619 694870148 695249176 695362473 695510864
2225.8F95510864N19638M39911n22613p27845L44086J51291p6981k62908m84467p1564
$$ 695510864 696030502 696470413 695947800 695219955 695564041 695715332 695638351 695375443 694890976 694819412
2235.4F94819412M66156L61481J00250K20719k21482j52740j11695r5062j61819k71683
$$ 694819412 695285568 695647049 695747299 695968018 695746536 695593796 695482101 695387039 695225220 694953537
2245.1F94953537K98691J47705J75934J84555R5749R7503j22986j77230r3155J18332
$$ 694953537 695252228 695399933 695575867 695760422 695856171 695953674 695830688 695653458 695560303 695678635
2254.7F95678635l38440k20414r3917Q6136O06307J63575k5406J46866K03170m90493
$$ 695678635 695340195 695119781 695025864 695112000 695718307 695881882 695856476 696003342 696206512 695716019
2264.4F95716019o25153k21100P8507L51791k04697j0986R9640K96249M89502K50473
$$ 695716019 695090866 694869766 694948273 695300064 695095367 695084381 695184021 695480270 695969772 696220245
2274F96220245j9378n26657n04151q32214J39694L49274k50550J68534j46790L65982
$$ 696220245 696200867 695674210 695170059 694337845 694477539 694826813 694576263 694744797 694598007 694963989
2283.7F94963989L16925K46811J6861m43802M044l90701j72882j38550J87607K96478
$$ 694963989 695280914 695527725 695544586 695100784 695104828 694714127 694541245 694402695 694590302 694886780
2293.3F94886780M1427M17710n6153m6844j94550j39694j18790L3494J04675m41055
$$ 694886780 694928207 695345917 695289764 695242920 695048370 694908676 694789886 694823380 694928055 694487000
2302.9F94487000L93447N58091N30014J62353N5695K68478l83911L68042j15433k79007
$$ 694487000 694880447 695438538 695968552 696130905 696186600 696455078 696071167 696439209 696323776 696044769
2312.6F96044769J27945k69775J15890M58K47803K06756O87867P59658m12368l99552
$$ 696044769 696172714 695902939 696018829 696019287 696267090 696473846 697161713 697921371 697509003 697109451
2322.2F97109451J61972j73492q30231Q56247J113892J45950N05295q5602m53644r04388
$$ 697109451 697271423 697097931 696267700 697123947 698237839 698383789 698889084 698803482 698349838 697445450
2331.9F97445450o43463k01493L68042J234818L55453L9826k59934j089630Q88367
$$ 697445450 696801987 696600494 696968536 698203354 698558807 698598633 698338699 697249069 698137436
2340.6F98137436J605148o12335j059341r74350j105729r78622j217117n78461O76804
$$ 698137436 699742584 699130249 698070908 697096558 695990829 695012207 693795090 693216629 693893433
2349.2F93893433J592712P95746N15671J287765L72086n69153l48969Q51593M80194
$$ 693893433 695486145 696281891 696797562 698085327 698457413 697888260 697539291 698390884 698871078
2357.9F98871078N50156p4692j083908l509q09784j263581l93905Q02307P12967o09665
$$ 698871078 699421234 699346542 698262634 698259125 697449341 696185760 695791855 696594162 697307129 696697464
2367.6F96697464r92279j056061j345444j139144k76032n4855k76337o34689l41416
$$ 696697464 695705185 694649124 693303680 692164536 691888504 691833649 691557312 690922623 690581207
2376.2F90581207q84933j292572J5793Q1787k87857p73468o07834O8512k33307j75018
$$ 690581207 689696274 688403702 688419495 688501282 688213425 687439957 686832123 686900635 686667328 686492310
2385.9F86492310l71933J8539J66168m83169k91214j71585j10321k98310J9074J68609
$$ 686492310 686120377 686138916 686305084 685821915 685530701 685359116 685248795 684950485 684969559 685138168
2395.5F85138168p9345J08261j9226O2561l18833n28030o88477o33087K84729K09732
$$ 685138168 685058823 685167084 685147858 685210419 684891586 684363556 683675079 683041992 683326721 683536453
2405.2F83536453k6703n4626o3782O8894j05668l11508m05273k94113k05918o4239
$$ 683536453 683509750 683455124 683391342 683460236 683354568 683043060 682637787 682343674 682137756 682073517
2414.8F82073517r918j42289k67028L0746M8828l98865k45437r2316P7210k34986p09228
$$ 682073517 682063599 681921310 681654282 681685028 681733856 681334991 681089554 680997238 681074448 680839462 680130234
2425.4F80130234k78015k61841n98831J0833N90058j02463n26199l11966k47727m01840
$$ 680130234 679852219 679590378 678991547 679002380 679592438 679489975 678963776 678651810 678404083 678002243
2435.1F78002243m50592k26746k45208o1493m65546l59344M17556O2790l3264R0637
$$ 678002243 677551651 677324905 677079697 677018204 676552658 676193314 676610870 676673660 676640396 676731033
2444.7F76731033J04676l74756q42133o61697l23181L99933J23748m42505l96041r3995
$$ 676731033 676835709 676460953 675618820 674957123 674633942 675033875 675157623 674715118 674319077 674225082
2454.3F74225082K66419K23465j48087q00476o84891j92184J49231k0676m75845m25949
$$ 674225082 674491501 674714966 674566879 673766403 673081512 672889328 673038559 673017883 672542038 672116089
2464F72116089k11640L19901m9439m28695j20697k22550k58560k93960p8659k94648
$$ 672116089 671904449 672224350 672174911 671746216 671625519 671402969 671144409 670850449 670771790 670477142
2473.6F70477142n60226n2414J80359L81M0131J55106l56598o07834l64685m09622
$$ 670477142 669916916 669864502 670044861 670045242 670085373 670240479 669883881 669276047 668911362 668501740
2483.3F68501740m45252p706p2250m40750K55890M19006L8071k34604m50592j40686
$$ 668501740 668056488 668048782 667976532 667535782 667791672 668210678 668248749 668014145 667563553 667422867
2492.9F67422867j39694k63520l33404j09482P9575j8998k7618k21329k89535k71378
$$ 667422867 667283173 667019653 666686249 666576767 666656342 666637344 666609726 666388397 666098862 665827484
2502.6F65827484P0191J24588k40632m83322n65338j98746R919J97067Q4534J7166
$$ 665827484 665897675 666022263 665781631 665298309 664732971 664534225 664544144 664741211 664825745 664842911
2512.2F64842911Q0566l67203k93121r3918k24457m41742m26788k07138j5869L17230
$$ 664842911 664923477 664556274 664263153 664169235 663944778 663503036 663076248 662869110 662853241 663170471
2521.9F63170471J40610k79694m23965l18298j48163j2055j48620m68216k63062k18658
$$ 663170471 663311081 663031387 662607422 662289124 662140961 662128906 661980286 661512070 661249008 661030350
2531.5F61030350l51868n1727L88717K62299m02451l42254k07977p12052n85174j30768
$$ 661030350 660678482 660626755 661015472 661277771 660875320 660533066 660325089 659613037 659027863 658897095
2541.1F58897095k62909m43573k72522L61481M23202k89993l67890m0741J33744l26920
$$ 658897095 658634186 658190613 657918091 658279572 658702774 658412781 658044891 658004150 658137894 657810974
2550.8F57810974o36215m84238m22363M0741k10877l23486K36740J84174o2409m05655
$$ 657810974 657174759 656690521 656268158 656308899 656098022 655774536 656011276 656195450 656133041 655727386
2560.4F55727386m35562j71585k4566l75901q94699n85708N3253J47171m7913J51749
$$ 655727386 655291824 655120239 655095673 654719772 653825073 653239365 653292618 653439789 653391876 653543625
2570.1F53543625j23596o17524k46810O7977m49218o72379n646P2937o2866j39999
$$ 653543625 653420029 652802505 652555695 652623672 652174454 651502075 651496429 651569366 651506500 651366501
2579.7F51366501k21253J73493R6664k68020n75714l68119j48544m26788j83716K5406
$$ 651366501 651145248 651318741 651415405 651147385 650571671 650203552 650055008 649628220 649444504 649469910
2589.4F49469910j45340l08075k20337J7242o0806j46103j11618n34592n92880j17645
$$ 649469910 649324570 649016495 648796158 648813400 648752594 648606491 648494873 647960281 647367401 647249756
2599F47249756k35672k93884l08915p9040l5629j70136N09415J77459m30526n31159
$$ 647249756 647014084 646720200 646411285 646332245 646296616 646126480 646635895 646813354 646382828 645851669
2608.6F45851669p59048n98145k32620j44195m43802n5008R002l02581k77100k30331
$$ 645851669 645092621 644494476 644261856 644117661 643673859 643618851 643627853 643325272 643048172 642817841
2618.3F42817841j984l48892l53623o47888r51538l44696r2850l7613l36609l86123
$$ 642817841 642815857 642466965 642113342 641465454 640513916 640169220 640076370 640038757 639702148 639316025
2627.9F39316025k85607j17988q469l33137l77274o46515o24199l49312l17764m63218
$$ 639316025 639030418 638912430 638903961 638570824 638193550 637547035 636922836 636573524 636255760 635792542
2637.6F35792542l91007k16064k93885j23748m38691l44734j61476m80118m92668m99191
$$ 635792542 635401535 635185471 634891586 634767838 634329147 633984413 633822937 633342819 632850151 632350960
2647.2F32350960l54347l97606J64108j1139q98132n64347m15496l24860k68288l19175
$$ 632350960 631996613 631599007 631763115 631751976 630853844 630289497 629874001 629549141 629280853 628961678
2656.9F28961678m93660n86663k49634m17785m51965j91956J2283M9897k31209o02455
$$ 628961678 628468018 627881355 627631721 627213936 626761971 626570015 626582298 626632195 626400986 625798531
2666.5F25798531m76571k90947m26559k45438m10347k25944j02348n66903n25131m3754
$$ 625798531 625321960 625031013 624604454 624359016 623948669 623722725 623620377 623053474 622528343 622484589
2676.1F22484589L22380l68882m76112n5580m37393o48384k98500j5755k93923k9144
$$ 622484589 622806969 622438087 621961975 621906395 621469002 620820618 620522118 620506363 620212440 620183296
2685.8F20183296k70691m61578J13563j73797l03497l40729k47765n00488o94885J1215
$$ 620183296 619912605 619451027 619564590 619390793 619087296 618746567 618498802 617998314 617303429 617314644
2695.4F17314644j79329n73998j93214n7373n86395k50435J32789l50914k05802j33477
$$ 617314644 617135315 616561317 616368103 616310730 615724335 615473900 615606689 615255775 615049973 614916496
2705.1F14916496m41436r14917m51279J68495k11792k89955o82068n16891O3514m2228
$$ 614916496 614475060 613560143 613108864 613277359 613065567 612775612 612093544 611576653 611640167 611597939
2714.7F11597939j54229l01933m20380n14602m89998o79207m66232l8529k20642K4758
$$ 611597939 611443710 611141777 610721397 610206795 609716797 609037590 608571358 608532829 608312187 608336945
2724.4F08336945L68995j52511r09500p31354l49922k87972m00543p48215l64609J09864
$$ 608336945 608705940 608553429 607643929 606912575 606562653 606274681 605874138 605125923 604761314 604871178
2734F04871178j53k14233k0981K44827k47345p51037p10068m11911j31798K1515m77715
$$ 604871178 604871025 604656792 604635811 604880638 604633293 603882256 603172188 602760277 602628479 602649994 602172279
2744.6F02172279o88057K17438J68839l54729j18904j04332k66266m80957o83327m82826
$$ 602172279 601484222 601701660 601870499 601515770 601396866 601292534 601026268 600545311 599861984 599379158
2754.3E99379158k31819k49329j76201q8195l09372j07308L11318j70136n01175k64015
$$ 599379158 599147339 598898010 598721809 598633614 598324242 598216934 598528252 598358116 597856941 597592926
2763.9E97592926m59328o20498m15078j39846q3275l58124l77884L31574J72500q48427
$$ 597592926 597133598 596513100 596098022 595958176 595874901 595516777 595138893 595470467 595642967 594794540
2773.5E94794540o20040o47164q54530k89650j50681j89514l09296J13755J81656n09339
$$ 594794540 594174500 593527336 592672806 592383156 592232475 592042961 591733665 591847420 592029076 591519737
2783.2E91519737m87365l81623n86242q68912q06504o67114m43763k9374r5405l94669
$$ 591519737 591032372 590650749 590064507 589195595 588389091 587721977 587278214 587248840 587153435 586758766
2792.8E86758766n39093l7498j45607p96128o57501p55844r05113p68051p05719q16422
$$ 586758766 586219673 586182175 586036568 585240440 584582939 583827095 582921982 582153931 581448212 580631790
2802.5E80631790p74536j10245L11013k48414q08830o82640q25767j001664j170349
$$ 580631790 579857254 579747009 580058022 579809608 579000778 578318138 577492371 576490707 575320358
2811.2E75320358j462707j042595n31044l75557m38957o05355q96148r81903o80275
$$ 575320358 573857651 572815056 572284012 571908455 571469498 570864143 569967995 568986092 568305817
2819.8E68305817r07669j506157j744843j468391j203499j249199j347656j253357
$$ 568305817 567398148 565891991 564147148 562678757 561475258 560226059 558878403 557625046
2827.6E57625046p90634r97353j844063j807518j646766k206803k380409k622490k551422
$$ 557625046 556834412 555837059 553992996 552185478 550538712 548331909 545951500 543329010 540777588
2836.2E40777588j598282j941223l049774l765793m160080m490433n834122o815452
$$ 540777588 539179306 537238083 534188309 530422516 526262436 521772003 515937881 509122429
2843.9E09122429p089996p736092q230896q609810q642616q201103p581292o718864
$$ 509122429 502032433 494296341 486065445 477455635 468813019 460611916 453030624 446311760
2851.7D46311760n466576l738784j895333k3346J625824L177452M253922M721908M807206
$$ 446311760 440845184 437106400 435211067 435187721 436813545 439990997 444244919 448966827 453774033
2860.3D53774033N029220N165444M179802L565406K881852J785812J109505M09660
$$ 453774033 458803253 463968697 468148499 471713905 474595757 476381569 477491074 477900734
2868.1D77900734p25o67381p45812p7743J14326N68810P33185N64079Q89435M94804
$$ 477900734 477900009 477232628 476486816 476409073 476523399 477092209 477825394 478389473 479278908 479773712
2877.7D79773712n17769o98433o90612r63021p49550m77066j010894j442070j161423
$$ 479773712 479255943 478557510 477866898 476903877 476154327 475677261 474666367 473224297 472062874
2886.4D72062874j219177j579972j953773k045822j849747j948433j852989j838341
$$ 472062874 470843697 469263725 467309952 465264130 463414383 461465950 459612961 457774620
2894.1D57774620j864967j725540j937676k147293k201386k248153k518616k688217
$$ 457774620 455909653 454184113 452246437 450099144 447897758 445649605 443130989 440442772
2901.8D40442772k636719k841453l304902l296546k919388l444443l670540l554649
$$ 440442772 437806053 434964600 431659698 428363152 425443764 421999321 418328781 414774132
2909.5D14774132m138222m585266n151634n771447o301307o635399o924667o977120
$$ 414774132 410635910 406050644 400899010 395127563 388826256 382190857 375266190 368289070
2917.2C68289070o480255o202087n798645n634003m683991l692436l394966j571655
$$ 368289070 361808815 355606728 349808083 344174080 339490089 335797653 332402687 330831032
2925C30831032L3150N63621R52148J621590K521286L153229L893165M649277M778137
$$ 330831032 330864182 331427803 332379951 334001541 336522827 339676056 343569221 348218498 352996635
2933.6C52996635M817658N568085O143989O231919N666008N258026N443344N444641
$$ 352996635 357814293 363382378 369526367 375758286 381424294 386682320 392125664 397570305
2941.3C97570305N338096N120202M745369M087562L793144L285942K421189J756744
$$ 397570305 402908401 408028603 412773972 416861534 420654678 423940620 426361809 428118553
2949.1D28118553R99832R66416J037712P20711M28199N93338R81064J022301J649818
$$ 428118553 429118385 430084801 431122513 431843224 432271423 432864761 433845825 434868126 436517944
2957.7D36517944K109757K129020K333832K336579K793083L932571M351845L912849
$$ 436517944 438627701 440756721 443090553 445427132 448220215 452152786 456504631 460417480
2965.5D60417480L781968L861122M208984M013214L423844L649444L790360L289413
$$ 460417480 464199448 468060570 472269554 476282768 479706612 483356056 487146416 490435829
2973.2D90435829K845154K983322K885819K758979K423973J753922K313919K616196
$$ 490435829 493280983 496264305 499150124 501909103 504333076 506086998 508400917 511017113
2980.9E11017113J985016J695633J592292J723595J450272J161460J557122J050186
$$ 511017113 513002129 514697762 516290054 518013649 519463921 520625381 522182503 523232689
2988.6E23232689O47621J225739Q17413J60103K47383R5024k25296K67677M13819n94521
$$ 523232689 523880310 525106049 525923462 526083565 526330948 526425972 526200676 526468353 526882172 526287651
2998.2E26287651j347008j197776q68378j492958j306992p23266j193695j143380j038360
$$ 526287651 524940643 523742867 522874489 521381531 520074539 519351273 518157578 517014198 515975838
3006.9E15975838m43802m4594o8970L24440M00544P70683P33223J092643J513100J224785
$$ 515975838 515532036 515487442 515418472 515742912 516143456 516914139 517647362 518740005 520253105 521477890
3016.6E21477890J166420R63745J067810R33953J199989Q25081k61917j1254K08512
$$ 521477890 522644310 523608055 524675865 525609818 526809807 527634888 527372971 527361717 527570229
3025.2E27570229L7117l86620j31416K68898N1498k27356k61497J38206n06668q93745
$$ 527570229 527607346 527220726 527089310 527358208 527409706 527182350 526920853 527059059 526552391 525658646
3034.9E25658646q75473o21376l2998m37889k58064j79901o14510m77066m55284q40225
$$ 525658646 524783173 524161797 524128799 523690910 523432846 523252945 522638435 522161369 521706085 520865860
3044.5E20865860r83315q71925q46062m05960m54368q02841j004754r23271n42335
$$ 520865860 519882545 519010620 518164558 517758598 517304230 516501389 515496635 514573364 514031029
3053.2E14031029n60189k84576m12369r12742j161385j046867q10967q20045k85225
$$ 514031029 513470840 513186264 512773895 511861153 510699768 509652901 508841934 508021889 507736664
3061.9E07736664R7503l57131r92089n05409n24445j132660p71141q93745p82814p65877
$$ 507736664 507834167 507477036 506484947 505979538 505455093 504322433 503551292 502657547 501874733 501108856
3071.5E01108856n10177k38686o19850n1346j31760p35092p61299o82068r44900p95060
$$ 501108856 500598679 500359993 499740143 499688797 499557037 498821945 498060646 497378578 496433678 495638618
3081.2D95638618n79490r67598o25611q05816o17409m21257n52826M9820n84030j082001
$$ 495638618 495059128 494091530 493465919 492660103 492042694 491621437 491068611 491118431 490534401 489452400
3090.8D89452400j270790j130905n94673m37737l51486q41370o37130l80707l60451
$$ 489452400 488181610 487050705 486456032 486018295 485666809 484825439 484188309 483807602 483447151
3099.5D83447151n32532p64350p16401j094894p77054o97403o96792n67017q80127
$$ 483447151 482914619 482150269 481433868 480338974 479561920 478864517 478167725 477600708 476720581
3108.2D76720581r04770q25996k97356j66435p54089r27887m03519p95479j391182
$$ 476720581 475815811 474989815 474692459 474526024 473771935 472844048 472440529 471645050 470253868
3116.9D70253868j093063j060753m23699l55835o63795q80089j059418m98657n94902
$$ 470253868 469160805 468100052 467676353 467320518 466656723 465776634 464717216 464218559 463623657
3125.5D63623657o04439j048317j331329o59485p56340r41581l42751N0430q46634
$$ 463623657 463019218 461970901 460639572 459980087 459223747 458282166 457939415 457989845 457143211
3134.2D57143211j048774q39196r79995r91097j234207p11250q84438j274910p44591
$$ 457143211 456094437 455255241 454275246 453284149 452049942 451338692 450454254 449179344 448434753
3142.9D48434753n17082n53245n34821l30048o75621j064949j109695j010056p41539
$$ 448434753 447917671 447364426 446829605 446499557 445823936 444758987 443649292 442639236 441897697
3151.6D41897697o01844p50351r20716o61850p85522q84438q92906n95207l13492j073341
$$ 441897697 441295853 440545502 439624786 438962936 438177414 437292976 436400070 435804863 435491371 434418030
3161.2D34418030j336899j211357j081200q93211n15366m17557p94143p67327r88349
$$ 434418030 433081131 431869774 430788574 429895363 429379997 428962440 428168297 427400970 426412621
3169.9D26412621o78902l15743l94477j178971j781120o58951o34308r32388p05643
$$ 426412621 425733719 425417976 425023499 423844528 422063408 421404457 420770149 419837761 419132118
3178.6D19132118p72362m36706o25801j004028j016770o08902p27119j203919q99277
$$ 419132118 418359756 417923050 417297249 416293221 415276451 414667549 413940430 412736511 411837234
3187.3D11837234n28030o91910q79631n98335n92384o91452q28667o84662n11818q72650
$$ 411837234 411309204 410617294 409737663 409139328 408546944 407855492 407026825 406342163 405830345 404957695
3196.9D04957695j088676j145211o33125n74036o77299o02188o16989j91346m17442
$$ 404957695 403869019 402723808 402090683 401516647 400839348 400237160 399620171 399428825 399011383
3205.6C99011383o97517j118851j169663q54034j054916q64983n09834k327n82771
$$ 399011383 398313866 397195015 396025352 395171318 394116402 393251419 392741585 392739258 392156487
3214.3C92156487j052170m82445r9678M4479q93936j292038j008034o83631m66233
$$ 392156487 391104317 390621872 390522194 390566673 389672737 388380699 387372665 386689034 386222801
3222.9C86222801q24661n62592n19981n52254l29246r10454j271858l38555N5046p75451
$$ 386222801 385398140 384835548 384315567 383763313 383434067 382523613 381251755 380913200 380968246 380192795
3232.6C80192795j002236q15124q56667q21762m18854k65388l74069m89655n18074
$$ 380192795 379190559 378375435 377518768 376697006 376278152 376012764 375638695 375149040 374630966
3241.3C74630966n85975j211014o86569l41645o76994m14085p51420o14662n54580
$$ 374630966 374044991 372833977 372147408 371805763 371128769 370714684 369963264 369348602 368794022
3249.9C68794022o43883m70200p30552p05185o69937p44248p59811n89257o39305m72984
$$ 368794022 368150139 367679939 366949387 366244202 365574265 364830017 364070206 363480949 362841644 362368660
3259.6C62368660l17268q51937p19795p0229J09025m41742p04766p55806q86574n70755
$$ 362368660 362051392 361199455 360479660 360409431 360518456 360076714 359371948 358616142 357729568 357158813
3269.2C57158813l54499m04969p85827m80767k64663p14531p01676o52847l51601k60772
$$ 357158813 356804314 356399345 355613518 355132751 354868088 354153557 353451881 352799034 352447433 352186661
3278.9C52186661n06211n11741m69551r27887p47681p7095n29976l84636o5574m62342
$$ 352186661 351680450 351168709 350699158 349771271 349023590 348946495 348416519 348031883 347966309 347503967
3288.5C47503967o91833l12500J29013k91023p56874p04155J56211k9449o66618k60506
$$ 347503967 346812134 346499634 346628647 346337624 345580750 344876595 345032806 345003357 344336739 344076233
3298.2C44076233m25339m90608m55437l34396m22096m63028k89307n46913k40021l46527
$$ 344076233 343650894 343160286 342704849 342370453 341948357 341485329 341196022 340649109 340409088 340062561
3307.8C40062561p01904q28285m54636j39542p34253n27610K174k09503r59091p34101
$$ 340062561 339360657 338532372 338077736 337938194 337203941 336676331 336678505 336469002 335509911 334775810
3317.4C34775810r5939J82495L05519p19528j001816o76041j03531j55296q94547j79939
$$ 334775810 334679871 334862366 335167885 334448357 333446541 332770500 332666969 332511673 331617126 331437187
3327.1C31437187l17344p68548n44815n21659k30294k25372n22842n80941m26407o42738
$$ 331437187 331119843 330351295 329806480 329284821 329054527 328829155 328306313 327725372 327298965 326656227
3336.7C26656227l03841r9182p07245q14209o62422m51278l38097n33714r83048r34524
$$ 326656227 326352386 326253204 325545959 324731750 324069328 323618050 323279953 322746239 321763191 320828667
3346.4C20828667l93334J00632j5793p80811p36752m64992j80569r3498k76394m63142
$$ 320828667 320435333 320535965 320520172 319739361 319002609 318537617 318357048 318263550 317987156 317524014
3356C17524014q20885k67964m33807j320095p43179k8687p82738r18884l03268n81322
$$ 317524014 316703129 316435165 316001358 314681263 313938084 313909397 313126659 312207775 311904507 311323185
3365.7C11323185k98195m13589o90022o70910o25057l0842o24847q05645n05429k82001
$$ 311323185 311024990 310611401 309921379 309250469 308625412 308594570 307969723 307164078 306658649 306376648
3375.3C06376648J4439n31540o37646o34594k16980j05801o11419k93370J29681J9741
$$ 306376648 306391087 305859547 305221901 304587307 304370327 304264526 303653107 303359737 303489418 303509159
3384.9C03509159o47545o20346k53467o20633p54451j64414J16291j45321k33802m49009
$$ 303509159 302861614 302241268 301987801 301367168 300612717 300448303 300564594 300419273 300185471 299736462
3394.6B99736462l60070J01567j20411r76353n25761K52228j33056j11504k14233l75462
$$ 299736462 299376392 299477959 299357548 298381195 297855434 298107662 297974606 297863102 297648869 297273407
3404.2B97273407m39491m29230J49574K83375q1501n68848l82728k95525k79903J40743
$$ 297273407 296833916 296404686 296554260 296837635 296756134 296187286 295804558 295509033 295229130 295369873
3413.9B95369873K94056K94933k09388k48642j41716p1507k18563m53053L45097M48284
$$ 295369873 295663929 295958862 295749474 295500832 295359116 295287609 295069046 294615993 294961090 295409374
3423.5B95409374J9684l17669J42307O01864l26843l57246J35555l24M43039O68468
$$ 295409374 295429058 295111389 295253696 295855560 295528717 295171471 295307026 295306702 295749741 296418209
3433.2B96418209m62894n25074L75003L15114L58867L48339J12152N97096R40933m08478
$$ 296418209 295955315 295430241 295805244 296120358 296479225 296827564 296939716 297536812 298477745 298069267
3442.8B98069267l97186L63159k9926Q57849M10156P9384N17712j16501M91085Q48293
$$ 298069267 297672081 298035240 298005314 298863163 299273319 299352703 299870415 299753914 300244999 301093292
3452.5C01093292O12011M49791K83795j05019L63254R95923R9334K51694M95987L15914
$$ 301093292 301705303 302155094 302438889 302333870 302697124 303693047 303792381 304044075 304540062 304855976
3462.1C04855976M18739P07245R47838M18129K42558J72767P32918J082077N94864
$$ 304855976 305274715 305981960 306929798 307347927 307590485 307763252 308496170 309578247 310173111
3470.8C10173111J79729J10398M27341N06325R69524Q84457O89983N57461L47862N26944
$$ 310173111 310352840 310463238 310890579 311396904 312366428 313250885 313940868 314498329 314846191 315373135
3480.4C15373135N20858M86489K75058J065007P22046M58603J234531M16450L81051
$$ 315373135 315893993 316380482 316655540 317720547 318442593 318901196 320135727 320552177 320933228
3489.1C20933228N68161R55390J030541M32777M68560Q15467J127015K71797R45968
$$ 320933228 321501389 322456779 323487320 323920097 324388657 325204124 326331139 326602936 327548904
3497.8C27548904J229325L75442M65012P97424J017494m51812n6305J001548J254311
$$ 327548904 328778229 329153671 329618683 330416107 331433601 330981789 330925484 331927032 333181343
3506.5C33181343J872864J364174K23388l42216J025963J134186J202430J248055O0119
$$ 333181343 335054207 336418381 336641769 336299553 337325516 338459702 339662132 340910187 340970306
3515.1C40970306L85743L93066R22089J631813J225280R56421R70269Q86306J74485
$$ 340970306 341356049 341749115 342671204 344303017 345528297 346484718 347454987 348341293 348515778
3523.8C48515778N97152J214409J271591N18990K55318Q32252J389961J621933Q53272
$$ 348515778 349112930 350327339 351598930 352117920 352373238 353205490 354595451 356217384 357070656
3532.5C57070656Q79745O05583J150170J231003L58467J162185P42035R40094J049347
$$ 357070656 357950401 358555984 359706154 360937157 361295624 362457809 363199844 364139938 365189285
3541.2C65189285R05915R92775J180725J438331O05393J264381J93596J120987K052917
$$ 365189285 366095200 367087975 368268700 369707031 370312424 371576805 371770401 372891388 374944305
3549.9C74944305J552964J980705j93253Q29087J201515J129417K130623J172562J384086
$$ 374944305 376497269 378477974 378284721 379113808 380315323 381444740 383575363 384747925 386132011
3558.5C86132011Q67424J001587O85044J747512J888924J47591L044472J516456l25966
$$ 386132011 386999435 388001022 388686066 390433578 392322502 392470093 395514565 397031021 396705055
3567.2C96705055J412j35994L330955K370720J412392J599464J844864J280670R08737
$$ 396705055 396706467 396570473 399901428 402272148 403684540 405284004 407128868 408409538 409318275
3575.9D09318275J811676R45130J764374J559600J371270K287330J820679J352539
$$ 409318275 411129951 412075081 413839455 415399055 416770325 419057655 420878334 422230873
3583.6D22230873J035919L311768J937637n75599J894912k49367J862259L056145K716370
$$ 422230873 423266792 426578560 428516197 427940598 429835510 429586143 431448402 434504547 437220917
3592.3D37220917J038551J103554L737373l53584R72099L064041J192131K141114P28035
$$ 437220917 438259468 439363022 443100395 442746811 443718910 446782951 447975082 450116196 450844231
3601D50844231J214981K588272K084160K164344L135910K423478j370659K971992R25827
$$ 450844231 452059212 454647484 456731644 458895988 462031898 464455376 463084717 466056709 466982536
3609.6D66982536r94491N623283J582337j743088K978706R69658L466187L577232M99229
$$ 466982536 465988045 471611328 473193665 471450577 474429283 475398941 478865128 482442360 482941589
3618.3D82941589J209183j48010J628914K995720K030296J709290J956253J996917
$$ 482941589 484150772 484002762 485631676 488627396 490657692 492366982 494323235 496320152
3626D96320152K053490M929695P87010p651024L088417L665352M107476J645698p21550
$$ 496320152 498373642 503303337 504090347 496439323 499527740 503193092 507300568 508946266 508224716
3634.7E08224716K562142K775154J649742N62668J500129J887970J812020R60769L00980
$$ 508224716 510786858 513562012 515211754 515774422 517274551 519162521 520974541 521935310 522236290
3643.4E22236290J941528K383690M061623r67064k721405M794922M53377o12450r35097
$$ 522236290 524177818 526561508 530623131 529656067 526934662 531729584 532182961 531570511 530635414
3652.1E30635414L156700L348351L335609M601631n705413L15055L864174J477776
$$ 530635414 533792114 537140465 540476074 545077705 539372292 539687347 543551521 545029297
3659.8E45029297J429481P36847K162628Q06695R51919J685524R92012L402138J546326
$$ 545029297 546458778 547195625 549358253 550164948 551116867 552802391 553794403 557196541 558742867
3668.5E58742867j91269J051750m936028J409378O353531O322518j499138j4319268
$$ 558742867 558551598 559603348 554667320 556076698 562430229 568752747 567253609 552934341
3676.2E52934341K505265P533149M824143j675491j045990K124977J941414J266593
$$ 552934341 555439606 562972755 567796898 566121407 565075417 567200394 569141808 570408401
3683.9E70408401P74804L36113L112449N284386p534561l960114O761971l493347k74392
$$ 570408401 571183205 571519318 574631767 579916153 572381592 568421478 575183449 571690102 571415710
3692.6E71415710M750176J170540K006454R70078j07460R05380O5231J883889K180404
$$ 571415710 576165886 577336426 579342880 580312958 580205498 581110878 581176109 583059998 585240402
3701.3E85240402l732376j916122L617592J246604j25465N97763K005806L291741n992127
$$ 585240402 581508026 579591904 583209496 584456100 584330635 584928398 586934204 590225945 584233818
3709.9E84233818J958580M193878r510154L015098K638741m40178J292305K198143
$$ 584233818 586192398 590386276 580876122 583891220 586529961 586089783 587382088 589580231
3717.7E89580231N91316k943573J405334N184861l365975m383240M356766R07707n54771
$$ 589580231 590171547 587227974 588633308 593818169 590452194 586068954 590425720 591333427 590778656
3726.3E90778656j715469k27814K831459P66487M738503j510964o577339O236763Q82149
$$ 590778656 589063187 588835373 591666832 592433319 597171822 595660858 589083519 595320282 596202431
3735E96202431o922455j223297K300224R74007J704979L183784k402954J922684R417763
$$ 596202431 589279976 588056679 590356903 591330910 593035889 596219673 593816719 595739403 605157166
3743.7F05157166r108620j4380341Q867836N436020N819855k671127j0465775R611549
$$ 605157166 596048546 581668205 590536041 595972061 601791916 599120789 588655014 598266563
3751.4E98266563l440933o878586M887886L366242L000145l347664M76875L942375
$$ 598266563 594825630 587947044 592834930 596201172 599201317 595853653 596330528 600272903
3759.1F00272903m576568j376915L654327J406822m59594K151298k231903l781433
$$ 600272903 595696335 594319420 597973747 599380569 598920975 601072273 598840370 595058937
3766.8E95058937K410851M309387R33151p607994P61490K816696O24847P39251k25182
$$ 595058937 597469788 601779175 602712326 595104332 595865822 598682518 599307365 600046616 599821434
3775.5E99821434R25407L53203J842957K04658n524559J981812J982918K87437J251450
$$ 599821434 600746841 601100044 602943001 603147659 597623100 599604912 601587830 601875267 603126717
3784.2F03126717k299462r11445M79583k53982P82509P41806N80940n37376j18943
$$ 603126717 600827255 599915810 600395393 600141411 600923920 601665726 602246666 601709290 601590347
3792.9F01590347J01586L41835K616501k162552l465576J714744L281593N077057m536209
$$ 601590347 601691933 602033768 604650269 602487717 599022141 600736885 604018478 609095535 604559326
3801.5F04559326r015579K930031K831039L636284L952980p255401m154473L436241
$$ 604559326 595543747 598473778 601304817 604941101 608894081 601638680 597484207 600920448
3809.3F00920448J544609K1782O53878O62460P30934L732185q29162j1195450L684235
$$ 600920448 602465057 602486839 603140717 603803177 604534111 608266296 607437134 596241684 599925919
3817.9E99925919M983596L528405J490516j4165077O19621M920655K072410K478867
$$ 599925919 604909515 608437920 609928436 595763359 596382980 601303635 603376045 605854912
3825.7F05854912Q04405l127975m60206P64733K017402J686974o708641J451302N672607
$$ 605854912 606659317 603531342 603071136 603835869 605853271 607540245 600831604 602282906 607955513
3834.3F07955513n169907n75142P604599m910469m649124N749054l890838j442719
$$ 607955513 602785606 602210464 609815063 604904594 600255470 606004524 602113686 600670967
3842.1F00670967M405403j909408j890259K673797J232033J09749J561241o63032J757812
$$ 600670967 605076370 603166962 601276703 603950500 605182533 605292282 606853523 606190491 607948303
3850.7F07948303N501595m675484p06978j2463875j55258Q443527M19770m94919J587257
$$ 607948303 613449898 608774414 608067436 595603561 595448303 603891830 604311600 603816681 605403938
3859.4F05403938J844521K466163m733009j306496M585343l077088l802146J948738
$$ 605403938 607248459 609714622 604981613 603675117 608260460 605183372 601381226 603329964
3867.1F03329964K178802L520928m584656p285614L749771O273575L250732q326988
$$ 603329964 605508766 609029694 604445038 597159424 600909195 607182770 610433502 602106514
3874.8F02106514k61459L597488l97110J022072L699608m331856o144066N242653J545830
$$ 602106514 601845055 605442543 605045433 606067505 609767113 605435257 599291191 604533844 606079674
3883.5F06079674K41775L485718r398193P07283L374939L95813M239654k35634p950363
$$ 606079674 606321449 609807167 600408974 601116257 604491196 604887009 609126663 608891029 600940666
3892.2F00940666M81453K743874M35791J467590L07617J575623J220512p990265L495217
$$ 600940666 601422119 604165993 604601784 606069374 606376991 607952614 609173126 601182861 604678078
3900.9F04678078K029457n360069K990570j484833p93114J538620N56564J323967l33442
$$ 604678078 606707535 601347466 604338036 602853203 602060089 603598709 604155273 605479240 605145798
3909.6F05145798k15569j72043k8305Q2093n36614Q17604J411286k370110k330856
$$ 605145798 604930229 604758186 604729881 604811974 604275360 605092964 606504250 604134140 601803284
3918.2F01803284L328857L63808l286667J668968J172943m59594j674042j430397J567764
$$ 601803284 605132141 605495949 602209282 603878250 605051193 604591599 602917557 601487160 603054924
3926.9F03054924R05037J131439M24271l52211R97276k720871j692772J602516o713
$$ 603054924 603959961 605091400 605515671 605163460 606160736 603439865 601747093 603349609 603342896
3935.6F03342896k52991L13301J89438J32103l50037J110840R84001l086357m99764
$$ 603342896 603089905 603403206 603592644 603724747 603374710 604485550 605469551 602383194 601883430
3944.3F01883430J066056M83169R64356j781807O29539J077614k140770N62172Q42819
$$ 601883430 602949486 603432655 604397011 602615204 603244743 604322357 602181587 602743759 603586578
3953F03586578M41208J41068k17209k00424j234856L1090k4948J21193p3166j241112
$$ 603586578 604027786 604168854 603951645 603751221 602516365 602547455 602522507 602643700 602570534 601329422
3962.6F01329422O36826M22706m55665J68914N73807Q88634k85797j206284k01607
$$ 601329422 601966248 602388954 601933289 602102203 602676010 603564644 603278847 602072563 601870956
3971.3F01870956L06130J4992L18451J22261m65889j93940K35749M18167P5607n70717
$$ 601870956 602177086 602192078 602510529 602632790 602166901 601972961 602208710 602626877 602702484 602131767
3980.9F02131767n14641m72297O0730J173401K15950l82843O06689M62418k99645r45968
$$ 602131767 601617126 601144829 601205559 602378960 602594910 602212067 602818756 603281174 602981529 602035561
3990.6F02035561p15638m30679m4136P41768L63731j64947n4627r3002n19714l06168
$$ 602035561 601319923 600889244 600845108 601586876 601950607 601785660 601731033 601638031 601118317 600812149
4000.2F00812149
$$ 600812149
##END=$$ End of the data block
