##TITLE=$$ Begin of the data block
##JCAMP-DX=5.00 $$ ACD/SpecManager v 10.08
##SPECTROMETER/DATA SYSTEM=Varian
##DATE=04 Dec 2012 13:51:30
##DATA TYPE=INFRARED SPECTRUM
##DATA CLASS=XYDATA
##ORIGIN=
##OWNER=
##NPOINTS=3735
##FIRSTX=399.26403809
##LASTX=4000.35498047
##MAXX=4000.35498047
##MINX=399.26403809
##MAXY=75.54912567
##MINY=34.49806595
##XFACTOR=1.0000000000
##YFACTOR=0.000000100000000
##FIRSTY=63.37327576
##DELTAX=0.96440572
##XUNITS=1/CM
##YUNITS=TRANSMITTANCE
##XYDATA=(X++(Y..Y))
399.3F33732758J35383p273102J732750j247749k834015k496147m809685O38580P935563
407.9F25514336K098732j069947K912178J924858k783279k760239L00751j536789N198555
416.6F29799156J3620949K438431j8544617J285744J133117j0007705o897812L665275
424.3F16492538N10025J466713P92885J817780K025757j617699O7100J824189q70133
433F22509155k635765m156265l362465K184448L452492K147255J538506o19660j408539
441.7F19649162O24390q22182q07876K18658l320656K210541M657974j977501m050407
450.4F16382103k302284K606010M151993L353119K113418j795311n146064n805817
458.1F13557167M295082K62375n082970K509919P202568K071037k059403l300476l437843
$$ y = [633732758, 633868141, 626595039, 628327789, 627080040, 624246025, 621749878, 616940193, 617578773, 625514336, 627613068, 626543121, 629455299, 631380157, 628596878, 625836639, 626137390, 624600601, 629799156, 643420105, 645858536, 627313919, 628599663, 629732780, 619725075, 612827263, 616492538, 617002563, 618469276, 619262161, 621079941, 623105698, 621487999, 621555099, 623379288, 622509155, 619873390, 615717125, 612354660, 614539108, 617991600, 620138855, 621677361, 621057701, 619649162, 620273552, 619451370, 618643494, 618862152, 615541496, 617752037, 622410011, 620432510, 616382103, 614079819, 616685829, 620837822, 624190941, 626304359, 624509048, 619362984, 613557167, 617852249, 618114624, 613031654, 615541573, 622744141, 624815178, 622755775, 619455299, 616017456]
466.8F16017456m6616J197815j350975n29060p76939j950684J007614j99509l148193
475.5F10220909N0926J305275k339706j734772R30901K64435R37271Q44459p353439
484.1F03126259k514839N099640P26814j399307j317940j310272r20334K739448K075501
492.8F06304970r58290q81615l153839j839104N82161L075485O4774k343865j11160
501.5F00739517n673141k494011K691994K037391l93600m218331l841324j645011M9552
510.2E87253036j626281p52869j81770k51045K218132m02680n221863m325332l32947
518.9E76376381l49655K010269J185455k652282j995011j179008N05371n83992k58484
527.5E73059044J323433J09520j088982o16836J537590j57013Q63075K700691N58434
$$ y = [616017456, 615970840, 617168655, 615817680, 615288620, 614511681, 612560997, 613568611, 613369102, 610220909, 610271835, 611577110, 609237404, 607502632, 608433533, 608697968, 609635239, 610479698, 603126259, 600611420, 605711060, 606437874, 605038567, 603720627, 602410355, 601490021, 604229469, 606304970, 605346680, 604465065, 601311226, 599472122, 600054283, 603129768, 603194542, 600850677, 600739517, 595066376, 592572365, 595264359, 597301750, 596908150, 592689819, 588848495, 587203484, 587253036, 585626755, 584873886, 584692116, 584441071, 586659203, 586256523, 581034660, 576709328, 576376381, 576026726, 578036995, 579222450, 576570168, 574575157, 573396149, 573901520, 573317528, 573059044, 574382477, 574491997, 573403015, 572786179, 574323769, 574166756, 575029831, 577730522, 578288956]
536.2E78288956J437530K017975K20985k05154J244545K948914J571579k905655j923828
544.9E82695847J196823P6523O23970k9107j390457p48253J998330J947975k540703
553.6E83830948k224236n50384J96762O73447m23050r98688p99484l33290j457367
562.3E77914658j500664k046776k407951j595269q39958m5929j129417k72865j407471
570.9E66668358k161522j731224j831207m37584p20215J135902R24454j99165Q7356
579.6E61735153J720314K144814k17629J453362J699486O66732J680642K991638J328315
588.3E75202827o7482K217598J444436l83759j095352O23207R44519p34901J001472
597E79152565J292801J233749m25567j328278L45421p66792j124001o15349N44968
$$ y = [578288956, 579726486, 581744461, 581965446, 581760292, 583004837, 585953751, 587525330, 584619675, 582695847, 583892670, 583969193, 584593163, 584564056, 583173599, 582425346, 584423676, 586371651, 583830948, 581606712, 581056328, 581253090, 581926537, 581503487, 580504799, 579705315, 579372025, 577914658, 576413994, 574367218, 571959267, 570363998, 569524040, 569478111, 568348694, 568075829, 566668358, 564506836, 562775612, 560944405, 560506821, 559786606, 560922508, 561846962, 561647797, 561735153, 563455467, 565600281, 565382652, 566836014, 568535500, 569202232, 570882874, 573874512, 575202827, 575135345, 577352943, 578797379, 578413620, 577318268, 577941475, 578885994, 578151093, 579152565, 580445366, 581679115, 581253548, 579925270, 580270691, 579503899, 578379898, 577764549, 578309517]
605.6E78309517J796455J253777j086502j022492J237221O41136k47879l37906J151772
614.3E81695099K168121K046395J566772k39639K92740J460876J611404J981812K308311
623E94891891J829949J120529J091423J704712K026176Q62847J0223M03977O59942
631.7F04601669K87934J268768J892090M00085J55907J45836r2697P28302J308708
640.4F10696602J048775J051521O39152k00233J192131J547050K82364k05726r9259
649F15952377M07868P92236Q02918p01714j202507j00899J279145J582870Q01888N10826
658.7F20125008j358300n41038J207771P60460P51076j23444K02294M60815j228943
667.4F20255699n863190K500687L251152P56149O72265J312179j65901n94139J424293
$$ y = [578309517, 580105972, 581359749, 580273247, 579250755, 580487976, 581129112, 580881233, 580543327, 581695099, 583863220, 585909615, 587476387, 587236748, 587529488, 588990364, 590601768, 592583580, 594891891, 596721840, 597842369, 598933792, 600638504, 602664680, 603527527, 603537750, 603941727, 604601669, 604889603, 606158371, 608050461, 608450546, 608606453, 608752289, 608659592, 609387894, 610696602, 611745377, 612796898, 613436050, 613235817, 614427948, 615974998, 616257362, 616051636, 615952377, 616360245, 617152481, 617955399, 617253685, 616051178, 615950279, 617229424, 618812294, 619614182, 620125008, 618766708, 618225670, 619433441, 620193901, 620944977, 620821533, 621023827, 621484642, 620255699, 614392509, 616893196, 620144348, 620900497, 621572762, 622884941, 622719040, 622124901, 623549194]
676.1F23549194J559334j05018O90422L80058L17154P76024L44848J22834m44298M18014
685.7F27608566K88887P75719Q56781o26488L66631Q01391O20575l18527q85887R8305
695.3F29585953p15103j716233p05642q4000j368866r74922k79350k72980o0921p63130
705F22644806j68228r35898j327705M38690N07736M32358N53474O32363P73811K79312
714.6F23830719L22075J521721J903496O39152j95389N89676J983605J599655J314888
723.3F33509598J711998J459617J600228P86972J111107K520218K125701K207108J269302
732F48301849O70929J587830J046982R86328J081238Q44421M63181L08303J493912
740.7F56784973J439133N4321L14942M87289j045837q72422j75323k41928j94855M8141
$$ y = [623549194, 625108528, 625003510, 625693932, 626073990, 626391144, 627167168, 627512016, 627634850, 627190552, 627608566, 627897453, 628673172, 629529953, 628903465, 629270096, 630071487, 630692062, 630373535, 629487648, 629585953, 628870850, 627154617, 626448975, 626364975, 624996109, 624021187, 623741837, 623468857, 623407936, 622644806, 622476578, 621540680, 620212975, 620651665, 621159401, 621591759, 622145233, 622777596, 623551407, 623830719, 624152794, 625674515, 627578011, 628217163, 628021774, 628611450, 630595055, 632194710, 633509598, 635221596, 636681213, 638281441, 639068413, 640179520, 642699738, 644825439, 647032547, 648301849, 648972778, 650560608, 651607590, 652593918, 653675156, 654519577, 654982758, 655291061, 656784973, 658224106, 658278427, 658593369, 659080658, 658034821, 657162399, 656987076, 656745148, 656550293, 656598434]
750.3F56598434O16990j146546k414017j362991j180420k132110k186432l1739Q75626
759F47636795k96478m72336j450l69415o07223N75332J320496Q57696P1335Q82263
768.6F49597015K538453K021179K127838J576462l08228Q82340K217178J646957J865540
777.3F64164734K668228J971436L86047O17599K228394K763443J943970l66288r67712
786F75409851R97162J319733J171188J498947J828308O34461l46756Q66165R76257
794.7F84355316J053085M06037J030655K134170N15213L55606R47876J635743P91320
803.4F93225021n46417N59158J593552J179733l5247M74853J027069J211929J131974
812F99821625o9962k89612q4610j03149l86581N37338J221390N63430K61689n70221
$$ y = [656598434, 657215424, 656068878, 653654861, 652291870, 651111450, 648979340, 646792908, 646761169, 647636795, 647340317, 646867981, 646866531, 646497116, 645889893, 646465225, 647785721, 648643417, 648714752, 649597015, 652135468, 654156647, 656284485, 657860947, 657552719, 658435059, 660652237, 662299194, 664164734, 666832962, 668804398, 669190445, 669808044, 672036438, 674799881, 676743851, 676377563, 675409851, 676407013, 677726746, 678897934, 680396881, 682225189, 682859650, 682512894, 683379059, 684355316, 685408401, 685814438, 686845093, 688979263, 689494476, 689850082, 690797958, 692433701, 693225021, 692678604, 693237762, 694831314, 696011047, 695975800, 696450653, 697477722, 698689651, 699821625, 699751663, 699462051, 699377441, 699274292, 698887711, 699425049, 700646439, 701209869, 701471558, 700901337]
821.7G00901337j045227p12128m73480q27637j476288j331405K48641P39518r91669
830.4F95031662j629868r44595j005249j461029j272507j340561j011428j187668j461640
839F83717117n84945r26133j006088j746597k182922r34678n76706k38800q45718q70895
848.7F73803635L50875J97983j069565j039428L46145k22168k63137J64642l38821
857.4F71930161K39486N1804K7618O11878M34188K81220R05991J961441J619033M91028
867F78553848J243744L405304L165436J647720J645508J798706J081543N21393J770706
875.7F94833908K271347P55081p31201l13721N56260R9563r67026j856231p31125o96030
885.3F93220825j451874j412735k249374j905975j241303j276092j357270j995086
$$ y = [700901337, 699856110, 699143982, 698670502, 697842865, 696366577, 695035172, 695283813, 696023331, 695031662, 693401794, 692457199, 691451950, 689990921, 688718414, 687377853, 686366425, 685178757, 683717117, 683132172, 682206039, 681199951, 679453354, 677270432, 676335754, 675759048, 675520248, 674674530, 673803635, 674154510, 674352493, 673282928, 672243500, 672589645, 672367477, 672104340, 672268982, 671930161, 672169647, 672221451, 672249069, 672860947, 673295135, 673576355, 674482346, 676443787, 678062820, 678553848, 679797592, 683202896, 686368332, 688016052, 689661560, 691460266, 692541809, 693063202, 694833908, 697105255, 697860336, 697129135, 696815414, 697371674, 697471237, 696504211, 694647980, 693916855, 693220825, 691768951, 690356216, 688106842, 686200867, 684959564, 683683472, 682326202, 680331116]
893F80331116k335739j339570o31484k74430K6245j015167j777649j996231j709137
901.7F69277954j213379j163177n96314o17599j238022j639328j998596j993790k054138
910.4F56763611k447815k450867k393112k020569j852798k356186k191773k150726
918.1F38899765j907921k493400k931214j593666r37195o74743j355133j537018J0109
926.8F25479584K11372p94945r11293m01802q8157J28212M57420Q97484Q41942R97123
936.4F26816940P10869r0103L96805P79419P67174J163826J184158P28187P47986P15599
946.1F33920860k56500o94160r60007j807022j852188j534577j914024k223702k545280
954.8F20133400k997437k423095l487053m365921k793694k750969l814888m366645
$$ y = [680331116, 677995377, 676655807, 676024323, 675749893, 675776138, 674760971, 672983322, 670987091, 669277954, 668064575, 666901398, 666305084, 665687485, 664449463, 662810135, 660811539, 658817749, 656763611, 654315796, 651864929, 649471817, 647451248, 645598450, 643242264, 641050491, 638899765, 636991844, 634498444, 631567230, 629973564, 629036369, 628361626, 627006493, 625469475, 625479584, 625690956, 624896011, 623984718, 623582916, 623494759, 623622971, 624080391, 624977875, 625819817, 626816940, 627527809, 627437706, 627834511, 628613930, 629381104, 630544930, 631729088, 632457275, 633205261, 633920860, 633664360, 632970200, 632010193, 630203171, 628350983, 626816406, 624902382, 622678680, 620133400, 617135963, 614712868, 611225815, 606859894, 604066200, 601315231, 597500343, 593133698]
962.5E93133698m181328m422646l806419l686257m648857m538154n890427o255608
970.2E55704002o243705n547867n583382p496147o945114o525231n965766o621819
977.9E04774971p289505p463570o921081n568390o448822o478653o188431m325256
985.6D54091263m497757n058746m023552l897438k836457l232879k028695j946945
993.3D26568794j639213j194344j291923p82586j828422L42483k10571j071586j94664
1002D18697968L2501J42135m94880J59988j651878j541939j585388j637268j314087
1010.7D10807152j871414m34685k135925j901436j902466q37975q1443j736336n82581
1019.4C99322891j504936j94740M64668L11432J58577k7962P60307K26365J550064
$$ y = [593133698, 588952370, 584529724, 580723305, 577037048, 572388191, 567850037, 561959610, 555704002, 549460297, 543912430, 538329048, 530832901, 523887787, 517362556, 511396790, 504774971, 497485466, 490021896, 483100815, 477532425, 471083603, 464604950, 458416519, 454091263, 449593506, 444534760, 440511208, 436613770, 433777313, 430544434, 428515739, 426568794, 424929581, 423735237, 422443314, 421660728, 419832306, 420174789, 419964218, 418892632, 418697968, 418730469, 418872604, 418377724, 418537712, 416885834, 415343895, 413758507, 412121239, 410807152, 408935738, 408501053, 406365128, 404463692, 402561226, 401723251, 401641808, 399905472, 399322891, 397817955, 397623215, 398087883, 398399315, 398557892, 398529930, 399290237, 399516602, 401066666]
1028.1D01066666O01616P68165L6392m0359J354904M66156J127396q8425N17387k861
1037.7D05807037J89400M42276p59659R68285Q08830J205254q87680j38131J006775
1046.4D08642387L60032J155166m42848J557732R71336J323662K342491J575203J927299
1055.1D19412460J514550K875480J733971K639656K789268K781182L818245L443756
1062.8D41008568L959312K875328L733559J882896J522065J627845p01980r33686k978439
1071.5D51995468l110657m013443l791084l282280l089218j986580k563705j018105
1079.2D29140396j662941N36308P13273l28980J235199J284599K900429J370239J403923
1087.9D36592445K141762K898216K910195K539863L080445J185264J702500J276207
$$ y = [401066666, 401668282, 402436447, 402472839, 402432480, 403787384, 404253540, 405380936, 405292511, 405809898, 405807037, 405996437, 406438713, 405679054, 406647339, 407456169, 408661423, 407773743, 407635612, 408642387, 409002419, 410157585, 409714737, 411272469, 412243805, 413567467, 415909958, 417485161, 419412460, 420927010, 423802490, 425536461, 428176117, 430965385, 433746567, 437564812, 441008568, 444967880, 447843208, 451576767, 453459663, 454981728, 456609573, 455907593, 454973907, 451995468, 448884811, 444871368, 441080284, 437798004, 434708786, 432722206, 430158501, 429140396, 427477455, 428013763, 428727036, 428398056, 429633255, 430917854, 433818283, 435188522, 436592445, 438734207, 441632423, 444542618, 447082481, 450162926, 451348190, 453050690, 454326897]
1095.6D54326897J708870J572494J574555J626663k03095J300965Q00323Q61168m96597
1104.2D63072243m6349J813812L92228K043838J888580J562806O24809J456070K683639
1112.9D75491676J493340J170120j38283R40743O63948J820679K114524O18058J276550
1121.6D85451355J97601R52339P23229K086487K391700N84565J034317R54742J683006
1130.3D96059341J211472J995773J116410p4234K93388n81512n55993k073783j866951
1139D95523911k300568k420921j888543k517471j561508k526665k339706k901917k580604
1147.6D74486008j733628j897506j844178k592277p44400j584816j397057j084594
1155.4D61607552j103211J06545k04087J457100R81789J892357K089996J711426K450294
$$ y = [454326897, 456035767, 457608261, 459182816, 460809479, 460606384, 461907349, 462707672, 463568840, 463072243, 463025894, 464839706, 465231934, 467275772, 469164352, 470727158, 471351967, 472808037, 475491676, 476985016, 478155136, 478016853, 478957596, 479621544, 481442223, 483556747, 484174805, 485451355, 485648956, 486601295, 487324524, 489411011, 491802711, 492387276, 493421593, 494376335, 496059341, 497270813, 499266586, 500382996, 500308762, 500602150, 500020638, 499464645, 497390862, 495523911, 493223343, 490802422, 488913879, 486396408, 484834900, 482308235, 479968529, 477066612, 474486008, 472752380, 470854874, 469010696, 466418419, 465674019, 464089203, 462692146, 461607552, 460504341, 460610886, 460406799, 461863899, 462845688, 464738045, 466828041, 468539467, 470989761]
1164D70989761K567635L536034K910385M492378M139786L804397M653054M708557N625724
1172.7E07427711M430275M263192L939628M346085N002670M151192L982048M139900
1180.4E41682701M455147L688049L326225L316803L138276K896385K556228K572861
1188.1E67632675K342987J876946J497650J933479J395493R12323J291809J015549
1195.9E79898911P21359m7951J33171O04363K67257K08321K79312L61404L04642J011505
1205.5E83742294J039810N85480P66106P84645J013756R24682L83377M48342J339874
1214.2E91028366J177902O05889Q87222Q67996o3553q87413m41627k53067j77384j71280
1223.8E92573051n57670n72472p74002n02739o94618r51767j056061j245308p21473
$$ y = [470989761, 473557396, 477093430, 480003815, 484496193, 488635979, 492440376, 497093430, 501801987, 507427711, 511857986, 516121178, 520060806, 524406891, 529409561, 533560753, 537542801, 541682701, 546137848, 549825897, 553152122, 556468925, 559607201, 562503586, 565059814, 567632675, 569975662, 571852608, 573350258, 575283737, 576679230, 577591553, 578883362, 579898911, 580620270, 580572319, 580705490, 581309853, 581577110, 581785431, 582064743, 582426147, 582730789, 583742294, 584782104, 585367584, 586133690, 586918335, 587932091, 588856773, 589240150, 589688492, 591028366, 592206268, 592812157, 593699379, 594567375, 594503822, 593616409, 593174782, 592921715, 592744331, 592573051, 592015381, 591442909, 590668907, 590166168, 589471550, 588519783, 587463722, 586218414, 585496941]
1232.5E85496941r46083q37288l19634J19400n25513j084175j50909k06451J25045
1241.2E81671333K16370j36414j47018K55127P72438N19180Q71086P90520Q99811P52029
1250.8E86464462O64826J099968Q97789J096763N89829M77791P17201Q18634Q42934
1259.5E93670197N68504P39441J1558R2964Q48847J108017Q31833O18095J236191O17599
1269.2F00343246O12488J278115P49626K40059L78379P63894N42106M13323N27115
1277.8F05848351O51588O65321M42543M43879K38800K56271M68063O49872R24034O86760
1287.5F11275482M0283j41754N48401N56564r8991J11351j82342n51186j04523n9318
1297.1F11393967j04142m5242j97067j99547k6016p7782k47764q4572R9487j30806
$$ y = [585496941, 584550858, 583713570, 583393936, 583513336, 582987823, 581903648, 581752739, 581546288, 581671333, 581887703, 581751289, 581604271, 581859398, 582631836, 583151016, 584022102, 584812622, 585712433, 586464462, 587129288, 588229256, 589127045, 590223808, 590813637, 591291428, 592008629, 592827263, 593670197, 594238701, 594978142, 594989700, 595082664, 595931511, 597039528, 597871361, 598489456, 599725647, 600343246, 600955734, 602233849, 602983475, 603223534, 603601913, 604365807, 604907913, 605321236, 605848351, 606499939, 607165260, 607607803, 608051682, 608290482, 608546753, 609014816, 609664688, 610588722, 611275482, 611315765, 611174011, 611722412, 612278976, 612179985, 612291336, 612108994, 611557808, 611453285, 611393967, 611289825, 611244583, 611047516, 610847969, 610821953, 610744171, 610496407, 610411835, 610511322, 610380516]
1306.8F10380516l74336k29149K899m2801j10893m3259l10058n54924l74909l49464
1316.4F07993622l38097k08244o03104j023636m16984j7357l17688m31519n53054o42128
1326F03441811n49660m22211n80978p66487p38640q09708n41038m34952n76973l26042
1335.7E97695122k05498m62761j4801q316j019134l67280N19257N38597R1515q8616
1345.3E96678085k04696n1537L92456J42822l99093n29785l82119n22308k54478k22435
1355E94646912p75566l63732n44662n22004J4306n56374n43175m21371j910782r06563
1364.6E88116989K49710o24351n11589m6540l60374m5433l57781J96534K58407r57145
1374.3E85918427j098786m20380r8228n57480L11546R11446J002960O20537P7095N32875
$$ y = [610380516, 610006180, 609777031, 609779930, 609737129, 609626236, 609582977, 609272919, 608717995, 608343086, 607993622, 607655525, 607447281, 606844177, 605820541, 605403557, 605386200, 605068512, 604636993, 604083939, 603441811, 602892151, 602469940, 601888962, 601122475, 600383835, 599574127, 599033089, 598598137, 598021164, 597695122, 597489624, 597026863, 597012062, 597003746, 595984612, 595617332, 596136589, 596675186, 596766701, 596678085, 596473389, 596421852, 596814308, 596957130, 596558037, 596028252, 595646133, 595123825, 594869347, 594646912, 593871346, 593507614, 592962952, 592440948, 592455254, 591898880, 591355705, 590934334, 589023552, 588116989, 588366699, 587742348, 587230759, 587184219, 586823845, 586778412, 586420631, 586617165, 586875572, 585918427, 584819641, 584399261, 584301033, 583743553, 584055099, 584966545, 585969505, 586590042, 586667137, 587200012]
1383.9E87200012N37224J555100K106246N79949O96182J291313O37703M91982O44836
1392.6E95740547O23131%j078682k83165j08032N56221o51741j007462P36656j2512
1402.2E94514961k9602L43476p27082p48138m2763J74141N6992p1793k16103n73845
1411.9E92680244j063079l06473k11144n3672M15687l8299Q91037j941338L1433J861610
1421.5E92266006P47567Q60672o47621K96936J118278L06892J50147j91956n97419
1430.2E94309502p72934M86297k6436q18481M25682J206207k390899j730805J729813
1438.9E92417946N7945j09062L01018l66211j28670r03778k96173M6844J08414j632957
1448.5E89495316m07296L56560j304893j356240j924896j6060j05057m86297k903824
$$ y = [587200012, 587737236, 589292336, 591398582, 591978531, 592674713, 593966026, 594603729, 595095711, 595740547, 596363678, 596363678, 595284996, 595001831, 594893799, 595450020, 594798279, 593790817, 594527473, 594514961, 594485359, 594828835, 594101753, 593353615, 593310852, 593484993, 593541985, 593470192, 593254089, 592680244, 591617165, 591310692, 591099548, 591045876, 591461563, 591423264, 592314301, 590372963, 590404396, 592266006, 593013573, 593874245, 593226624, 593523560, 594641838, 594948730, 595098877, 594906921, 594309502, 593536568, 594022865, 593996429, 593177948, 593603630, 594809837, 592418938, 590688133, 592417946, 592475891, 592366829, 592667847, 592301636, 592172966, 591269188, 590973015, 591019859, 591128273, 589495316, 589088020, 589444580, 588139687, 586783447, 584858551, 584842491, 584737434, 584251137, 581347313]
1457.2E81347313k826767L672790j68685J738395O15616M04472J641312j835136R78546
1465.9E85567856J649093L862229L688392N672188P245674N843888P186394L397369
1473.6F24113083M949608L752250K430840L026543L781204L451309K527161K846679
1481.3F50878677J314469J670990J343765J284561J846771L79563P17468J927567O01577
1490F61965408k752456O15234J275406J35574J224747R99985l531571Q83866O91986
1498.7F61508179k800980R11636K45972j494064j50223J183777J993103m512329p417908
1507.3F49467163O5460Q04749n30548K10952j078186l259201J64795l19290J86691
1516F45712585j75705m625701K427139K883148R5673k093506k441864J324463J870422
$$ y = [581347313, 578520546, 582193336, 582024651, 583763046, 584378662, 584783134, 586424446, 584589310, 585567856, 587216949, 591079178, 594767570, 600439758, 607685432, 613529320, 620715714, 624113083, 629062691, 632814941, 635245781, 638272324, 642053528, 645504837, 648031998, 650878677, 652193146, 653864136, 655207901, 656492462, 658339233, 658718796, 659436264, 661363831, 661965408, 659212952, 659828186, 661103592, 661239166, 662463913, 663463898, 659932327, 660816193, 661508179, 658707199, 659618835, 659864807, 658370743, 658220520, 659404297, 661397400, 656885071, 649467163, 649532623, 650337372, 649806824, 650017776, 648939590, 645680389, 645845184, 645525894, 645712585, 645536880, 640911179, 643338318, 646221466, 646317139, 644223633, 641781769, 643106232, 644976654]
1524.7F44976654r80072r13620L94363j513366j73493J338120L25470J012726j206513
1533.4F43260269n439911J396179J808243J346665K315368q1253p765426K015342O04592
1542.1F39460068p37801K381249P68737j232986J362305J352157J820450J557541j668015
1550.7F45063705Q28629K102890K358017l47748l65219M462967L944702j575851k717820
1559.4F53754272l163604N016937K823563K106933J521607m09928K71836J649704K486114
1568.1F66057434J850891l118744p1640J890946N46035M88663J858673Q80890o478195
1576.8F63904953Q37402K123795l2730k76947n10712j59225o21109j111298j067657
1585.5F63086472r54514l61786j169052r75876j334152j193619j333008j319580j269760
$$ y = [644976654, 643996582, 643082962, 643477325, 641963959, 641790466, 643128586, 643454056, 644466782, 643260269, 637820358, 639216537, 641024780, 642371445, 644686813, 644605560, 636840134, 638855476, 639460068, 638722267, 641103516, 641872253, 640639267, 642001572, 643353729, 645174179, 646731720, 645063705, 645892334, 647995224, 650353241, 650005493, 649640274, 654103241, 658047943, 656472092, 653754272, 650590668, 655607605, 658431168, 660538101, 662059708, 661649780, 661921616, 663571320, 666057434, 667908325, 664789581, 664717941, 666608887, 667154922, 667643585, 669502258, 670383148, 663904953, 664742355, 666866150, 666833420, 666556473, 666045761, 665886536, 665265427, 664154129, 663086472, 662131958, 661770172, 660601120, 659625244, 658291092, 657097473, 655764465, 654444885, 653175125]
1594.1F53175125k122345r20334j381683j378250j918259j736374j410446j881714
1601.9F40425720j226692k549248k144775k017937j825371k378883j883697j984139
1609.6F24414978l443603j635743k964706k433319k613907j043549o93016j0473442
1617.3E99113693p19909j168366j535683k638931j394119j798248p641488j307182
1625E80909767j284714q12149m004974m010735j802749k506523j667786k777710j00708
1633.7E61941719P82089n573768m922562N58586j168594j390419k0981j950073J27754
1642.4E48383751n67055Q92563J200638k935181Q86002j818733Q78334O76345K566529
1651E50163193M019127K28538o207085j129760K895584J458053J696129J143837J458588
$$ y = [653175125, 651052780, 650132446, 648750763, 647372513, 645454254, 643717880, 642307434, 640425720, 639199028, 636649780, 634505005, 632487068, 630661697, 628282814, 626399117, 624414978, 620971375, 619335632, 616370926, 613937607, 611323700, 610280151, 609587135, 599113693, 598393784, 597225418, 595689735, 593050804, 591656685, 589858437, 582216949, 580909767, 579625053, 578812904, 574807930, 570797195, 568994446, 566487923, 564820137, 562042427, 561941719, 562723808, 557150040, 552227478, 552786064, 551617470, 550227051, 550206070, 548255997, 548383751, 547816696, 548709259, 549909897, 546974716, 547860718, 546041985, 546920319, 547596664, 550163193, 554182320, 554410858, 548203773, 547074013, 549969597, 551427650, 553123779, 554267616, 555726204]
1659.7E55726204K037811K240219K484284j057892K745552K519569K080498K935181
1667.4E71711426L028793P72591K34756L705788N88722K344971M023666K430649l28331
1676.1E88513031J974754L401184K544594K806816N37758K322808M895553K718620
1683.8F09715118l417129M26559M432564L105621J526070K380982J232910J849403
1691.5F21252098K577057K357635L227540L265495k781372K489815M350967N081444
1699.3F41820679P92465p779007N511398L582077J345597l19519P90710n28717n00641
1707.9F44715042J309509j74484m38690M49676J017762J969986L21045k27662K890015
1716.6F51832199L824234m962082J89438K581787J348343R42917j24817o60553l21579
$$ y = [555726204, 557764015, 560004234, 562488518, 561430626, 564176178, 566695747, 568776245, 571711426, 574740219, 575512810, 575747566, 579453354, 580042076, 582387047, 586410713, 588841362, 588513031, 590487785, 593888969, 596433563, 599240379, 599778137, 602100945, 606996498, 609715118, 606297989, 606724548, 611157112, 614262733, 615788803, 618169785, 619402695, 621252098, 623829155, 626186790, 629414330, 632679825, 629898453, 632388268, 636739235, 641820679, 642613144, 634834137, 640345535, 643927612, 645273209, 644953690, 645744400, 645215683, 644715042, 646024551, 645850067, 645411377, 645861053, 646878815, 648848801, 649169846, 648942184, 651832199, 655656433, 650694351, 650883789, 653465576, 654813919, 655756836, 655632019, 654971466, 654649887]
1725.3F54649887n56106q33436r14917j50985k505493l455582J74560R95331l226242
1734F44177017j1722564j258660o59599k475205j190796l441352p143288q81615J92261
1742.7F15596199l056564j028061J033325K120132K649575L392830M477615N804596
1750.4F30989647Q052139M943352P920837P438050O750335P382660N345764O753617
1758.1F85576401N543365N459824N653152K674027K744980L940658L424225K348480
1765.8G17365112K386475K176285o69556J957016L848801J671066j169281j113892
1773.5G26452026L104935K209625r35974J389237J046066J082077Q08487r28955J104355
1782.2G35331879J398697J140976m23737m89883J533126O23856L53088J352997Q78067
$$ y = [654649887, 654093781, 653260345, 652345428, 652194443, 649688950, 646233368, 646407928, 647403259, 644177017, 632454453, 631195793, 630536194, 628060989, 626870193, 623428841, 616285553, 615403938, 615596199, 612539635, 611511574, 612544899, 614665031, 617314606, 620707436, 625185051, 630989647, 639041786, 643985138, 651905975, 659344025, 666094360, 673477020, 678822784, 685576401, 691119766, 696579590, 702232742, 704906769, 707651749, 711592407, 715016632, 717365112, 719751587, 721927872, 721258316, 723215332, 727064133, 728735199, 727565918, 726452026, 729556961, 731766586, 730830612, 732219849, 733265915, 734347992, 735156479, 734227524, 735331879, 736730576, 737871552, 737447815, 736957932, 738491058, 739114914, 739468002, 740820999, 741699066]
1790.9G41699066J038132k069855j857681K433166J103974p58057O18134J658401K99530
1799.5G44164810j051025J545028j3504m17175Q74558j41449K85110J60141q7051J242447
1809.2G46561890J233062j441345m17023R61228N5313M05273K11029L80097l23563
1817.9G47625961J36338J185073J22529L49502k76794O34231J467896k457886j019363
1826.5G47767487J668090J998673N50003l166123M72565J875839n9738l78418m03824
1835.2G50324554J81122L37601l27148N94558N95474Q59528K10724J299896J414948
1843.9G55491257n163346k6397J483230J63574j58157K3193N46036Q6594M12826j68533
1853.6G52690277k55661l14102m01306K13318J06048M65012Q6593L74756j11999j74790
$$ y = [741699066, 742737198, 740667343, 738809662, 741242828, 742346802, 741588745, 742206879, 743865280, 744164810, 743113785, 744658813, 744645309, 744228134, 745102692, 744961243, 745246353, 745406494, 745319443, 746561890, 747794952, 746353607, 745936584, 746897812, 746953125, 747358398, 747569427, 747949524, 747625961, 747762299, 748947372, 749069901, 749419403, 749142609, 749776840, 751244736, 748786850, 747767487, 749435577, 751434250, 751984253, 748818130, 749290695, 751166534, 751106796, 750728378, 750324554, 750505676, 750843277, 750516129, 751110687, 751706161, 752565689, 752776413, 754076309, 755491257, 750327911, 750301514, 751784744, 751948318, 751790161, 751813354, 752359390, 752445984, 752858810, 752690277, 752434616, 752120514, 751719208, 751932526, 752038574, 752503586, 752590179, 752964935, 752852936, 752678146]
1863.2G52678146J94703J41448R50776k50550O41556l77045k431793O14777Q04672
1871.9G52966690L03574l47290k87094m9897K03781K04239j53808L09143J56479L42025
1881.5G53647842k92587k02179Q9111l26690K29339j10626J080170N92499k397309
1890.2G52309570L4104J284027K94647L85666j82571j023179J86921K70233r9411n3864
1899.8G53406143J08566J58921k64588R7275P2174j32675k13852R6054K33383j36642
1909.5G53424759m89502m44336Q81805M45099J02997j74789M9286J497116j842346
1918.2G53450089j481934J061325J73111M78668m23202j064453L31420N91584k74735
1926.8G52841873j36108N6152j62277k1515J4572L06091n88760l39508L82156J32599
$$ y = [752678146, 752872849, 753014297, 753965073, 753714523, 754356079, 753979034, 751547241, 752162018, 752966690, 753270264, 752922974, 752635880, 752585983, 752789764, 752994003, 752840195, 753149338, 753305817, 753647842, 753355255, 753153076, 753242187, 752915497, 753144836, 753034210, 754114380, 754706879, 752309570, 752343674, 753627701, 753922348, 754308014, 754125443, 753102264, 753289185, 753559418, 753460007, 753406143, 753514709, 753673630, 753409042, 753506317, 753578491, 753445816, 753231964, 753328018, 753561401, 753424759, 752935257, 752490921, 753372726, 753817825, 753920822, 753746033, 753795319, 755292435, 753450089, 751968155, 753029480, 753202591, 753681259, 753258057, 752193604, 752525024, 753116608, 752841873, 752705765, 752761917, 752599640, 752578125, 752592697, 752898788, 752310028, 751970520, 752352676, 752485275]
1936.5G52485275j94397m51278L25241l891J022033P24106k372513r9334P42187j83563
1946.1G51993866j15204O9046p3547l12348r5749R3155K44599J2665N1422q0185l815
1956.7G51783905K97852j42136k61459k34452J51368J97830P4920J60981k7390R1629
1966.4G52093048l80936n07431R079o4468j16730L4485l1967o4850J47934L07007P1793
1977G51496964o55213n03921J09329L67050L81241j64643m09927l46222J60370N01862
1986.6G50936890K84347j51520o27212K39105N33142q62808o18286M30069K38113j65939
1996.3G50235901l65448l27835O9351L3569j20163k03552n7602O8970j32370L357K1286
2006.9G49225464k78015l73535n9357J15204L814k06070k55432l9978q2092l06930
$$ y = [752485275, 752290878, 751839600, 752164841, 752160950, 753182983, 753907089, 751534576, 751435242, 752177429, 751993866, 751878662, 751947708, 751874161, 751561813, 751466064, 751559219, 751803818, 751816483, 751867905, 751787720, 751783905, 752081757, 751939621, 751678162, 751443710, 751595078, 751792908, 751867828, 752028809, 752001419, 752093048, 751712112, 751204681, 751213760, 751149292, 751032562, 751067047, 751035080, 750970230, 751118164, 751425171, 751496964, 750841751, 750337830, 750447159, 750814209, 751195450, 751030807, 750620880, 750274658, 750435028, 750936890, 751221237, 751069717, 750442505, 750681610, 751214752, 750351944, 749733658, 750163727, 750401840, 750235901, 749870453, 749542618, 749611969, 749645538, 749525375, 749321823, 749264221, 749333191, 749200821, 749204178, 749225464, 748947449, 748573914, 748514557, 748629761, 748633575, 748427505, 748172073, 748132095, 748050003, 747743073]
2016.5G47743073m04282O6681j14212l02277Q3847p2403l8376m20990k41241K15836
2026.2G46515656j35346j69449j35269L9063m07029m94613o6147n7068j06354k64129
2035.8G44719315m197p8125j05896n4321J76315P5455m21753M3640k32620k37961j6632
2046.4G43863220J53275L23410m06952k31934j0452Q0566j34964l15246P6980n6152
2056.1G43341751k36053m26789K06986K19650k17438m7302m425M96445n2643m96521
2065.7G42783661q6823j20697j65329k9983L66592L28827R9411k4795K288j02539n7296
2076.3G42993317L7689l58505k24457J65710K88086Q2474R4604n0964l09524k03248
2086G42515182k55126K11944Q4534j45569K0447q6518J27259J15432R8572j29928j5488
$$ y = [747743073, 747338791, 747405472, 747291260, 746988983, 747072830, 747000427, 746962051, 746541061, 746299820, 746515656, 746380310, 746210861, 746075592, 746114655, 745707626, 745213013, 745146866, 745089798, 744983444, 744719315, 744715118, 744636993, 744531097, 744476776, 744653091, 744728546, 744306793, 744350433, 744117813, 743879852, 743863220, 744016495, 744339905, 743932953, 743701019, 743690567, 743771133, 743636169, 743320923, 743397903, 743341751, 743105698, 742678909, 742885895, 743105545, 742888107, 742840805, 742836380, 743332825, 743280182, 742783661, 742696838, 742576141, 742410812, 742380829, 742747421, 743076248, 743175659, 743150864, 743153152, 743050613, 742993317, 743031006, 742672501, 742448044, 742613754, 742901840, 742984314, 743078918, 743027954, 742718430, 742515182, 742260056, 742472000, 742556534, 742410965, 742431412, 742344894, 742472153, 742587585, 742686157, 742556229, 742540741]
2096.6G42540741J01700k43759j49384J28632L72467Q621L7613R9029k26669j11771
2106.2G42557220j54876R2697L86505J144o09970k78091J71890L28980K91214m04816
2115.9G42381897p1487M7760n13154k10800M42124M22058o6300O3782R8419M2572l79791
2126.5G42257080o90002j48316J93711K67944M3259L53622M56238j43891k87780m04969
2136.1G41896896n18112p8049M55475O8970j40076N1346j82800j58386K60467K33078
2145.8G41888809k36740j59454n5390K09198J03150j37635L62244K17438j53885m40216
2155.4G41597519j70517J48315K59476K17896l49350J14059P4387j88904R15Q9798
2165G41793594O23169M02909p3395n28565k19650L00293R842L6621K11258J65176k56195
$$ y = [742540741, 742642441, 742398682, 742249298, 742377930, 742750397, 742759018, 742796631, 742895660, 742668991, 742557220, 742402344, 742495041, 742881546, 742882690, 742272720, 741994629, 742166519, 742495499, 742786713, 742381897, 742310410, 742358170, 741845016, 741634216, 742076340, 742498398, 742432098, 742495880, 742594299, 742636871, 742257080, 741567078, 741418762, 741612473, 741880417, 741923676, 742277298, 742733536, 742589645, 742301865, 741896896, 741378784, 741300735, 741756210, 741825180, 741685104, 741736450, 741553650, 741395264, 741655731, 741888809, 741652069, 741492615, 741437225, 741646423, 741749573, 741611938, 741974182, 742191620, 742037735, 741597519, 741427002, 741575317, 741834793, 742052689, 741703339, 741817398, 741891785, 741702881, 741703796, 741793594, 742416763, 742819672, 742746277, 742217712, 741998062, 742298355, 742308197, 742344818, 742556076, 742721252, 742465057]
2175.6G42465057k03247J42594L90167J05667j35574K55432l1662J01013m9515j07422
2185.3G42932510K48642j64489M6615L19748L65906L7384k96326k28653P935K83508
2194.9G43552780p2708l0594J53275O3400j33820R7199L96118m0665r9029q5983N34
2205.5G43800507J56631K64359R7808k6626J09863r8572K19498p4539m47006j07651
2215.2G43894272J63650L92151J90659P9422n3177J62582P2480J17569L23791l62778
2224.8G44980621l53012j88446J79672K40326j80740j69678N0888K50550l34244r7504
2234.5G44378433J72196j14365p7438q7357J73111j05209k52152m7683L29589L47214
2244.1G44716339k32010l87954J0299N97916J47476k14157k88391j96457K35367k85645
$$ y = [742465057, 742261810, 742404404, 742794571, 742900238, 742764664, 743020096, 742988434, 743089447, 743039932, 742932510, 743181152, 743016663, 743063278, 743383026, 743748932, 743786316, 743489990, 743261337, 743269272, 743552780, 743480072, 743449478, 743602753, 743666153, 743532333, 743629532, 744025650, 743984985, 743885956, 743799973, 743800507, 743957138, 744221497, 744319305, 744292679, 744402542, 744303970, 744523468, 744448929, 744001923, 743894272, 744057922, 744450073, 744640732, 744720154, 744666977, 744829559, 744902039, 745019608, 745343399, 744980621, 744627609, 744439163, 744618835, 744859161, 744678421, 744508743, 744559631, 744810181, 744475937, 744378433, 744550629, 744436264, 744358826, 744271469, 744444580, 744339371, 744087219, 744039536, 744369125, 744716339, 744484329, 744096375, 744106674, 744704590, 744852066, 744637909, 744349518, 744153061, 744388428, 744102783]
2253.8G44102783m50592N20859O74744o39115m68826P8430P6523M47769k34528j76391
2263.4G43931656j06506j03913K52075L3875j91727l32565L21045j16959m17557J68381
2273G43437805R7122J70288K30790K33993j47095Q5373J31226j10321j50528m14810
2282.7G43563843k69242k05154N45731J25885m33655l24707n64957L5553K1515O14243
2292.3G43109055K84957l45459j10702o10886j07193K0295K46124j51596o03867N9128
2302G41789856q4686j32141R7427J30997q90198l48587K36587n00946n5008j9302L42560
2312.6G40566559p70340o74591P13043k5253k36512m69207j11008j65253N5085m3259
2322.2G38839264j114502q90274m91791L82767m1199K83661j39236o05774K29873o13327
$$ y = [744102783, 743652191, 744173050, 744847794, 744208679, 743739853, 743818283, 743894806, 744342575, 744108047, 743931656, 743825150, 743721237, 743973312, 744007187, 743815460, 743482895, 743803940, 743686981, 743269424, 743437805, 743534927, 743705215, 743936005, 744169998, 744022903, 744108276, 744239502, 744129181, 743978653, 743563843, 743294601, 743089447, 743635178, 743761063, 743327408, 743002701, 742437744, 742473297, 742494812, 743109055, 743394012, 743048553, 742937851, 742326965, 742219772, 742240067, 742486191, 742334595, 741730728, 741789856, 741705170, 741573029, 741670456, 741801453, 740911255, 740562668, 740799255, 740298309, 740243301, 740223999, 740566559, 739796219, 739121628, 739834671, 739809418, 739572906, 739103699, 738992691, 738827438, 738882523, 738839264, 737724762, 736834488, 736342697, 736725464, 736684265, 736967926, 736828690, 736222916, 736452789, 735839462]
2331.9G35839462K79770M8676k7161n44739j259842N3177l81012M61579J77154p48443
2341.5G33898621m22898l74908J56936K72675J79520L02200J607895J499557J12305
2350.2G37231903j099625j067962k53220j689224k105866R56345J367569r93652j384583
2358.9G30961685j268081l10669J976242J173935p61261j269226j036835m75769J302719
2367.6G30292740J129837J7471L71018p7134R68552J148377J79748J53275J89209K51236
2377.2G34624329J02539L61404M3030R2239O83289O94732L34244j08566Q0414J0452
2386.8G36918106q9569m50974n56411k12097l13111N09033N14756j76850j63040P553
2396.5G35987396O0730m53415k54898K3575j70822k89230j37482J55182j1826P3242
$$ y = [735839462, 736119232, 736167908, 736140747, 735596008, 734336166, 734389343, 734008331, 734469910, 734647064, 733898621, 733475723, 733100815, 733257751, 733530426, 733709946, 734012146, 735620041, 737119598, 737231903, 736132278, 735064316, 734811096, 733121872, 731016006, 731972351, 733339920, 732346268, 730961685, 729693604, 729382935, 731359177, 732533112, 731771851, 730502625, 729465790, 728990021, 730292740, 731422577, 731440048, 731811066, 731733932, 732702484, 733850861, 734030609, 734183884, 734373093, 734624329, 734726868, 735088272, 735131302, 735223541, 735906830, 736601562, 736935806, 736827240, 736907654, 736918106, 736828537, 736377563, 735821152, 735609055, 735295944, 735804977, 736319733, 736142883, 735979843, 735987396, 736048126, 735594711, 735339813, 735363388, 735192566, 734903336, 734765854, 734921036, 734909210, 734982452]
2406.1G34982452p3242n65872m39377j5716q7052o7062K670j34201J27640j45340k78854
2416.7G33306046k44599j76086J47934m64783l83301J81427r4681k00653k21176l74451
2426.4G31475677k65884j74637K4338J63040k77252j50147J27793j07346m55703l14103
2436G30045776Q4610k57492l1280j71890n56565k31094j90354L37067L68729k78092
2445.7G29119415o48651l48282r8266m05121l18527k54822K44369L55835k19268m03977
2455.3G27022705k64664j23291k95410J97373L02047l33480l44315Q697M3564k98538
2465G25914688n29098k99988J65939k43683p4920J66549m58679k90756l87192m8294
2474.6G23914566L90625j05820o25991m13743K29187Q927O9961j09100k78702j46713
$$ y = [734982452, 734909210, 734343338, 733903961, 733888245, 733801193, 733734131, 733736801, 733602600, 733730240, 733584900, 733306046, 733061447, 732885361, 733033295, 732568512, 732185211, 732366638, 732271957, 732071304, 731850128, 731475677, 731209793, 731035156, 731059494, 731222534, 730945282, 730795135, 730922928, 730815582, 730359879, 730045776, 730130386, 729872894, 729841614, 729669724, 729113159, 728882065, 728691711, 729028778, 729397507, 729119415, 728470764, 728122482, 728024216, 727619095, 727300568, 727045746, 727290115, 727645950, 727426682, 727022705, 726758041, 726634750, 726339340, 726536713, 726838760, 726505280, 726160965, 726169662, 726213226, 725914688, 725385590, 725085602, 725251541, 725007858, 724932938, 725099487, 724640808, 724350052, 723962860, 723914566, 724305191, 724199371, 723573380, 723159637, 723388824, 723397751, 723467712, 723358612, 723079910, 722933197]
2484.2G22933197k87018J28937m4174k41623l07770k67715r7657q5754P7667j5716
2493.9G21792374J45034m01382m38919J25809k27890m4480K84577K06375k14691l63999
2503.5G20862808k87246j37940j4038l28598k94724l65295k01263j1444K80532M84543
2513.2G19987335m54178p50045l09906N5389K97012J62430l89557m98352P706L8299
2522.8G18146133J62735N1880l13644l73993j59836K1515k48032j70822J45951J08718
2532.5G17370605m62341m47464j30691j74866m425k98844j23519o11k78702j34506
2542.1G15314636k06680k51694k21176q3313l8605K12708P6599k48642j67313m91409
2551.7G13895111j42975j03302l40957j37787k59247k9907j17340k67640r9182K20413
$$ y = [722933197, 722646179, 722775116, 722730942, 722489319, 722181549, 721913834, 721816177, 721730423, 721808090, 721792374, 721937408, 721536026, 721097107, 721222916, 720995026, 720950546, 721235123, 721441498, 721226807, 720862808, 720575562, 720437622, 720423584, 720094986, 719800262, 719434967, 719233704, 719222260, 719502792, 719987335, 719533157, 718783112, 718473206, 718528595, 718825607, 718988037, 718598480, 718100128, 718107834, 718146133, 718308868, 718360748, 718047104, 717673111, 717513275, 717534790, 717286758, 717115936, 717261887, 717370605, 716908264, 716460800, 716330109, 716155243, 716150818, 715851974, 715728455, 715727844, 715449142, 715314636, 715107956, 714856262, 714635086, 714551773, 714513168, 714725876, 714802475, 714553833, 714386520, 713895111, 713752136, 713648834, 713307877, 713170090, 712910843, 712880936, 712763596, 712495956, 712396774, 712617187]
2561.4G12617187J60141m76531l51716j47857o7597L434m00849l10287J04522j02691
2571G11027756m88205m39224j91422j74789j17035N3863K8229J00861k56806m37164
2580.7G09106064K8076q1558l22800l43399k28882j48086j26419k30484Q1558L51867
2590.3G08085937o39953m79736K09579K14615O10o29349j78298M1732j34201k09045
2600G06281891m06723m10767n66025j48544j29623k97165j99127J57089K45514m67911
2609.6G04058609j10168n3864n71213l74908l8300j9378k34681j42059l09830m22515
2619.3G01781693l22953j04141l87650n40466J71662l5401k96554n02701n48477j22910
2628.9F99092102j25122k24686l66363k26593m52423l00370j52740l51639J96228O4316
$$ y = [712617187, 712777328, 712300797, 711949081, 711801224, 711733627, 711737061, 711336212, 711025925, 711130447, 711027756, 710539551, 710100327, 709908905, 709734116, 709617081, 709670944, 709699173, 709800034, 709543228, 709106064, 709134140, 709052582, 708729782, 708386383, 708157501, 708009415, 707882996, 707652512, 707734070, 708085937, 707445984, 706966248, 707175827, 707390442, 707391052, 706761703, 706583405, 706625137, 706490936, 706281891, 705875168, 705464401, 704898376, 704749832, 704620209, 704323044, 704123917, 704281006, 704526520, 704058609, 703948441, 703894577, 703323364, 702948456, 702910156, 702890778, 702656097, 702514038, 702204208, 701781693, 701458740, 701354599, 700966949, 700426483, 700598145, 700562744, 700266190, 699763489, 699215012, 699092102, 698966980, 698742294, 698375931, 698149338, 697696915, 697396545, 697243805, 696892166, 697088394, 697152710]
2638.5F97152710k10648n04226n74265m64706n67169k32697m45785k13166J53733O6070
2648.2F94159851j77383n50385l73688o36901m25339P8201k20184k39029j27258k15378
2657.8F91272507l10822p12738r44366p9804K06986j58768j01395k79159j54267k13012
2667.5F88525162l68195l25165l81393j58997j10092o1340j58310l45993l05405k04239
2677.1F86106033j71966n97916n22079j75858n25055q6212N75027r3154n64804l07694
2686.8F83636322o4468k72751m89731p1106k56577k96402j05361o03180j43662J88065
2696.4F81521149k86255m1275j25275p06711k98690m1276n06134k3422K90528m80652
2706F79301987o80466k79846q3084j61515m99496l88336q3466k31705M8905j64795
$$ y = [697152710, 696942062, 696437836, 695863571, 695398865, 694831696, 694598999, 694153214, 693940048, 694093781, 694159851, 693982468, 693432083, 693058395, 692421494, 691996155, 692074356, 691854172, 691615143, 691487885, 691272507, 690961685, 690248947, 689304581, 689224777, 689431763, 689272995, 689171600, 688892441, 688738174, 688525162, 688156967, 687831802, 687450409, 687291412, 687181320, 687119980, 686961670, 686615677, 686310272, 686106033, 685934067, 685336151, 684814072, 684638214, 684113159, 684026947, 684601974, 684508820, 683944016, 683636322, 683571854, 683299103, 682809372, 682738266, 682481689, 682185287, 682079926, 681476746, 681333084, 681521149, 681234894, 681193619, 681068344, 680361633, 680062943, 680021667, 679515533, 679492111, 679782639, 679301987, 678621521, 678341675, 678258591, 678097076, 677597580, 677209244, 677125778, 676894073, 676942978, 676778183]
2715.7F76778183o84814j37787R5062j86310n31311m57458j05896k71759l68424l86581
2725.3F73742905j06278p4920m97742m53339k43454k03857m26407j45874Q6594p9728
2735F71597900J65863k11563p23343o17599j53046J22681l24554k70539o027k38495
2744.6F69341278k12555J06201J21613j11771n42145j105880l73230L00598k85111
2753.3F67238998l78418j64566J06354j3809k17438j99737n82352k55966l40958p67441
2762.9F64424667n0430K35443k58789l96347k51923l91464k49100p0037p2174J70517
2772.6F63090363l9826l58887m21981m86832o01578m16183j24131o6146j20850m91409
2782.2F59962540k77329k09884m06952k79923m66614j66854m15802n37415j61133q07876
$$ y = [676778183, 676093369, 675955582, 676050644, 675864334, 675333023, 674875565, 674769669, 674497910, 674129486, 673742905, 673636627, 673561707, 673063965, 672610626, 672367172, 672163315, 671736908, 671591034, 671677628, 671597900, 671763763, 671552200, 670828857, 670211258, 670058212, 670180893, 669856339, 669585800, 669579773, 669341278, 669128723, 669234924, 669356537, 669244766, 668702621, 667596741, 667223511, 667524109, 667238998, 666860580, 666696014, 666802368, 666788559, 666571121, 666371384, 665789032, 665533066, 665192108, 664424667, 664374237, 664609680, 664350891, 663954544, 663702621, 663311157, 663062057, 662992020, 662919846, 663090363, 663050537, 662691650, 662269669, 661782837, 661181259, 660765076, 660640945, 660574799, 660453949, 659962540, 659685211, 659475327, 659068375, 658788452, 658321838, 658154984, 657739182, 657201767, 657040634, 656232758]
2791.9F56232758o27518m5242k68479n26886o07681l53470k94418j089707j201248
2800.5F51218109O1035J23291m96673m60739o59256n27497l53164p31354r43451o50330
2810.2F46579971m62951o25992p72324p69729o40259p49664q54874o83212o88782j034012
2819.8F39298172j098213q38356o28662n31922j166610j453171j103211j458664j679229
2828.5F29340134j422387j285591j438903j531029j234665j354447j926116k214852
2836.2F16932144k084808k303238l052063l178177l338852m335327m909554n522155
2843.9E88207970o505814o580276o655922p664643q254127p917252p207184o395607
2851.7E31027145n128212l303527j958008q9264J907196K534599L490753M641266M441796
$$ y = [656232758, 655605240, 655559998, 655291519, 654764633, 654156952, 653803482, 653509064, 652419357, 651218109, 651279144, 651402435, 650905762, 650445023, 649785767, 649258270, 648905106, 648173752, 647230301, 646579971, 646117020, 645491028, 644718704, 643948975, 643308716, 642559052, 641704178, 641020966, 640332184, 639298172, 638199959, 637361603, 636732941, 636201019, 635034409, 633581238, 632478027, 631019363, 629340134, 627917747, 626632156, 625193253, 623662224, 622427559, 621073112, 619146996, 616932144, 614847336, 612544098, 609492035, 606313858, 602975006, 598639679, 593730125, 588207970, 581702156, 575121880, 568465958, 560801315, 552547188, 544629936, 537422752, 531027145, 525898933, 522595406, 520637398, 520548134, 522455330, 524989929, 528480682, 533121948, 537563744]
2860.3E37563744L970871M059448L776474L026199K503586J926002Q05054J25961J67161
2869E57924500l4943l71018k34947j23176m48456j71356N15899N72701J47705k57797
2878.7E57519112j71547m60892j067848r79233p69463o33049j014862j431617j117058
2887.3E49873543j505814j801758j316032j465378j679573j608124j703491j915321
2895.1E36878052k126351k144813k234497k127190j719208j956138k502136k461854
2902.8E19605865k450485k749862l097420l204651l102493l549691l833808l860970
2910.5D93756485m668541n416756n649109o029586o181107n916252o509857p155800
2918.2D46229477o620941o046639n267029m073486l506737l075409k197418r24339
$$ y = [537563744, 541534615, 545594063, 549370537, 552396736, 554900322, 556826324, 557631378, 557757339, 557924500, 557889557, 557518539, 557283592, 557160416, 556711960, 556540604, 557056503, 557629204, 557776909, 557519112, 557347565, 556886673, 555818825, 554839592, 554070129, 553437080, 552422218, 550990601, 549873543, 548367729, 546565971, 545249939, 543784561, 542104988, 540496864, 538793373, 536878052, 534751701, 532606888, 530372391, 528245201, 526525993, 524569855, 522067719, 519605865, 517155380, 514405518, 511308098, 508103447, 505000954, 501451263, 497617455, 493756485, 489087944, 483671188, 478022079, 471992493, 465811386, 459895134, 453385277, 446229477, 439608536, 433561897, 428294868, 424221382, 420714645, 417639236, 415441818, 414517479]
2925.9D14517479L01628J131210J997147K684898L284760L853989M407348M915543
2933.6D37094002N511703N922890N694962N399818N096321N410652N512657N335312
2941.3D80978317N344887N144081M828530L759651L466797L086586K077293J926880
2949.1E10613022J576423J120148Q50868J003266O83136K86026R65957J122284J094704
2957.7E19315834J446304J895905K584534L322105L199310K535134L060226L717575
2965.5E41076927L448372L314934L689804M111710M149932L492394L059349K983437
2973.2E69326859K778663K768212K820663K930374K314148K007866K212410J999779
2980.9E89158974J864357J159172J317711J716156J466140J714592J369744R27925
$$ y = [414517479, 414819107, 415950317, 417947464, 420632362, 423917122, 427771111, 432178459, 437094002, 442605705, 448528595, 454223557, 459623375, 464719696, 470130348, 475643005, 480978317, 486323204, 491467285, 496295815, 500055466, 503522263, 506608849, 508686142, 510613022, 512189445, 513309593, 514160461, 515163727, 515846863, 516132889, 517098846, 518221130, 519315834, 520762138, 522658043, 525242577, 528564682, 531763992, 534299126, 537359352, 541076927, 544525299, 547840233, 551530037, 555641747, 559791679, 563284073, 566343422, 569326859, 572105522, 574873734, 577694397, 580624771, 582938919, 584946785, 587159195, 589158974, 591023331, 592182503, 593500214, 595216370, 596682510, 598397102, 599766846, 600694771]
2988.6F00694771P59506N82314P05528O58302K65389K89955L98445R7122q0223p60956
2998.2F03610153j242294j192970q86231m83589q68454j105804r83277q15925r46236
3006.9E95085373p65801L23334M70047J00937L26004L14560M53529J367913J451950
3015.6E99127846R19990J145745J198501R28536O60171O88477K94876O1645M96865
3024.3F05522652R4070L4485L84102j08566o49605p8392J38511n19714k23579o2905
3033.9F04531059k78434n29900n95665k99492j66740k83471q29544p42912m34074l27378
3043.6F00043449m21867p07512o37703p14454l94631j73912n17616j106568j286316
3052.2E94082870q95576p48100m16603m75693m37126l50495r08241j175041p03163
$$ y = [600694771, 601454277, 602036591, 602742119, 603400421, 603665810, 603955765, 604354210, 604451332, 604371109, 603610153, 602367859, 601174889, 600288658, 599805069, 598936615, 597830811, 596847534, 596031609, 595085373, 594319572, 594642906, 595112953, 595213890, 595539894, 595854454, 596307983, 597675896, 599127846, 600047836, 601193581, 602392082, 603320618, 603980789, 604669266, 604964142, 605025787, 605522652, 605616722, 605651207, 606035309, 605926743, 605277138, 605198746, 605337257, 604817543, 604593964, 604531059, 604252625, 603722725, 603127060, 602827568, 602660828, 602377357, 601547813, 600804901, 600370827, 600043449, 599621582, 598914070, 598276367, 597561913, 597167282, 596993370, 596475754, 595369186, 594082870, 593187294, 592439194, 592022591, 591546898, 591109772, 590759277, 589851036, 588675995, 587972832]
3060.9E87972832k27890n64347m62837o22024r08547n19943m81911n45196r41353p73354
3070.6E81925430o10847n09224k66266o61888k10571k81144r43794q19244n00870l89976
3080.2E76731606o74096p63435p70035q24089p90825m87671n06897m35905j77460q52546
3089.9E70448647r94835o58226o70395o68412l55567o02684j395569n51873J19515
3098.5E64670601o92520j348572q84018l08800n17273n09720n72319q89320r37042
3107.2E58011017m52767n56526q31718l49579o14357j091919j012115k23961l86010
3115.9E52492065q17985Q39j150970j960411o78101m82025j127968r64432m66842q96416
3125.5E43947754r70993n39475m94537o39458j169243j223449n04189o45637r56345
$$ y = [587972832, 587744942, 587180595, 586717758, 586095734, 585187187, 584667244, 584185333, 583640137, 582698784, 581925430, 581314583, 580805359, 580539093, 579877205, 579666634, 579385490, 578441696, 577622452, 577121582, 576731606, 576057510, 575294075, 574524040, 573699951, 572909126, 572421455, 571914558, 571478653, 571301193, 570448647, 569453812, 568795586, 568125191, 567456779, 567101212, 566498528, 565102959, 564551086, 564670601, 563978081, 562629509, 561745491, 561436691, 560919418, 560409698, 559837379, 558948059, 558011017, 557558250, 557001724, 556170006, 555820427, 555206070, 554114151, 553102036, 552878075, 552492065, 551674080, 551674919, 550523949, 548563538, 547885437, 547403412, 546275444, 545311012, 544844170, 543947754, 542976761, 542437286, 541942749, 541303291, 540134048, 538910599, 538406410, 537760773, 536804428]
3134.2E36804428n00717o58455o34308j052017j337585p32995j004867p87468p54547
3142.9E29341469p18651o31561r88465m85916q59833j118888r42765r29222o15234
3151.6E22050934n74188o73867j277618j030884n56717p13234j045189j276931p45850
3160.3E14156456q51593r02100q01620p59430n58815j178398q60825l97491j260414
3168.9E06585770j496506r33647p09839o10199n96047r85984j194191o79360m88739
3177.6D98891258j277771j221885o52123o48651o62117q43887j002045q58955l76587
3186.3D91347237o72303j320533q58422o16340q96416q39195q16193q99887q00552
3195D83627396p70455q80737j292343j180268o04286p26661q21343r61990o37474o44036
$$ y = [536804428, 536303711, 535645256, 535010948, 533958931, 532621346, 531888351, 530883484, 530096016, 529341469, 528622818, 527991257, 527002792, 526516876, 525657043, 524538155, 523595390, 522666168, 522050934, 521476746, 520802879, 519525261, 518494377, 517937660, 517224426, 516179237, 514902306, 514156456, 513304863, 512402763, 511601143, 510841713, 510282898, 509104500, 508243675, 507846184, 506585770, 505089264, 504155617, 503445778, 502835579, 502239532, 501253548, 500059357, 499379997, 498891258, 497613487, 496391602, 495739479, 495090828, 494428711, 493584824, 492582779, 491723824, 491347237, 490674934, 489354401, 488495979, 487879639, 486983223, 486144028, 485327835, 484427948, 483627396, 482856941, 481976204, 480683861, 479503593, 478899307, 478172646, 477351303, 476389313, 475751839, 475107803]
3204.6D75107803q99124n07011q75206l55034o15387j549110j107369j042099j96800
3213.3D67960663k52724r36203n92460o50254n92041p64885r89456p27272m67644q85811
3222.9D61101913j084938o61277m43077n87807j160851q30650n09605p88384p31354
3231.6D54303970l59687k66152j085853j146470n42755m00390q93936r34716n59234
3240.3D48114777p75757n85633p04917o17981n74608p55425o51893j533165j356125
3249D40559273m73824l88832n58891p18308p31582q27942m30756m34456j097183j022949
3258.6D33874550q7700n4169n16395l70293j181450j646461q48503k19002l13416n58777
3268.3D28078384n27305n27344m82750o50444o19926n90630l65868o54411j126556
$$ y = [475107803, 474208679, 473701668, 472826462, 472471428, 471856041, 470306931, 469199562, 468157463, 467960663, 467707939, 466771736, 466179276, 465529022, 464936981, 464172096, 463182640, 462455368, 461987724, 461101913, 460016975, 459355698, 458912621, 458324814, 457163963, 456333313, 455823708, 455035324, 454303970, 453944283, 453678131, 452592278, 451445808, 450903053, 450502663, 449608727, 448674011, 448114777, 447339020, 446753387, 446048470, 445430489, 444855881, 444100456, 443448563, 441915398, 440559273, 440085449, 439696617, 439137726, 438419418, 437687836, 436859894, 436429138, 435994682, 434897499, 433874550, 433786850, 433732681, 433216286, 432845993, 431664543, 430018082, 429169579, 428950577, 428637161, 428078384, 427551079, 427023735, 426540985, 425890541, 425270615, 424679985, 424314117, 423659706, 422533150]
3276.9D22533150m74358q09479o44874k99111o47544k33346p46383o04477O4468j46599
3286.6D17991447k90565q84666r15490j99089j66778o78444n68848j61629p57446r66568
3296.2D12401924m69093q86154o26030j42060n34401l56102l14598j50871k91328n43671
3305.9D08087616k59094p34635r21020r62410r31587m23699j99127o36215o14090J11847
3315.5D02517586o61087j102944o51397m07067k78396m07601j59721p18460q41904
3324.2C97289009m91981p30362r36089r44519n02853n78690k05688k35863n00565n05066
3333.8C91657333j265106o37321j86081m59328o02722j067963o48155L9024l47061
3342.5C86482620j077919q86497r62525q85200n86930q77304o79397m74854m69169
$$ y = [422533150, 422058792, 421249313, 420604439, 420305328, 419657784, 419424438, 418678055, 418073578, 418138046, 417991447, 417700882, 416816216, 415900726, 415701637, 415534859, 414856415, 414287567, 414125938, 413368492, 412401924, 411932831, 411046677, 410420647, 410278587, 409744186, 409388084, 409073486, 408922615, 408631287, 408087616, 407828522, 407093887, 406172867, 405210457, 404278870, 403855171, 403656044, 403019829, 402405739, 402517586, 401856499, 400753555, 400102158, 399695091, 399416695, 399009094, 398849373, 398130913, 397289009, 396797028, 396066666, 395130577, 394186058, 393683205, 393104515, 392898827, 392662964, 392162399, 391657333, 390392227, 389754906, 389568825, 389109497, 388506775, 387438812, 386790657, 386829681, 386482620, 385404701, 384518204, 383555679, 382670479, 382083549, 381206245, 380526848, 380051994, 379582825]
3351.2C79582825p88689r53293j023063o36025o7940p27768n40352k70614p84340q00934
3360.8C72989807n20019m94233j127166j095429o89430p14531n19066o41098q33664
3369.5C66355171j79024n64880j418915n86891l83072o79245n63392p70836r85146
3378.2C60223770n09720K7008m91981l11127p55157j384125l47862J04026j50909p70416
3387.8C55633507n40619j59073m13132l85933r20181q49953J38932M22134n99213j193161
3397.5C51133308m50630L7384l27797o34956j99509l37333l07618j57013m82940k63825
3407.1C48009071n2490j38245l88412j48773K90031N9929q03261n67093J72043l60679
3416.8C46072121k57073k55356k63023K73247K62909j1254n89409k12898K80495K70348
$$ y = [379582825, 378794136, 377840843, 376817780, 376181755, 376113815, 375386047, 374845695, 374575081, 373790741, 372989807, 372469788, 371975555, 370848389, 369752960, 369063530, 368348999, 367829933, 367188835, 366355171, 366176147, 365611267, 364192352, 363605461, 363222389, 362543144, 361979752, 361208916, 360223770, 359714050, 359741058, 359249077, 358937950, 358182793, 356798668, 356450806, 356554832, 356403923, 355633507, 355092888, 354933815, 354520683, 354134750, 353214569, 352364616, 352503548, 352925682, 352326469, 351133308, 350682678, 350720062, 350392265, 349757309, 349557800, 349220467, 348912849, 348755836, 348272896, 348009071, 347956581, 347818336, 347429924, 347281151, 347571182, 347631111, 346827850, 346260757, 346432800, 346072121, 345815048, 345559692, 345296669, 345569916, 345832825, 345821571, 345232162, 345019264, 345299759, 345570107]
3426.4C45570107j52588m36860L51220M51469j14555j83945L23448N80101O24352K01301
3436.1C47214050l88183k42844O4316M55284O24390P44514l42483o11420N75333J156387
3445.7C49249344J208229p98912j29662Q16460j02310O43234M00848J78452L76167
3454.4C51841850Q65212J080513N24635N56412J55525M62952L71132L44390P28646
3463.1C56931267O36825N16243Q0109Q03719J043739Q90426O74630K59628L97797K57454
3472.7C62491837Q25157R96818O30493M24385N91050J089744R17282M65660M57154
3481.4C68889580O08330L85131P98989M69589Q14590J608773M94079L16353M95720
3490.1C74881134R98344J106492M77981M43649N42450J293183O75621M77295J035881
$$ y = [345570107, 345417519, 344980659, 345331879, 345783348, 345668793, 345484848, 345808296, 346388397, 347012749, 347214050, 346825867, 346583023, 346647339, 347102623, 347727013, 348471527, 348129044, 347517624, 348092957, 349249344, 350457573, 349658661, 349528999, 350345459, 350243149, 350886383, 351287231, 351465683, 351841850, 352707062, 353787575, 354312210, 354868622, 355024147, 355487099, 355858231, 356202621, 356931267, 357568092, 358084335, 358164444, 358968163, 360011902, 360902328, 361576958, 361836586, 362234383, 362491837, 363316994, 364313812, 364944305, 365368690, 365959740, 367049484, 367966766, 368432426, 368889580, 369497910, 369883041, 370682030, 371151619, 371966209, 373574982, 374069061, 374385414, 374881134, 375879478, 376985970, 377463951, 377907600, 378450050, 379743233, 380418854, 380896149, 381932030]
3498.7C81932030O66008R19761J144410J038780Q38547P07435P11746N84374L55491
3507.4C88898582J531334J621399M387J032105J279068Q08487N03234O91567J221504
3516.1C97591667P57942J089554J184044J313553J237450J246681J028671M6501Q02613
3524.8D06298676J791420K053375N37071J59378P35092J404762J619034J96038O98623
3533.5D15493469J019478K074471J696968J86767J417160R95598J225662J293297J466637
3542.1D26869507J226654J140365J578446N38521J701317K05879J283417K317657J894112
3550.8D38755875J954116j572952J019478J815376J586418K297745K41623J610947
3558.5D47708626K066879J503296J09024J732903K314147O73104M241180J929703K30598
$$ y = [381932030, 382598038, 383517799, 384662209, 385700989, 386539536, 387246971, 387958717, 388543091, 388898582, 390429916, 392051315, 392055702, 393087807, 394366875, 395175362, 395678596, 396370163, 397591667, 398349609, 399439163, 400623207, 401936760, 403174210, 404420891, 405449562, 405496063, 406298676, 408090096, 410143471, 410680542, 410839920, 411575012, 412979774, 414598808, 414794846, 415493469, 416512947, 418587418, 420284386, 420471153, 421888313, 422883911, 424109573, 425402870, 426869507, 428096161, 429236526, 430814972, 431353493, 433054810, 433260689, 434544106, 436861763, 438755875, 440709991, 439137039, 440156517, 441971893, 443558311, 445856056, 446097679, 447708626, 449775505, 451278801, 451387825, 453120728, 455434875, 456107979, 460349159, 462278862, 462509460]
3567.2D62509460J20316o20232L679200J831131R89379J879654J956902J270866J586647
3575.9D75203323K411003P99332K351990J900749O13861J674957K401047K052841R16024
3584.6D90325127M598770K856216j666717J870994l81469K203407K773056K723465
3592.3E05302849K492676J578102L611870m79126J684379L736191P19719K808075J222305
3601E22677040M23660J729203J060905J827583L523789L070259m94728M218635N54886
3609.6E38591232j707191P206764J542549k244339M073639q56056L883400M945106
3617.4E55435104l51143J748925r25064P00531L574524K047119J525192K673836K300110
3626E68729134J606292O661873J999932j1279488K409553M271203N832099J555939
$$ y = [462509460, 462629776, 462009544, 465688744, 467519875, 468509254, 470388908, 472345810, 473616676, 475203323, 477614326, 478413658, 480765648, 482666397, 483280258, 484955215, 487356262, 489409103, 490325127, 494923897, 497780113, 496113396, 497984390, 497602921, 499806328, 502579384, 505302849, 507795525, 509373627, 512985497, 512506371, 514190750, 517926941, 518646660, 521454735, 522677040, 523100700, 524829903, 525890808, 527718391, 531242180, 534312439, 533817711, 538036346, 538591232, 536884041, 544090805, 545633354, 543389015, 547462654, 546606598, 550489998, 555435104, 555083961, 556832886, 555907822, 556608353, 560182877, 562229996, 563755188, 566429024, 568729134, 570335426, 576997299, 578997231, 567717743, 570127296, 574398499, 580230598, 581786537]
3633.8E81786537k695007J921921L008575K507629L31002O75392J899528K652512J586609
3642.4E93674698p30362P24983L047943N944481p83501l406295N945244K298889k761460
3651.1F03954620m163932L370361L816681L886680M882126p225761R04007M281425
3658.8F13706207J086998J287003p4921J220284Q52241J476822J279717K56118L608055
3667.5F24698524J768876l01857J463012p098159k8649Q068886J0133858J472129j7651519
3676.2F22525101r7618O517944M749374j950187n21775K826920J799011J084137l05328
3684.9F36627579n99213M253082P543030q875542n109863R301415m553757j850700
3692.6F36736031M525184K06528J831589K86331q96759O49719Q8348L177720L718643
$$ y = [581786537, 579091530, 581013451, 584022026, 586529655, 586860657, 587536049, 589435577, 592088089, 593674698, 592944336, 593669319, 596717262, 602661743, 601878242, 598471947, 604417191, 606716080, 603954620, 599790688, 603161049, 606977730, 610864410, 615746536, 608520775, 609424782, 613706207, 614793205, 616080208, 616005287, 617225571, 618077812, 619554634, 620834351, 621090469, 624698524, 626467400, 626165543, 627628555, 620530396, 620501747, 628570633, 638704491, 640176620, 622525101, 622427483, 628945427, 633694801, 631744614, 631222839, 634049759, 635848770, 636932907, 636627579, 636028366, 640281448, 647824478, 638948936, 633839073, 643140488, 638586731, 636736031, 641261215, 641467743, 643299332, 643585663, 642688904, 643338623, 643426971, 646604691, 650323334]
3701.3F50323334n067520l302308M220429J511536m56772o17676K456665N375519o487808
3709.9F47955399L972625O235504j4088134K655182M407730j94168q43583K253571
3717.7F52354126K147827m183502N3024N495911k303467m879455M514389J516418p89032
3726.3F53926239k494659o95038L471908J156922N823364j781616q444062Q989640
3734F59952698K544937q424912n00412J379090k81220J528855L188705m053192J457825
3742.7F56792374J1386642q233185j6216278R318924N792160P282562k616348j1745910
3750.4F51760941J2462081l698196j0050049M620896M119415L964081n096131J174240
3758.2F59257278O421586p142640l308105L728180J036987j4496L683853j878280m787903
$$ y = [650323334, 645255814, 641953506, 646173935, 647685471, 647228699, 646611023, 649067688, 654443207, 647955399, 651928024, 658163528, 644075394, 646730576, 651138306, 650944138, 650100555, 652354126, 654501953, 650318451, 650371475, 655867386, 653563919, 648684464, 653198853, 654715271, 653926239, 651431580, 650736542, 654208450, 655365372, 661188736, 659407120, 650963058, 659952698, 662497635, 654072723, 653572311, 654951401, 654670181, 656199036, 659387741, 655334549, 656792374, 668179016, 659945831, 643729553, 653048477, 658840637, 666123199, 663506851, 651760941, 664223022, 660524826, 650474777, 655095673, 659215088, 663179169, 658083038, 659257278, 665678864, 658536224, 655228119, 658956299, 659993286, 659978790, 663662643, 661784363, 656996460]
3766.8F56996460K703094N405350J774979r123001M11377L083725J25579N88990m79279
3775.5F61487274O70395J99509K743377J759873p539902P13654K378158P38220J718674
3784.2F64869232k293320j234741R67331J234436Q03223j170654J70593Q84018N0049
3792.9F64280167j143189J181717M607010l149414n215073J320877L422318O278381
3800.6F71582794m953766j0014114L378830J320038L808822P143097p766266n791015
3808.3F58708420M437637J848755l23639K18811o3553Q36869N676651r17130j4473114
3817F55949707M605255O236801M943772K380218j6136246P94754M764405J563720K997895
3825.7F68100281N72738m364624o18133Q72269L628311L307724q880844J498947P595672
$$ y = [656996460, 659699554, 665104904, 666879883, 657756882, 658168259, 661251984, 661377563, 661966553, 661487274, 662157669, 662357178, 665100555, 666860428, 659320526, 660034180, 662412338, 663150558, 664869232, 662575912, 661341171, 662308502, 663542938, 664346161, 663175507, 663346100, 664230118, 664280167, 663136978, 664318695, 668925705, 665776291, 660561218, 661882095, 665304413, 671582794, 666629028, 656614914, 659993744, 661313782, 665122604, 672265701, 664499435, 658708420, 663146057, 664994812, 664671173, 664889984, 664826431, 665663300, 671339951, 670422821, 655949707, 660554962, 666791763, 671735535, 674115753, 657979507, 658774261, 663538666, 665102386, 668100281, 668673019, 664308395, 663690262, 664562531, 668190842, 671498566, 662617722, 664116669, 671712341]
3834.3F71712341n753708j366577Q715515p817230m909973Q387451n806961j213226
3842.1F61947632O694412j822967l667679J838836J503983M66461K094879j223297
3849.8F67832260J315689O644593k828675M676819j6542587l886566R782867n82733
3857.5F66411667j998367J718216K611618L361892n670471m06189P577438o224212
3865.2F67381592p028427L116760M339905P877884m136429j0525055K249145N535660
3872.9F68811035M762802r571609n76401L732224q91877J744767N130920l522339q039856
3881.6F61579666N222931J301193J805802O068649j4443817o43082M147568J185684
3889.3F66224594N147858P24792p668075L00979L057404k171631L93448P93991K162018
$$ y = [671712341, 665958633, 664592056, 673307571, 665490341, 660580368, 668967819, 663160858, 661947632, 668642044, 666819077, 663151398, 664990234, 666494217, 666960678, 669055557, 667832260, 669147949, 675792542, 672963867, 677640686, 661098099, 657211533, 666994400, 666411667, 664413300, 666131516, 668743134, 672105026, 666434555, 666028366, 673605804, 667381592, 660353165, 663469925, 667809830, 675687714, 671551285, 661026230, 663275375, 668811035, 673573837, 664002228, 663425827, 667158051, 666266174, 668010941, 673141861, 669619522, 661579666, 666802597, 668103790, 669909592, 675978241, 661534424, 660891342, 665038910, 666224594, 671372452, 672097244, 664429169, 664730148, 667787552, 665615921, 666009369, 666803360, 668965378]
3898F68965378L216934r193192M480744K081299n728836N808792l119660k509308J69602
3906.7F64171753K28958K462235K37274L16162o95496k517Q08792k79923J257553K513352
3916.3F71018143l064804m324875M221267k72522m733581K218399J948929J453857
3924F68464813j890030k952194J528931J082916J108170j099091m75616K561416k243652
3932.7F66085663j850968J232300J04141O84281O90536n89904p14341n18646J771927
3941.4F66894989J727295l717957j034698J496658J558838J786118k305146k6016K02103
3950.1F66582184k428055J484833P22809k49634l05329o42547L39661m26713M08249
3958.7F65485458L36075R36051Q63342j845017m26483M01993m66461m81567J37252
$$ y = [668965378, 672182312, 662989120, 667469864, 669551163, 663822327, 669631119, 666511459, 664002151, 664171753, 664400711, 666862946, 667100220, 667416382, 666720886, 666718369, 667527161, 667247238, 668504791, 671018143, 667953339, 663628464, 667849731, 667577209, 662843628, 665062027, 667010956, 668464813, 666574783, 663622589, 665151520, 666234436, 667342606, 666243515, 665767899, 668329315, 666085663, 664234695, 665466995, 665571136, 666255417, 666945953, 666356049, 665641708, 665123062, 666894989, 668622284, 664904327, 663869629, 665366287, 666925125, 668711243, 666406097, 666380081, 666582184, 664154129, 665638962, 666361771, 666112137, 665806808, 665164261, 665503922, 665077209, 665485458, 665821533, 666757584, 667620926, 665775909, 665349426, 665751419, 665284958, 664803391, 664940643]
3967.4F64940643J064072J51672o68945J25046P85293L71552n15213o52313l29209
3976.1F65272598j60904n7678J68533N31006K37122m70047p22199k39410N39169O0196
3985.7F65158386l02276p5684J00098N31082l26004m73633K82288N92193Q08869k63749
3995.4F66031570k23846M38995l04336m72870m43726
4000.2F65025787
$$ y = [664940643, 666004715, 666156387, 665487442, 665612488, 666397781, 666769333, 666254120, 665601807, 665272598, 665111694, 665054016, 665222549, 665753555, 665990677, 665520630, 664798431, 664559021, 665098190, 665158386, 664856110, 664780426, 664880524, 665411606, 665085602, 664611969, 664894257, 665486450, 666295319, 666031570, 665807724, 666246719, 665942383, 665469513, 665025787]
##END=$$ End of the data block
