##TITLE=MLLB p-Cl $$ Begin of the data block
##JCAMP-DX=5.00 $$ ACD/SpecManager v 10.08
##SPECTROMETER/DATA SYSTEM=Alpha
##DATE=25 Jun 2015 11:03:10
##DATA TYPE=INFRARED SPECTRUM
##DATA CLASS=XYDATA
##ORIGIN=
##OWNER=
##NPOINTS=1765
##FIRSTX=399.76428223
##LASTX=3997.64306641
##MAXX=3997.64306641
##MINX=399.76428223
##MAXY=0.88067174
##MINY=0.53243053
##XFACTOR=1.0000000000
##YFACTOR=1.000000000000000e-9
##FIRSTY=0.81376576
##DELTAX=2.03961372
##XUNITS=1/CM
##YUNITS=ARBITRARY UNITS
##XYDATA=(X++(Y..Y))
399.8H13765764k812028j449585Q5771j542151k035379o10232j442671p45237L505766
418.1H06720018L307045O25729K362013J817584j107990J02520Q22305j844346j186729
436.5H11618149L13103k132773k002835K75671k106964k975345R34005R70065q46386
454.8H04046690J614571J114547k080321M41551K002836j728416j561582J148343j172304
473.2H03825915j650691J519441m23550k856493J4245o22570m303038k140701m87864
491.5G92874694l351629j642287J667023j099706k188861P12991j336634l728688m09246
509.9G81497657j77145l372729j764833j409650n958438m033149K485157J993119r1850
528.3G69168139K006649J444757R32217M933119M498362o83367l77893J089096k752543
$$ plain form
399.8 813765764 810953736 809504151 809589922 808047771 806012392 805402160 803959489 803214252 806720018
418.1 806720018 810027063 810652792 813014805 814832389 813724399 813826919 814649224 812804878 811618149
436.5 811618149 811931252 809798479 807795644 808071315 805964351 802989006 803923011 804893076 804046690
454.8 804046690 805661261 806775808 804695487 805137038 807139874 805411458 803849876 804998219 803825915
473.2 803825915 802175224 803694665 803271115 800414622 800428867 799806297 795503259 793362558 792874694
491.5 792874694 789523065 787880778 789547801 788448095 786259234 786972225 785635591 781906903 781497657
509.9 781497657 781320512 777947783 776182950 774773300 768814862 764781713 767266870 769259989 769168139
528.3 769168139 771174788 772619545 773551762 778484881 782983243 782299876 781921983 783011079 780258536
546.6G80258536l354728K65479m58538q90851L065943K771199l15487J719415K524435
565G85585403j304686j189351R96650r28879o85275K595782R17256j507997J173317
583.3G85652220J494706j509726J06871K416134K65419N48780L323973J438796n29826
601.7G93207347J767278J319647j433611Q5712J143932j581073j170456J556635O18219
620G95513630M53174L168702K383709R9421J639008K182722Q106P77901K193093p7248
640.4H08342218r39607J339555J294612L82483K260089K550722M06622Q25525J938700
658.8H18400919N58496M91083J948058Q32379r44555R02534R72211k82824Q56519K066731
679.2H25801551P33078K46405J102984K32399o98865K54930L92377n51641o7473O23942
$$ plain form
546.6 780258536 776903808 777169287 776710749 775819898 778885841 781657040 781341553 783060968 785585403
565 785585403 784280717 783091366 784088016 783159137 782473862 785069644 785986900 784478903 785652220
583.3 785652220 787146926 785637200 785744071 788160205 788425624 788974404 792298377 793737173 793207347
601.7 793207347 794974625 796294272 794860661 794946373 796090305 794509232 793338776 794895411 795513630
620 795513630 795966804 799135506 801519215 801618636 803257644 805440366 805448472 806226373 808419466 808342218
640.4 808342218 807402611 808742166 810036778 810419261 812679350 815230072 815636694 816462219 818400919
658.8 818400919 818959415 819450498 821398556 822230935 821286380 822188914 823161125 822878301 823734820 825801551
679.2 825801551 826534629 826781034 827884018 828116417 827417552 827672482 828064859 827513218 827445745 828069687
699.6H28069687k7537q2493N34832l49402j718641j623511j305282j674831j411021
717.9H20411801n83708l73602k28464O27040J658559K673567L604292L492296K442897
736.3H33724678J836955J805127J320302M28617k25842j240313k997339m179656m129708
754.7H26342821l575742k399922n01513N72324K26378R2089P92206J476586K272665
773H25297892K967656K128601N59330O48260J460493R08017L36408O46174Q5354o65247
793.4H34372938j4603k7538j471162j854777k003312m014909n692959o229401q136570
811.8H04927707j0529995j1656940j3445974j5201270j2561918o682813k318322J079082
828.1G33609557N025923P660747R558201J2422800J3676882J2151003J1038541J0241747
$$ plain form
699.6 828069687 828042150 827959657 828494489 828145087 826426446 824802935 823497653 821822822 820411801
717.9 820411801 819828093 819454491 819226027 819853067 821511626 824185193 827789485 831281781 833724678
736.3 833724678 835561633 837366760 838687062 839115679 838889837 837649524 834652185 830472529 826342821
754.7 826342821 822767079 820367157 819865644 820437968 820664346 820756435 821548641 823025227 825297892
773 825297892 828265548 830394149 830953479 831601739 833062232 833970249 834306657 834952831 835038185 834372938
793.4 834372938 834358335 834330797 832859635 831004858 829001546 824986637 819293678 813064277 804927707
811.8 804927707 794397712 782740772 769294798 754093528 741531610 734848797 732530475 733609557
828.1 733609557 738635480 746296227 755854428 768277228 781954110 794105113 805143654 815385401
844.4H15385401P495046N286038N191922M179120K715826L419340L712058K132892
860.7H49517643K079607K855658J345575K65419J292050Q61407l56317P78973J488507
879.1H60128522N7697J79231J398087L83258m52519N79954N7518j294434j48177Q27014
899.5H61716151l80695m73022K19583j045942j491904M11451P25031l70622L18825
917.8H59628856N80847j066446j169145l2425o30677j028120j21534j148999l154754
936.2H51857603k454579j078427j210570k65301J351238P34925p2241P45535L45826
954.5H49954009j130462p78377k40504j192332r88662L88205K20716j55806P22885
972.9H46799672L19183j332701j409650r40322j311243l14236J748860J878977J088440
$$ plain form
844.4 815385401 822880447 828166485 833358407 837537527 840253353 843672693 847384751 849517643
860.7 849517643 851597250 854452908 855798483 856063902 857355952 858217359 857861042 858640015 860128522
879.1 860128522 860186219 860365450 861763537 862146795 861694276 862274230 862331748 861037314 860889137 861716151
899.5 861716151 861335456 860862434 861082017 860036075 858544171 858955622 859680653 859310031 859628856
917.8 859628856 860209703 859143257 857974112 857941687 857311010 856282890 856161356 855012357 851857603
936.2 851857603 849403024 848324597 847114027 846848726 848199964 848934889 848862648 849608183 849954009
954.5 849954009 848823547 848045170 847804666 846612334 845623672 846011877 846232593 846076787 846799672
972.9 846799672 847118855 845786154 844376504 843436182 842124939 841810703 843559563 845438540 846526980
991.3H46526980J280785O76870r86814j694024k550602m948079p429779j2427986k5346756
1009.6G93100595l8058280k8055072P199526L5995364L5829842J9283294N654693J86682
1025.9H31136644o10709j031161j641929j224220q08537j053571n55218M41373O25849
1044.3H25278521Q18967J665175J897037J470924J520574J426160N35250M9651J77621
1062.6H34839880k71976r34124j000523j426995k710760l999352n695760q880258j3338804
1081G96581328j9024253k6027977l1335950k9566884j8056572M17233J8729031K8788566
1097.3G20504522K7119935J8116772R339571M687846M156172O331205Q421302Q149922
1113.6H06827247O553948N278885L850520K138853J159668N56350m82977j174271j292109
$$ plain form
991.3 846526980 847807765 848484635 847497821 845803797 843253195 838305116 830875337 818447351 793100595
1009.6 793100595 755042315 726987243 734186769 770182133 806011975 825295269 830949962 831136644
1025.9 831136644 830525935 829494774 827852845 826628625 825820088 824766517 824211299 824652672 825278521
1044.3 825278521 826097488 827762663 829659700 831130624 832651198 834077358 834612608 834662259 834839880
1062.6 834839880 834567904 833633780 832633257 831206262 828495502 824496150 818800390 809920132 796581328
1081 796581328 777557075 751529098 720193148 690626264 672569692 672986925 691715956 720504522
1097.3 720504522 747624457 765741229 775080800 779768646 783924818 790256023 798677325 806827247
1113.6 806827247 813381195 818660080 822510600 824649453 825809121 826365471 825882494 824708223 823416114
1132H23416114j858592k498090k392173k469003l132761l249347k956629l307045l794848
1150.3G97757626l898144m203797m036545k352178o69480n52058q88765j009762j749814
1168.7G78397083k470255k180397j713932j348316m56334J55628o0618J04726Q32975
1187.1G71260560Q70764M27604K50995o14405k449632l798604m378736m578292l578663
1205.4G53411591j843572j301586j395881k25902J585245K814233L658593L428578
1221.7G60131299J318396j019001k002001k077997j124501J092791K648771K541423
1238.1G61509180K450705K744019K256810J638472J427412K30551j727700k680480
1254.4G67848969l117145l947854m011869l117621k574205k178908j762986k657056
$$ plain form
1132 823416114 821557522 819059432 816667259 814198256 811065495 807816148 804859519 801552474 797757626
1150.3 797757626 793859482 789655685 785619140 783266962 782597482 782045424 781156659 780146897 778397083
1168.7 778397083 775926828 773746431 772032499 770684183 770227849 770383477 770322859 770427585 771260560
1187.1 771260560 772131324 772558928 772809923 772195518 769745886 765947282 761568546 756990254 753411591
1205.4 753411591 751568019 750266433 748870552 748644650 750229895 753044128 756702721 760131299
1221.7 760131299 761449695 760430694 758428693 756350696 755226195 756318986 758967757 761509180
1238.1 761509180 763959885 766703904 768960714 770599186 772026598 772257149 770529449 767848969
1254.4 767848969 764731824 760783970 756772101 753654480 751080275 748901367 747138381 744481325
1270.7G44481325m337847m744947m230499m053116l758669l285408l139258k233445
1287G14698136L5822K188683L674686M682421L604114N79000n26607J495242L656924
1305.4G34088421M904210O201089O826997O294012N729258M966795L133595J526773
1321.7G73671150R53377J08361p86126n94020j90377j45674O42121J821458J974523
1340G77454793J686156J608551O87480p40767j220822j199544j230955n62668K83182
1358.4G76765406j69635j716673l076851l637195l050387j046956P56383Q02875N14388
1376.7G66141355J469493K690613L322542L341913J284361k837777m452407k285064
1393.1G68675029K77937L05354k086758n122483p197499q040011o816864l355265J023173
$$ plain form
1270.7 744481325 740143478 735398531 731168032 727114916 723356247 720070839 716931581 714698136
1287 714698136 714733958 716922641 720597327 725279748 728883862 729462862 728936255 730431497 734088421
1305.4 734088421 738992631 745193720 752020717 758314729 764043987 769010782 772144377 773671150
1321.7 773671150 774624527 774732888 773946762 773352742 773162365 773016691 773658812 775480270 777454793
1340 777454793 779140949 780749500 781436980 780696213 779475391 778275847 777044892 776482224 776765406
1358.4 776765406 776595771 774879098 771802247 768165052 765114665 764067709 764824092 765626967 766141355
1376.7 766141355 767610848 770301461 773624003 776965916 778250277 775412500 770960093 768675029
1393.1 768675029 768952966 769258320 767171562 762049079 754851580 746811569 739994705 736639440 737662613
1411.4G37662613M647315O755710Q122205P763505M471839J801371R13084N00321n6743
1429.8G72581220l99411j62542l51012j469075j898706j632929j038909j5378M52995
1448.1G66066253L0279j03771M08113K34544j788259l051519k651691k412379k383948
1466.5G54347622j812636j332582k144098l544807m106224m855037p492780j3145209
1482.8G15914249k1865010l3081531l9882899k7065336M279136L5557747N3063989
1497.1F86920345M4177353K5135517J3696790R178400N524755Q22365n47886k43306
1513.4G84664333r9599k98739n74946j334489k133369k087236k095699j833081j023472
1531.8G73183703r67681r53197L34084J141130j22606n95033K39610J140952J888693
$$ plain form
1411.4 737662613 742309928 749065638 757187843 764951348 769423187 771224558 772137642 772637963 772581220
1429.8 772581220 772181809 772019267 771668255 770199180 768300474 766667545 765628636 765613258 766066253
1448.1 766066253 766096532 765992761 766400874 766635418 764847159 761795640 759143949 756731570 754347622
1466.5 754347622 752534986 751202404 749058306 745513499 741407275 736552238 729059458 715914249
1482.8 715914249 694049239 660967708 621084809 594019473 598298609 633856356 686920345
1497.1 686920345 731097698 756233215 769930005 779108405 784633160 785455525 784907639 784664333
1513.4 784664333 784564734 784265995 783691049 782356560 780223191 778135955 776040256 774207175 773183703
1531.8 773183703 772216022 771262825 771596909 772738039 772615433 772020400 772260010 773400962 775289655
1550.1G75289655K566933L249228L881216M384041K271056L279L36468J031041J143813
1568.5G94156730L60072o93321j974464m131913l667712r81748m49300k670288o023646
1586.8G73924410r338677j0852336q602441l936410P4625J934707J429022q99732l273785
1605.2G40459383m712165n938053o599605n869210n396068o261229n609513m723608
1621.5F95349932o064356p512450q069217q786023q389353p579983q625150q731007
1637.8F31592393o352663m192531k924323k882004l430843k789617k716601m640877
1654.1F01662934m742205l607154k775073k354145k440930k012312j454532k034188
1670.5E80242395k645075k738893l055870l084541k555668k363503l990233n132377
$$ plain form
1550.1 775289655 777856588 781105816 784987032 789371073 791642129 791645408 791981876 793012917 794156730
1568.5 794156730 794516802 793823481 791849017 787717104 784049392 783067644 782618344 779948056 773924410
1586.8 773924410 764585733 753733397 745130956 741194546 741269171 743203878 744632900 743733168 740459383
1605.2 740459383 735747218 729809165 723209560 717340350 711944282 705683053 700073540 695349932
1621.5 695349932 689285576 681773126 673703909 664917886 656528533 648948550 640323400 631592393
1637.8 631592393 625239730 621047199 618122876 615240872 611810029 609020412 606303811 601662934
1654.1 601662934 596920729 593313575 590538502 588184357 585743427 583731115 582276583 580242395
1670.5 580242395 577597320 574858427 571802557 568718016 566162348 563798845 559808612 554676235
1686.8E54676235m794956m823446m404485l550231k571941j416683o83963L1292J153708
1705.1E33615530K226591L538191N167186O692171Q252979R866178R329438Q105576
1721.5E86793840Q898854R745300J0034204J0968625J2631655J6258001J7708957J6327799
1737.8F89367235J8022120J8804848J7323136J6084254J4447510J2878895J0552824
1752G97480822P575988N941749M953921L711402K961159L038704L871799M836798N539238
1770.4H39911580N682886M265606L124237L169418K867996K169073J987636J873434
1786.7H65051866J712858J930654J621247O84678O06775J068771Q39532K99930M04656
1805.1H74220967O99878O44863M93109L76701K26319K25544L85940M70281M88519N06163
$$ plain form
1686.8 554676235 549881279 545057833 540653348 537103117 534531176 533114493 532430530 532461822 533615530
1705.1 533615530 535842121 539380312 544547498 551239669 559492648 569358826 578688264 586793840
1721.5 586793840 595692694 605437994 615472198 626440823 639072478 655330479 673039436 689367235
1737.8 689367235 707389355 726194203 743517339 759601593 774049103 786927998 797480822
1752 797480822 805056810 810998559 815952480 819663882 822625041 825663745 829535544 834372342 839911580
1770.4 839911580 845594466 849860072 852984309 856153727 859021723 861190796 863178432 865051866
1786.7 865051866 866764724 868695378 870316625 871001303 871608078 872676849 873516381 873816311 874220967
1805.1 874220967 874920845 875565708 876058817 876435518 876661837 876887381 877273321 877743602 878232121 878738284
1825.5H78738284M54784J85430j93596j41502Q2255J60575L57031N99027M29452j28448
1845.9H80543292l46125k56776r0540M6075L457m4465k9743n2631O5029L48627J59443
1868.3H80345643n16713p01189m41611l28720l24130l47495m39346m83512m33565n04911
1888.7H75824451p44998p75337p17104p46548o00874l44336j37568J18196L41416L63528
1909.1H72580826L51370M68492O33180O75202N20169L39032K03848J34706J53303J39535
1929.5H76199663J82569K50697J30713P6711K61605K56121l0220p6055j252q4579n0962
1951.9H77115011N1022k7657m9114J18196J30594L9279R3818N1916j27376o0737J13488
1974.4H77448440J3232j10388k1398k7835j17839L3736J60099J3291r6798o7949j14441
$$ plain form
1825.5 878738284 879193068 879378498 879184902 879043400 879125655 879286230 879643261 880242288 880671740 880543292
1845.9 880543292 880197167 879940391 879849851 879895926 879899383 879854918 879825175 879772544 879837573 880186200 880345643
1868.3 880345643 879828930 879127741 878686130 878357410 878033280 877685785 877246439 876762927 876329362 875824451
1888.7 875824451 875079453 874304116 873587012 872840464 872239590 871895254 871757686 871875882 872217298 872580826
1909.1 872580826 872932196 873400688 874033868 874709070 875229239 875568271 875772119 875906825 876060128 876199663
1929.5 876199663 876382232 876632929 876763642 876840353 877101958 877358079 877327859 877251804 877250552 877165973 877115011
1951.9 877115011 877166033 877138376 877089262 877207458 877338052 877377331 877471149 877523065 877395689 877334952 877448440
1974.4 877448440 877461672 877351284 877329886 877302051 877184212 877217948 877378047 877391338 877294540 877226591 877112150
1996.8H77112150j09494O2407O1154q1003j4305N3287o9976j8537J58548l755k97368
2019.2H76853108l43859m99308n31375K17557P69436M01020P7486J10030k38r1255
2039.6H76962602O8188R3162n6148k38Q9884l0518j7285J61826R3282m3869P1764J10149
2064.1H77502799n9187k6167J23024M2916k8074P3373N5909j8775J01089J74105O9261
2086.6H78010273P2062J43707M8995l815J24335J28150J2279O1870J13546R716N305
2109H78726423J07527P4803j4007K2114M2796j7047L2067R4950K2114m292N0426K4855
2133.5H79162729J728P7129R9063L1829K0444L3617k027J2696Q4996R4474M6670L7074
2157.9H79700422M2558J5318J9133K1279l5166l159J30355J59800J07944R4950P4208
$$ plain form
1996.8 877112150 877002656 877065063 877126217 877045214 877030909 877084196 877014220 876995683 877154231 877150476 876853108
2019.2 876853108 876509249 876009941 875478566 875696123 876465559 876866579 876944065 877054095 877053857 876962602
2039.6 876962602 877030790 877123952 877067804 877067566 877157450 877126932 877109647 877271473 877364755 877320886 877392650 877502799
2064.1 877502799 877443612 877417445 877540469 877583385 877555311 877628684 877684593 877665818 877766907 877941012 878010273
2086.6 878010273 878082335 878226042 878275037 878271222 878395557 878523707 878535986 878597856 878711402 878721118 878726423
2109 878726423 878833950 878908753 878894746 878916860 878959656 878942609 878974676 879069626 879091740 879087448 879137874 879162729
2133.5 879162729 879164457 879241586 879340649 879372478 879392922 879426539 879424512 879437208 879522204 879616678 879663348 879700422
2157.9 879700422 879742980 879758298 879777431 879798710 879763544 879760385 879890740 880050540 880158484 880253434 880327642
2180.4H80327642J9729k563K6345L0935j6570o8843r0778q5056n9545l0875k3663l1531
2204.8H79995227j3590K4498l100p4327p4863m0114n7102o0796k9564o1095j00851
2227.3H79504323o3539m9531q8692o6876m1962j08719j24097l9577m7326j07944n7101
2249.7H78708959l7372j21713j25349o7651j03652j20521o2406j12832j90496j26481
2270.1H77640486j19508k31623k04981j07526j84954k47120j58668j83284k61128j40310
2290.5H75801384k8491q0704n3168K4319r3281j74403n8651r4653k58028j94311r6917
2312.9H74693096j99735k11001j05441j89960k74658j41859j72972l66271k95579k02060
2333.3H72533560l80039m13418j87755p0393J2934L31462M45664P4863l44694n17308
$$ plain form
2180.4 880327642 880347371 880344808 880371153 880402088 880385518 880316675 880225897 880140841 880081296 880050421 880026758 879995227
2204.8 879995227 879981637 880006135 880003035 879928708 879853845 879813731 879756629 879695833 879666269 879605174 879504323
2227.3 879504323 879440784 879391253 879302561 879235685 879193723 879085004 878960907 878921330 878874004 878766060 878708959
2249.7 878708959 878671587 878549874 878424525 878356874 878253222 878132701 878070295 877957463 877766967 877640486
2270.1 877640486 877520978 877289355 877084374 876976848 876791894 876544774 876386106 876202822 875941694 875801384
2290.5 875801384 875772893 875692189 875639021 875663340 875570059 875395656 875337005 875242352 874984324 874790013 874693096
2312.9 874693096 874493361 874282360 874176919 873986959 873712301 873570442 873397470 873031199 872735620 872533560
2333.3 872533560 872153521 871740103 871552348 871481955 871494889 871826351 872272015 872346878 872002184 871484876
2353.7H71484876n69880m96865k34842j45197j19388J17004K30193J45972K11716K77340
2374.1H70900929J31726Q5652J74582R1434m8459j7881l7313k21133k30432q6426j28329
2396.6H70614350j94907j08004j26719k51115k06351j32382k05874j77682n9962j41859
2417H69009495k40267j53124j71065k79069j71423p3731j82152k03848j18434j76191
2437.4H67240191k38419j29104r6857k05934k00272j57297k31802k40982j61290j96576
2457.8H65381658k55883j89483j76012k60651k33949j64389k29359k61784j77145j70826
2478.1H63262177k33591k00510j40131j57177j63078j54674j80185j58489j04427j39118
2498.5H61630797k11894k05875j65879j33395q5772o3479j07646j37627j10149j06215
$$ plain form
2353.7 871484876 870914996 870418131 870183289 870038092 869918704 870035708 870265901 870411873 870623589 870900929
2374.1 870900929 871032655 871118307 871292889 871384323 871335864 871317983 871280670 871059537 870829105 870742679 870614350
2396.6 870614350 870419443 870311439 870184720 869933605 869727254 869594872 869388998 869211316 869151354 869009495
2417 869009495 868769228 868616104 868445039 868165970 867994547 867920816 867738664 867534816 867416382 867240191
2437.4 867240191 867001772 866872668 866775811 866569877 866369605 866212308 865980506 865739524 865578234 865381658
2457.8 865381658 865125775 864936292 864760280 864499629 864265680 864101291 863871932 863610148 863433003 863262177
2478.1 863262177 863028586 862828076 862687945 862530768 862367690 862213016 862032831 861874342 861769915 861630797
2498.5 861630797 861418903 861213028 861047149 860913754 860827982 860764503 860656857 860519230 860409081 860302866
2518.9H60302866j06991p4506p4863r8407r6977j14858j40608j22845j05381j03950
2539.3H59263480q3328p4982r6023j06454r5904o1154j1981j5199q2076j02699l2842
2561.8H58500838L636l3617l2723k6166q8096j17361j12236j59204j56641n4121m8459
2584.2H57675850j58071j53959o3836n3585k4736M5478j1444q1718k205M4286J3590
2606.6H57229650R2089J62065O6698J0311O7234L3439j2219O6399M3273p4804m4822
2629.1H57639313K324o7651l2961Q3089r001j41084o4194k2829r6500m1961K6762j00910
2653.5H57174397j75179o4790o2048j24634k3841J2636j08004o6340O3598K39k8253
2676H56597781P3135k4438j89304r7811j9908j32859j00672O199j13488j84715n0604
$$ plain form
2518.9 860302866 860195875 860121369 860046506 859948099 859851122 859736264 859595656 859472811 859367430 859263480
2539.3 859263480 859180152 859105170 859009147 858902693 858806789 858745635 858733654 858718455 858636379 858533680 858500838
2561.8 858500838 858504474 858470857 858438134 858411968 858323872 858206511 858094275 857935071 857778430 857724309 857675850
2584.2 857675850 857517779 857363820 857299984 857246399 857221663 857267141 857255697 857173979 857171774 857216060 857229650
2606.6 857229650 857321739 857483804 857550502 857560813 857628047 857661486 857649267 857715666 857758939 857684135 857639313
2629.1 857639313 857641637 857573986 857541025 857624114 857615113 857474029 857409835 857387006 857290506 857248545 857275307 857174397
2653.5 857174397 856999218 856934428 856872380 856747746 856723905 856736541 856628537 856562197 856625795 856626034 856597781
2676 856597781 856670916 856646478 856457174 856359363 856339455 856206596 856105924 856112123 855998635 855813920 855763316
2698.4H55763316m7862j36793l5644J0670j36316j57297r5308j78992k05815p3374
2718.8H54706585r0539k12610j30713r5129k71916k51889r1017j95682l31402k46644
2739.2H52789044k34902k88903j42277p6293k90812l66270k27809k46167l24369k48074
2759.6H50343168k71023m17888l93986l43740m39048l90172k50876l77178n27978m54784
2780H46476495m41551n07235l99292l20196m84705n78284m77732m63545n26428n07951
2800.4H41769576n38051o46710o26028n63026o66618p48157o84798o94692p28190o48618
2820.8H35224688o62804p69496o91652n73695o23524n98311m85003n29170o39200o83368
2841.2H28968465p31408p76470p73370q20339q63790o95050m37320l53515m05132m69268
$$ plain form
2698.4 855763316 855715454 855578661 855543017 855553687 855417371 855260074 855164766 854985774 854779959 854706585
2718.8 854706585 854616046 854403436 854272723 854177594 853905678 853653789 853562772 853367090 853035688 852789044
2739.2 852789044 852554142 852265239 852122962 852046669 851755857 851389587 851161778 850915611 850591242 850343168
2759.6 850343168 850072145 849654257 849260271 848916531 848477483 848087311 847836435 847459257 846931279 846476495
2780 846476495 846034944 845527709 845128417 844808221 844323516 843745232 843267500 842803955 842277527 841769576
2800.4 841769576 841231525 840584815 839958787 839395761 838729143 837980986 837296188 836601496 835873306 835224688
2820.8 835224688 834561884 833792388 833100736 832527041 831903517 831305206 830820203 830291033 829651833 828968465
2841.2 828968465 828237057 827460587 826687217 825866878 825003088 824308038 823870718 823517203 823112071 822642803
2861.6H22642803n99026p72477q08477p17223o36518o04391o26922o76929o72639o35385
2882H15892816p23005q86023r41455r73582j041174j021803j013696j136124j131952
2900.3H07024002q86798o82115n59390l37362j42873j72734l55124n76794p44224p11918
2920.7H01854670n03778l45648k09093N841M5240p5459J788K63155M85897P25567R83775
2943.2H03231955R92477P37607M74632K59578k5690k81989l71278m04596m46141m92394
2963.6H03674161o18219p93874r14633j005114j072526j013875p83801l98159Q4222
2981.9G97158182N20646P68483Q62837R03010Q17239O60897O65128P30395P22230P88033
3002.3H04597080Q37445P24614O35922N80549K55227k89977p19487j039505j306951
$$ plain form
2861.6 822642803 822043777 821271300 820462823 819745600 819109082 818504691 817877769 817200840 816528201 815892816
2882 815892816 815169811 814283788 813342333 812368751 811327577 810305774 809292078 808155954 807024002
2900.3 807024002 806137204 805455089 804895699 804558337 804415464 804242730 803887606 803310812 802566588 801854670
2920.7 801854670 801350892 801005244 800796151 800801992 800847232 800771773 800773561 801036716 801522613 802248180 803231955
2943.2 803231955 804224432 804962039 805436671 805696249 805670559 805388570 805017292 804612696 804166555 803674161
2963.6 803674161 803055942 802262068 801347435 800342321 799269795 798255920 797472119 797073960 797158182
2981.9 797158182 797678828 798447311 799310148 800213158 801030397 801691294 802356422 803086817 803809047 804597080
3002.3 804597080 805434525 806159139 806795061 807375610 807630837 807340860 806621373 805581868 804274917
3020.7H04274917j398325j398385j349151j049519o53565m91678n46396o56426p13229
3039G96018243q02100j009524j265526j437723j319945j066208j012444j030207r97245
3057.4G86077321j043618j079679r37998p29620o03199m55559k12610n8412j1146l4809
3077.8G80910671l67046p87019q02637o20365n10752l38793j68979j01209K3425K44200
3098.2G77481496L48330L15726M46498P03573P05839N28514N53846O77645N73755L49998
3118.6G82685220R5904j75953j78635J0014J8716r9957j58728j93834j80840j68205
3139G81653702l86417o30676o22332n93126o39916o15239o97374r98497j179278j127482
3159.4G74163365j172721j348376j371682j347661j466572j518607j452089j493215
$$ plain form
3020.7 804274917 802876592 801478207 800129056 799079537 798425972 797934294 797387898 796731472 796018243
3039 796018243 795216143 794206619 792941093 791503370 790183425 789117217 788104773 787074566 786077321
3057.4 786077321 785033703 783954024 783016026 782286406 781683207 781227648 781015038 780956626 780945480 780910671
3077.8 780910671 780543625 779756606 778953969 778333604 777822852 777484059 777315080 777213871 777237296 777481496
3098.2 777481496 777829826 778145552 778592050 779295623 780001462 780529976 781083822 781761467 782335222 782685220
3118.6 782685220 782781124 782605171 782426536 782436550 782455266 782355309 782196581 782002747 781821907 781653702
3139 781653702 781267285 780636609 780014277 779421151 778781235 778165996 777468622 776470125 775290847 774163365
3159.4 774163365 772990644 771642268 770270586 768922925 767456353 765937746 764485657 762992442
3175.7G62992442j587570j557767j554013j652837j644313j590550j666248j716315
3192G50022829j671076j702786j778364j744568j697660j740455j732588j675785j710474
3210.3G34569073j745165j692474j673400j719773j711786j685381j711249j666128
3226.7G20963717j536191j445472j418829j483441j580834j510084j277625j109779
3243G09601462j066744j018346r73403r57072q46446o70254o22511o27637m84824l53992
3263.4G01980233l68535l12507j65523j84357l15308l43383l50356l96490l89635l74496
3283.8F98779643m21644m58538m47571n17607o67989p51794q28981r28402r16302q63314
3304.2F91977501r46224j134991j284004j367390j411080j435638j507759j589894
$$ plain form
3175.7 762992442 761404872 759847105 758293092 756640255 754995942 753405392 751739144 750022829
3192 750022829 748351753 746648967 744870603 743126035 741428375 739687920 737955332 736279547 734569073
3210.3 734569073 732823908 731131434 729458034 727738261 726026475 724341094 722629845 720963717
3226.7 720963717 719427526 717982054 716563225 715079784 713498950 711988866 710711241 709601462
3243 709601462 708534718 707516372 706542969 705585897 704739451 704069197 703446686 702819049 702334225 701980233
3263.4 701980233 701611698 701299191 701133668 700949311 700634003 700290620 699940264 699543774 699154139 698779643
3283.8 698779643 698357999 697899461 697451890 696934283 696266294 695514500 694685519 693757117 692840815 691977501
3304.2 691977501 691031277 689896286 688612282 687244892 685833812 684398174 682890415 681300521
3320.5F81300521j581669j598120j768708j935482j979411j989960k001822k015412
3336.8F66429937k117396k267003k297699k300441k384961k418399k437472k530277
3353.1F47676289k602935k622187k617299k635420k658784k621889k586723k601802
3369.4F26729250k616286k536416k370417k250195k174139k044439j883567j782536
3385.7F09071255j685620j540482j500785j560509j496017j347363j268268j293003
3402.1E97379208j346648j260698j069665q98540q16584p56919n71489l19004j33634
3420.4E90206027J0133J92284L72172N30004O93262Q68261J013696J102567J148820
3438.8E96137226J195192J291096J399040J441002J418114J467109J575887J627088
$$ plain form
3320.5 681300521 679718852 678120732 676352024 674416542 672437131 670447171 668445349 666429937
3336.8 666429937 664312541 662045538 659747839 657447398 655062437 652644038 650206566 647676289
3353.1 647676289 645073354 642451167 639833868 637198448 634539664 631917775 629331052 626729250
3369.4 626729250 624112964 621576548 619206131 616955936 614781797 612737358 610853791 609071255
3385.7 609071255 607385635 605845153 604344368 602783859 601287842 599940479 598672211 597379208
3402.1 597379208 596032560 594771862 593702197 592803657 591987073 591230154 590658665 590339661 590206027
3420.4 590206027 590216160 590408444 590780616 591310620 592003882 592872143 593885839 594988406 596137226
3438.8 596137226 597332418 598623514 600022554 601463556 602881670 604348779 605924666 607551754
3455.1F07551754J650154J673401J635730J640320J778960J858234J735389J561821
3471.4F21085763J565874J739502K010583K146423J958192J820385K002716K143741
3487.7F36473179K101540K167106K293050K343417K374172K453625K505362K354741
3504F55066192K206922K301216K449572K578556K626062K503276K469003K622187K754152
3522.4F77577138K648532K427042K327025K319813K433836K628624K586782K403617
3538.7F97352409K568663K910971K898991K447963K142489K318859K508700K494216
3555G17643261K532124K729893K917171K956509L055871L137231K765536K443373K691627
3573.4G42872596L115535L298163L370881L499866L634095L735244L578126L161908
$$ plain form
3455.1 607551754 609201908 610875309 612511039 614151359 615930319 617788553 619523942 621085763
3471.4 621085763 622651637 624391139 626401722 628548145 630506337 632326722 634329438 636473179
3487.7 636473179 638574719 640741825 643034875 645378292 647752464 650206089 652711451 655066192
3504 655066192 657273114 659574330 662023902 664602458 667228520 669731796 672200799 674822986 677577138
3522.4 677577138 680225670 682652712 684979737 687299550 689733386 692362010 694948792 697352409
3538.7 697352409 699921072 702832043 705731034 708178997 710321486 712640345 715149045 717643261
3555 717643261 720175385 722905278 725822449 728778958 731834829 734972060 737737596 740180969 742872596
3573.4 742872596 745988131 749286294 752657175 756157041 759791136 763526380 767104506 770266414
3589.7G70266414L069639L362119L491342L410399L391326L363609L325403L405988
3606G97086239L530800L372431L066480K963901K963900K938867K655864K250135K296090
3624.4H23124707K737283K942265K149701J367032J456261J640677J630128J685023
3640.7H38733077J873314K180279K467572K201617R97722J87159N36919J008331R08077
3659H51094067P25031P59423J035750J396417J448870J029849P57694N55814j47403
3677.4H58655512m18663J2398O31034J267493J700223J147568n8293l37303J12712
3695.8H62712681M94123O28531M45485J32978K84433P23899P59244J46210m38452l61502
3716.2H65527630J0848K66790K90692J55330L2782J41621N91099J017452P34984j32203
$$ plain form
3589.7 770266414 773336053 776698172 780189514 783599913 786991239 790354848 793680251 797086239
3606 797086239 800617039 803989470 807055950 810019851 812983751 815922618 818578482 820828617 823124707
3624.4 823124707 825861990 828804255 830953956 832320988 833777249 835417926 837048054 838733077
3640.7 838733077 840606391 842786670 845254242 847455859 848453581 848640740 849177659 850185990 851094067
3659 851094067 851819098 852578521 853614271 855010688 856459558 857489407 858247101 858802915 858655512
3677.4 858655512 858236849 858249247 858880281 860147774 861847997 862995565 862937272 862599969 862712681
3695.8 862712681 863206804 863835335 864280820 864413798 864698231 865422130 866181374 866327584 865889132 865527630
3716.2 865527630 865538478 865805268 866095960 866251290 866284072 866425693 867016792 868034244 868769228 868637025
3736.5H68637025n11348j01387M56214M29272R001K9921j07467o24180n52833j39654
3756.9H67524564m2438j95623j47998Q5115J85371L7968l43859m67181m6552L91484
3777.3H66980851K91228j40905k36810j69754k00450j11818M3988K14398M14192M19617
3797.7H67504537K67267K3723k69830k96593l36409l86595n6565L95894N43714L80694
3818.1H67769837J22846m19677p20083m31419r5963J62422L53694M65572M28379m5240
3838.5H67590368n42224n71847m85122k94328K82586Q60155N65827o11365r37820m45544
3858.9H65410686K7298K50280J65999J4246o1155k75611m94600m34339q1181K40802
3879.3H64762425J23680l9101n6624k41935j88887m6790k08795j31011K88725M37379
$$ plain form
3736.5 868637025 868125677 868024290 868480504 868909776 868918777 868948698 868841231 868217051 867664218 867524564
3756.9 867524564 867482126 867286503 867138505 867223620 867408991 867446959 867103100 866635919 866589367 866980851
3777.3 866980851 867272079 867131174 866894364 866724610 866524160 866412342 866456330 866670728 867084920 867504537
3797.7 867504537 867771804 867795527 867525697 867229104 866892695 866506100 866449535 866845429 867389143 867769837
3818.1 867769837 867892683 867473006 866752923 866321504 866225541 866387963 866741657 867207229 867635608 867590368
3838.5 867590368 867048144 866476297 865991175 865696847 865979433 866839588 867405415 866794050 865856230 865410686
3858.9 865410686 865437984 865688264 865854263 865868509 865807354 865531743 865037143 864602804 864521623 864762425
3879.3 864762425 864886105 864847004 864790380 864548445 864359558 864312768 864103973 863972962 864261687 864699066
3899.7H64699066J23560k28166m60923n57006l67105m4047J96695K94149J66356o7234
3920.1H63755345j74284j40667p1585N663R8884O3836j59800k29418p570J20461j2278
3942.5H63248587q5891J9193J4484j07288j02103n0128k6285O7770R3460l6895p2837
3965H62962067o378l9577o7651J9312O9916O199l4631j78o855m9472n7637n6744j9848
3991.5H62718523K6285j5020o3002
3997.6H62666786
$$ plain form
3899.7 864699066 864822626 864594460 864133537 863576531 863209426 863165379 863362074 863656223 863822579 863755345
3920.1 863755345 863581061 863440394 863368809 863374472 863473356 863537192 863377392 863147974 863140404 863260865 863248587
3942.5 863248587 863162696 863181889 863196373 863089085 862986982 862936854 862910569 862978339 863071799 863034904 862962067
3965 862962067 862955689 862916112 862848461 862867773 862937689 862943888 862909257 862909079 862902224 862852752 862795115 862738371 862718523
3991.5 862718523 862744808 862729788 862666786
3997.6 862666786
##END=$$ End of the data block
