##TITLE=MLLA p-OMe $$ Begin of the data block
##JCAMP-DX=5.00 $$ ACD/SpecManager v 10.08
##SPECTROMETER/DATA SYSTEM=Alpha
##DATE=25 Jun 2015 11:03:10
##DATA TYPE=INFRARED SPECTRUM
##DATA CLASS=XYDATA
##ORIGIN=
##OWNER=
##NPOINTS=1765
##FIRSTX=399.76428223
##LASTX=3997.64306641
##MAXX=3997.64306641
##MINX=399.76428223
##MAXY=0.87435520
##MINY=0.29134798
##XFACTOR=1.0000000000
##YFACTOR=1.000000000000000e-9
##FIRSTY=0.81415749
##DELTAX=2.03961372
##XUNITS=1/CM
##YUNITS=ARBITRARY UNITS
##XYDATA=(X++(Y..Y))
399.8H14157486l353536j984060J186192j29282j941443o7234M68433n69940J200617
418.1H08967233K392530K41876P92205K694428J055837l29077J199781N97716j588047
436.5H16024482m76360N47230j476466j632452K82227o15894j665056N960J6094j901865
456.9H09107900j207948q702j325906j300454N62251J4007j085937J54436K52842j239836
477.3H03922653p84099p0453j723468k502441j218736j379967k181173j035749m13597
495.6G92612970j514733j414418r93729k667785l965675l894985m866481n994022n246401
514G62054741m417002m678309m118144k934218l009975l278672k162517j255095j344919
532.3G34855890j000523l79563l81529k82943J05440m35114j843452l067434l808141
$$ plain form
399.8 814157486 810803950 808819890 810006082 809876800 807935357 807868123 808336556 807766616 808967233
418.1 808967233 811359763 811601639 812393844 815088272 816144109 815815032 817014813 817612529 816024482
436.5 816024482 815548122 816095352 814618886 812986434 813268661 812652767 810987711 810993671 811009765 809107900
456.9 809107900 807899952 807891250 806565344 805264890 805827141 805841148 804755211 804909647 805162489 803922653
477.3 803922653 803138554 803068101 801344633 798842192 797623456 796243489 794062316 793026567 792612970
495.6 792612970 791098237 789683819 788690090 786022305 782056630 778161645 773295164 767301142 762054741
514 762054741 757637739 752959430 748841286 745907068 742897093 739618421 737455904 736200809 734855890
532.3 734855890 733855367 733475804 733094275 732811332 732916772 732481658 730638206 727570772 723762631
550.7G23762631l465831j230597J974284M173041M649698M056573L189922K393663
567G39503384J812458J577079J939595K677619L218830L525734L455102K769172J927138
585.4G62406111J506328J179099O91593O18219R89378J343131J870990K524376K519130
603.7G75648355K068401K080917K163828J569569Q63313M97401Q0943j08480K62976
622.1G85127223L08036k58088l30686L8743J2278K24471J313985K179503J867891R45508
642.5G91428864q5294r89974q36491K90930R00328J110792J995504K722919K362251
660.8G98899829J964689J931786J636327Q91923P69794J029492R02355J092851J517415
679.2H10636461J082659N46872P05481M98056q5890J41561N08368J59323K54512R93192
$$ plain form
550.7 723762631 720296800 719066203 721040487 725213528 729863226 733919799 737109721 739503384
567 739503384 741315842 742892921 744832516 747510135 750728965 754254699 757709801 760478973 762406111
585.4 762406111 763912439 765091538 765783131 766401350 767390728 768733859 770604849 773129225 775648355
603.7 775648355 777716756 779797673 781961501 783531070 784394383 784891784 784972727 784864247 785127223
622.1 785127223 785435259 785177171 784846485 784885228 784897506 785121977 786435962 788615465 790483356 791428864
642.5 791428864 791343570 790353596 789517105 789808035 790708363 791819155 793814659 796537578 798899829
660.8 798899829 800864518 802796304 804432631 805324554 806094348 807123840 808026195 809119046 810636461
679.2 810636461 811719120 812265992 812971473 813469529 813383639 813525200 814033568 814192891 814447403 815440595
699.6H15440595R18210M18126P18773R22978L19719J65999N32210Q6784o38664q01384
720H18083346j275778k031088k130270k400279l537416l477753o77466K522051L568650
738.3H08643997K974271J551092o49512k763748m276335n422235n608081m528523l170490
756.7G86750436j839400j56760J106561J121342O42359N95093P38501R80139J639724
775.1G91577995K050519J523137P22110J01149p30812j294136r08554l51548n15580
793.4G92174280j162112k096236l540098n175651o586134p643819p726610o450295
809.7G51793325m890442m373908n135000p316410j1543870j7428041k3035705k5915623
826F52154326k3860573j6249001m997433O813884J6938389K4012744K7205765K6891291
$$ plain form
699.6 815440595 816358805 816776931 817495704 818418682 818738401 818904400 819436610 819523394 818884730 818083346
720 818083346 816807568 814776480 812646210 810245931 806708515 803230762 802553296 805075347 808643997
738.3 808643997 811618268 813169360 812519848 809756100 805479765 800057530 794449449 789920926 786750436
756.7 786750436 784911036 784754276 785860837 786982179 787624538 788219631 788958132 789938271 791577995
775.1 791577995 793628514 795151651 795873761 795974910 795244098 793949962 793041408 792689860 792174280
793.4 792174280 791012168 788915932 785375834 780200183 773614049 765970230 758243620 751793325
809.7 751793325 746902883 742528975 737393975 730077565 718533695 701105654 678069949 652154326
826 652154326 628293753 612044752 607047319 613861203 630799592 654812336 682018101 708909392
842.4G08909392K4478972K0957589J6944707J3351679J0522485Q166015O424665N457580
858.7H15213084M654229L599465K701402K106428J572847J363039J534283J457632
875H34202409J050174Q01086N84126J40250j12891n1260k33472o78599j004994j308083
895.4H33388746j376510p85649j63853l63529r63747j133442p76291j5199Q73327J157701
915.8H29841554O41942Q3924k14041p44760j448273j941681k423406k828658k641022
934.1H18325579k111256j820445j477897p66099j89125J50084O45995P92206P8261
952.5H13627303p47979j118422j475513j787006j510799r59754n46754Q0109P09176
970.9H06270361N08726l45946j137614j783967j975536j071692L58820J210272J557827
$$ plain form
842.4 708909392 733388364 754345953 771290660 784642339 795164824 803330839 809755504 815213084
858.7 815213084 819867313 823466778 826168180 828274608 829847455 831210494 832744777 834202409
875 834202409 835252583 836053669 836637795 836778045 836665154 836613894 836380422 835701823 834696829 833388746
895.4 833388746 832012236 831226587 831062734 830699205 829735458 828602016 827825725 827810526 828683853 829841554
915.8 829841554 830483496 830567420 830353379 829608619 828160346 826218665 823795259 820966601 818325579
934.1 818325579 816214323 814393878 812915981 812149882 811960757 812110841 812756836 813549042 813627303
952.5 813627303 812879324 811760902 810285389 808498383 806987584 806027830 805481076 805561185 806270361
970.9 806270361 806779087 806433141 805295527 803511560 801536024 800464332 800823152 802033424 803591251
989.2H03591251J736105J281619J37865r55283k010942l539622n199253o779075q373320
1007.6G79889345r056210q652568r424865j2930990j7724395k2007703k5281132k6734888
1023.9F48076594k5344730k1055042j4107883m625798O485582J7337084K6053428L1298220
1040.2F64117455L2146574K8943240K3693443J8242538J3227820R226978O690144M972577
1056.5H01260769L504157K606690K170444J574457R21547M86612k53796j476407k512992
1074.9H08281481l183901l666759l485739k377212j181245n71310l21388l83854q58307
1093.2G92251766j289666j569867k459943m475713p438302j0763109j2949288j1821210
1109.6G39484668o728471L35694O493628J0028958J0591149Q821428O083310L491819
$$ plain form
989.2 803591251 805327356 806608975 806746840 805791557 803780615 800240993 795041740 788262665 779889345
1007.6 779889345 770833135 762180567 752755702 739824712 722100317 700092614 674811482 648076594
1023.9 648076594 622731864 601676822 587568939 582943141 589428723 606765807 632819235 664117455
1040.2 664117455 696264029 725207269 748900712 767143250 780371070 789598048 796288192 801260769
1056.5 801260769 804764926 807371616 809542060 811116517 812038064 812524676 812270880 810794473 808281481
1074.9 808281481 805097580 801430821 797945082 795567870 794386625 793815315 793493927 793110073 792251766
1093.2 792251766 790962100 789392233 786932290 782456577 775018275 764255166 751305878 739484668
1109.6 739484668 732756197 733091891 739585519 749614477 760205626 769027054 775110364 778602183
1125.9G78602183J354635k72453j475156k584695l696561m583895n188823n742789
1142.2G56412446o252110o443142o277979n985081n860508o316840p688940r922564
1158.5G01665282j2939572j7288089k4067879l3448577m2024612m3100476l3564717
1172.8D95231360j8314391l854126Q315921J9528359K9440761L5612702L5899460L0781627
1189.1F32641673K3154318J5658498R227276L857792n57483l920793n833745o033063
1205.4F68194473n008280l675461k604127k048970k165615k803445l751337n161822
1221.7F40975416p261396r971320j3108611j6599238k0263076k3960352k7837515l1668633
1238.1D90305275l4364373l4650117l1777710k5825888j7693489q537352Q48621R913116
$$ plain form
1125.9 778602183 779956818 779684365 778209209 775624514 771927953 767344058 762155235 756412446
1142.2 756412446 750160336 743717194 737439215 731454134 725593626 719276786 711587846 701665282
1158.5 701665282 688725710 671437621 647369742 613921165 571896553 528796077 495231360
1172.8 495231360 476916969 473062843 481378764 500907123 530347884 565960586 601860046 632641673
1189.1 632641673 655795991 671454489 680681765 684539557 683982074 680061281 674227536 668194473
1205.4 668194473 663186193 659510732 656906605 654857635 652692020 649888575 646137238 640975416
1221.7 640975416 633714020 623742700 610634089 594034851 573771775 549811423 521973908 490305275
1238.1 490305275 455940902 421290785 389513075 363687187 345993698 337456346 338304967 348218083
1254.4C48218083J7969489K4208367K7969420K8993935K7676612K4895340K1430761
1268.6E21362007J7740786J4119506J1370301J0101676R307384P342100L944815K45213
1285E95533788k614677m039645m175305m062295m771591o403446q189499q536756m788876
1303.3E47951698M507721J6465425K5386811K8144657K5755704K0696699J5301824
1317.6F84210539J0692417O855190L636480J069128p46667j771689j698434l81768
1333.9G01865196J383245K676726L311753L278732K609015J508474K88308q38638j580596
1352.3G14502215j488685o26981N33044J586258K064467J637220R31621M52578k0206
1370.6G19571531j004100k691627l281712j173437K173543M167497L625572K3961n033493
$$ plain form
1254.4 348218083 366187572 390395939 418365359 447359294 475035906 499931246 521362007
1268.6 521362007 539102793 553222299 564592600 574694276 584001660 591343760 595288575 595533788
1285 595533788 592919111 588879466 584704161 580641866 575870275 569466829 561277330 552740574 547951698
1303.3 547951698 552459419 568924844 594311655 622456312 648212016 668908715 684210539
1317.6 684210539 694902956 701758146 705394626 706463754 705717087 703945398 702246964 701865196
1333.9 701865196 703248441 705925167 709236920 712515652 715124667 716633141 716921449 716082811 714502215
1352.3 714502215 713013530 712386549 712919593 714505851 716570318 718207538 719139159 719591737 719571531
1370.6 719571531 718567431 715875804 712594092 711420655 713594198 717761695 721387267 721411228 716377735
1389G16377735o240606k565861J987040L340960J806557P3910m10676l48330o33895
1407.3G13386834j261056k211392l406286m640698o786466j0041416r980142o124079
1423.7F68935299j317978K434015K845705l31938n078674j1724770j6951501j3492644
1440F25317514n427718K659619O804466M367053j906097n969107o017327n376160o198347
1458.3F08253896n440891k364039L038943R686172J4087081J6900599J8181205J4567315
1474.7F76910281R317339O193399M115462K449692J070678k67267k463639n499661
1491F91826284p496297j0353148j6994596k5220096l1827867l8053036n6267440q5445136
1507.3D20168668p5863302m3727874r229512L6238969P7582598R2933088Q7493688
$$ plain form
1389 716377735 710137129 707571268 709558308 712899268 714705825 714779735 714369059 714020729 713386834
1407.3 713386834 712125778 709914386 706508100 701867402 695080936 685039520 675059378 668935299
1423.7 668935299 667617321 670051336 672897041 672565103 667486429 655761659 638810158 625317514
1440 625317514 619889796 622549415 629353881 633720934 631814837 625845730 619828403 614452243 608253896
1458.3 608253896 602813005 600448966 603487909 613174081 627261162 644161761 662342966 676910281
1474.7 676910281 686227620 692421019 696536481 698986173 700056851 699789584 697325945 691826284
1491 691826284 684329987 673976839 656982243 631762147 599934280 561881244 505613804 420168668
1507.3 420168668 344305366 300577492 291347980 327586949 405169547 498102635 585596323
1521.6E85596323O0315192L1785846J7859280J0007619O092668M018307K476156K483606
1537.9G20634997K700210J001656N9545K50518P96437J113236J044035J001358J125276
1556.2G29727268l19063m724145o200433o859183q873821j1857450j4714002j3209284
1572.6F62969887j0770678j1230469j1138797j0700106j0355890p572532l996074l215015
1588.9E93990326o804407j3055086j9468367k4003446k5750876k4206638j9032240
1603.2D61669266j2277901o867230j229763Q150160J8719167K7468622K9449194J9320071
1619.5E44401586R401023L329158j742303n281448p378161p308543o562412p402778
1635.8E21456122p273078n501806m233957l469526l803254m515051l488511l391892
$$ plain form
1521.6 585596323 645911515 677697361 695556641 705564260 711656928 715675235 718151391 720634997
1537.9 720634997 723335207 724336863 724396408 724646926 725443363 726556599 727600634 728601992 729727268
1556.2 729727268 729408205 724684060 718483627 711624444 702750623 690893173 676179171 662969887
1572.6 662969887 652199209 640968740 629829943 619129837 608773947 601201415 597205341 593990326
1588.9 593990326 587185919 574130833 554662466 530659020 504908144 480701506 461669266
1603.2 461669266 449391365 442524135 441294372 449444532 468163699 495632321 525081515 544401586
1619.5 544401586 553802609 557131767 555389464 550108016 542729855 535421312 528858900 521456122
1635.8 521456122 514183044 508681238 504447281 500977755 497174501 492659450 489170939 485779047
1652.1D85779047n502015m856706l257215k578348k510250k488195j837671j417876
1668.4D61330771j730471j687318j568228j875312j623213q99851l47644n21958j23948
1686.8D50952828J287281K700299L779620N095035N808115N809397O133735N495459
1703.1D87061769N777359O760061P249325Q001030Q907616R633243R819269Q132696
1719.4E51342368O464660O826043P947863R259820J0939955J2992502J7192721J9169509
1735.7F42135441J7860055J9554735J9896328J7384946J5337527J3367176J1293709
1750G56829917Q566857N739033L931046K777159K483129L255666M610121O627917Q516431
1768.4H03337276Q981705Q364618O399989M601419M202664M136025L719986L256261
$$ plain form
1652.1 485779047 480277032 475420326 472163111 469584763 467074513 464586318 462748647 461330771
1668.4 461330771 459600300 457912982 456344754 454469442 452846229 451946378 451598734 451076776 450952828
1686.8 450952828 452240109 454940408 458720028 463815063 469623178 475432575 481566310 487061769
1703.1 487061769 492839128 499599189 506848514 514849544 523757160 533390403 543209672 551342368
1719.4 551342368 557807028 564633071 572580934 581840754 592780709 605773211 622965932 642135441
1735.7 642135441 659995496 679550231 699446559 716831505 732169032 745536208 756829917
1750 756829917 765396774 771135807 775066853 777844012 780327141 783582807 788192928 794820845 803337276
1768.4 803337276 812318981 820683599 827083588 831685007 835887671 840023696 843743682 846999943
1784.7H46999943K970815K886176K776742K058387J232684J155197J271427J097083
1801H62448454P92682O35088P52389R28700P42912L90351M26531N54800M43578M95851
1821.4H68611336P46488O42360M02212L07381m8101k22683K5392J87397K12311L94762
1841.8H71258855L71694k21014o02305m74989k48849k26200l13699k73466k66075l79503
1862.2H68624449k50399P4505j57296q63552r92537p44879p36356p05659n55218n28812
1882.6H63164246m75228j80185k5510k01047j19746J68145J75476J68622L75628M61400
1903H63511801L92139M71890N50389L55303K42353M83274N49555K24888J29640J99914
1923.4H67111146J9849p0393Q4817J14083k4914J013J36137J39177R5665O6519K0385
$$ plain form
1784.7 846999943 849970758 852856934 855633676 857692063 858924747 860079944 861351371 862448454
1801 862448454 863241136 863876224 864628613 865557313 866300225 866690576 867117107 867671907 868115485 868611336
1821.4 868611336 869357824 870000184 870402396 870709777 870661676 870438993 870464385 870651782 870864093 871258855
1841.8 871258855 871630549 871409535 870807230 870332241 870083392 869857192 869543493 869270027 869003952 868624449
1862.2 868624449 868374050 868448555 868291259 867427707 866435170 865690291 864953935 864248276 863693058 863164246
1882.6 863164246 862689018 862508833 862483323 862282276 862162530 862330675 862506151 862674773 863050401 863511801
1903 863511801 863903940 864375830 864926219 865281522 865523875 866007149 866556704 866781592 866911232 867111146
1923.4 867111146 867130995 867060602 867145419 867259502 867234588 867235601 867371738 867510915 867606580 867673099 867693484
1945.8H67693484o318J06156K49266J86205Q3089J24156J32025N5253J19329J96337
1966.2H68938982M9830l8505J02044J40309L9399O0319R7454j6689r3460l696J6272
1988.7H69292259j00314j54674j49191k16961k38597j47164j69277k66671k32339j91152
2009H67425919l17514l86358k98023l63767n85139o14822n93245n69939j12355L16799
2029.4H63901556J19507k15292k45452j86503k49147k77341j83701j37210j69873r2864
2049.8H62263680P8797J67489K37107M10617N53488N89073O71744P82490P62522O89745
2070.2H67206752P05421O97434N88060N11944M92692M19140L46601L67224L52383K47001
2090.6H71934652K11358K53141K11954J61708K08378J99735R9778Q4519J43648J22487
$$ plain form
1945.8 867693484 867687166 867793322 868042588 868228793 868311882 868436038 868568063 868623316 868742645 868938982
1966.2 868938982 868988812 868950307 869052351 869192660 869232059 869292378 869389832 869373143 869279683 869275987 869292259
1988.7 869292259 869191945 869037271 868888080 868671119 868432522 868285358 868116081 867849410 867617071 867425919
2009 867425919 867108405 866722047 866424024 866060257 865475118 864860296 864267051 863697112 863584757 863901556
2029.4 863901556 864021063 863805771 863560319 863373816 863124669 862847328 862663627 862526417 862356544 862263680
2049.8 862263680 862342477 862509966 862747073 863157690 863711178 864300251 864971995 865754485 866517007 867206752
2070.2 867206752 867912173 868609607 869197667 869709611 870202303 870621443 870968044 871335268 871687651 871934652
2090.6 871934652 872146010 872399151 872611105 872772813 872981191 873180926 873280704 873365223 873508871 873631358
2111H73631358O7890Q3864R4115L2246M888N2392Q3626P1347O7710O1214J0133o318
2135.5H74254465L5942M2081P510J192J4007n782k4140j0907j8955n7339o3598l6836
2160H74137640l7372o4254j01805j58250j15991L0518O5505j8358n7578l6120j4365
2182.4H73629570N960J2398k8014r4056r6381l6239m5479j09911j30534j16467j06991
2204.8H72883856r8467q9526q9347r5725r4891o0200m4525q1003r0718p1466q6129
2227.3H71981859j10745j20163j43469j68502j68204j57714j83344k22743k22861k29478
2247.7H70254636k62439k51472k27392k56002k87354k83897k78592l20673l68714l55304
2268.1H67362797l37064l59774l89456l93451l78370l46899k82526k08378j69039j37686
$$ plain form
2111 873631358 873699248 873783112 873877227 873909473 873914361 873966753 874050379 874121726 874189436 874250650 874260783 874254465
2135.5 874254465 874290407 874332488 874339998 874341190 874355197 874349415 874325275 874314368 874295413 874238074 874174476 874137640
2160 874137640 874100268 874036014 873934209 873775959 873659968 873690486 873755991 873737633 873680055 873643935 873629570
2182.4 873629570 873635530 873647928 873619914 873525858 873429477 873393238 873347759 873237848 873107314 872990847 872883856
2204.8 872883856 872785389 872695863 872606516 872510791 872415900 872355700 872311175 872230172 872139454 872067988 871981859
2227.3 871981859 871871114 871750951 871607482 871438980 871270776 871113062 870929718 870706975 870484114 870254636
2247.7 870254636 869992197 869740725 869513333 869257331 868969977 868686080 868407488 868086815 867718101 867362797
2268.1 867362797 867025733 866665959 866276503 865883052 865504682 865157783 864875257 864666879 864497840 864360154
2288.5H64360154q8454m1186J3172O3658P9095P1287O4731N9068Q1718J14143R0599
2310.9H64867985L3558K563L4213J15573J22368N126m8518o437k5034j38760k45273
2333.3H64717364k56955k11001j03831n5313l27885o78599m54307J45138N85198O68406
2353.7H64028215M77732J61409k40386n45382p11977p78497p67290p87139q62181q59917
2374.1H59114587p63833o98686o57678n43832m28558m21226m19140l57449l35216l36290
2394.5H54152679k94745k89976l31581l30984l28660l81053m36008m44352m76003n64814
2414.9H50274503n97179n60462n51343n31852m40717l51668l02612k46287j79052j75476
2435.3H46337855k12491j87576j85012k54333k77698k69890l17991l54767l22580l35038
$$ plain form
2288.5 864360154 864271700 864230514 864243686 864307344 864386439 864457726 864522457 864581525 864663243 864777386 864867985
2310.9 864867985 864901543 864904106 864938319 865053892 865176260 865181386 865132868 865126431 865101397 864962637 864717364
2333.3 864717364 864460409 864249408 864145577 864090264 863762379 863083780 862629473 862774611 863359809 864028215
2353.7 864028215 864505947 864667356 864426970 863881588 863169611 862391114 861623824 860836685 859974504 859114587
2374.1 859114587 858350754 857652068 856994390 856450558 856022000 855600774 855181634 854824185 854488969 854152679
2394.5 854152679 853857934 853567958 853236377 852905393 852576733 852195680 851759672 851315320 850839317 850274503
2414.9 850274503 849677324 849116862 848565519 848033667 847592950 847241282 846938670 846692383 846513331 846337855
2435.3 846337855 846125364 845937788 845752776 845498443 845220745 844950855 844632864 844278097 843955517 843620479
2455.7H43620479m04417m03464l66926l94106m50194m79639n08368n45919n40018n16176
2476.1H39011252n10395m79459m21942l75449l42906k86937k44200k67804k49266j65880
2496.5H35667014j53363j82449j59383j51813j93119j94490j72377k23935l22222l49582
2516.9H33564281k93374k46822k24114k08557k35557k71559k77758l37600m62890n19812
2537.3H30486238m95434n05268n27740m58062l69072l40879k62558j11461r358N6863
2557.7H27463269J88709L07798L09825L13461L57985L17335K45989K33590J62840L9637
2578.1H29940438K0623K5392o6459j48535j65820k16067k80082k06590p2479n0664
2598.5H28779757m5776K1159N0247L7611R1195J54972Q7201J0431O1155P7664k503
$$ plain form
2455.7 843620479 843216062 842812598 842445672 842051566 841601372 841121733 840613365 840067446 839527428 839011252
2476.1 839011252 838500857 838021398 837599456 837224007 836881101 836594164 836349964 836082160 835832894 835667014
2496.5 835667014 835513651 835331202 835171819 835020006 834826887 834632397 834460020 834236085 833913863 833564281
2516.9 833564281 833270907 833024085 832799971 832591414 832355857 832084298 831806540 831468940 831006050 830486238
2537.3 830486238 829990804 829485536 828957796 828499734 828130662 827789783 827527225 827415764 827406406 827463269
2557.7 827463269 827651978 827959776 828269601 828583062 828941047 829258382 829504371 829737961 829900801 829940438
2578.1 829940438 829961061 829986453 829919994 829771459 829605639 829389572 829109490 828902900 828830421 828779757
2598.5 828779757 828733981 828755140 828805387 828842998 828934193 829089165 829176366 829186797 829247952 829325616 829323113
2620.9H29323113k1458Q226m0949j09911r7751q4639r9659n0306K5928K8253K1100
2643.4H28901947Q8214J16527O7294Q1659J24573O6161r298o56L338m1067l7909j0431
2667.8H29350352p5280j57297j51038j47879k09630k18749j77264k30074k95699k43306
2688.2H27444136j83701j93119j70827j18792j51158k08020k06590k30550k82944k74896
2708.6H25423539k66552l26455l74496l64005l65258l89993l57330k95400l41535m49836
2729H21892679m54009m21822m55737m68612m60028n32091o23524o06716n76198o33419
2749.4H16660523o59763o17385o36936o93678o61731o03616o00875n92112n41330n28574
2769.8H10524523n51641n29766n34594n92887o03974n67734n84305o63638o99282p39932
$$ plain form
2620.9 829323113 829301655 829309881 829268932 829159021 829061270 828976631 828876972 828826666 828852594 828880847 828901947
2643.4 828901947 828990161 829106688 829173982 829255641 829380214 829446375 829437077 829436421 829439759 829398692 829360783 829350352
2667.8 829350352 829275072 829117775 828966737 828818858 828609228 828390479 828213215 827983141 827687442 827444136
2688.2 827444136 827260435 827067316 826896489 826777697 826626539 826418519 826211929 825981379 825698435 825423539
2708.6 825423539 825156987 824830532 824456036 824092031 823726773 823336780 822979450 822684050 822342515 821892679
2729 821892679 821438670 821016848 820561111 820092499 819632471 819100380 818476856 817870140 817293942 816660523
2749.4 816660523 816000760 815383375 814746439 814052761 813391030 812787414 812186539 811594427 811053097 810524523
2769.8 810524523 809972882 809443116 808908522 808315635 807711661 807143927 806559622 805895984 805196702 804456770
2790.2H04456770q80062r79841r41157r41873j072466j179099j242221j337707j400113
2808.6G94482231j453101j582027j719594j887202k237320k848327l834248n459428
2824.9G73460984p905543j0743379j2674570j2141884q392334k285838L972590Q338332
2841.2G31628358J0060847R533405P693828N479812L532708K131402J211703N94020
2857.5G71866083J82390j22666l97325o26206q04841r46820j061976j228810j485765
2875.9G65374064j779496k084673k400815k748251l136158l523171l856897m087389
2892.2G41757214m189253m150390m007757l765226l369987k834975k154649j313030
2908.5G15971947m09961L34144P05838O86645L35336l58939j318991k343178l211498
$$ plain form
2790.2 804456770 803576708 802596867 801655710 800713837 799641371 798462272 797220051 795882344 794482231
2808.6 794482231 793029130 791447103 789727509 787840307 785602987 782754660 778920412 773460984
2824.9 773460984 765555441 754812062 742137492 729995608 721603274 719317436 723290026 731628358
2841.2 731628358 741689205 751222610 758916438 764396250 767928958 770060360 771272063 771866083
2857.5 771866083 772048473 771925807 771528482 770902276 770097435 769150615 768088639 766859829 765374064
2875.9 765374064 763594568 761509895 759109080 756360829 753224671 749701500 745844603 741757214
2892.2 741757214 737567961 733417571 729409814 725644588 722274601 719439626 717284977 715971947
2908.5 715971947 715561986 715896130 716601968 717288613 717623949 717265010 715946019 713602841 710391343
2926.8G10391343l709019l585219k605796q89480J014292K485156L119827K828061
2943.2G09049165J807630M47870p47621j348258j293241p42734J21594J037299J845360
2961.5G10177064K488494K915621L169000L316760L388703L360212L159344K815485
2977.8G34790683K331137J571119N50747o31511j862466k820075l276527l211498k542794
2996.2G24898815j472592m09603N63442J401246J998126K407730K715051K872646K785862
3014.5G37760723K475917J998246J334011N01454k66731q24213j227677j366317j099288
3032.9G39286125n36382Q1002N81324Q37267P47978M42803J37747j58549m77910p50839
3053.3G40190566r69112j134456j128196r12905o85632n75364n05447m23193k59817
$$ plain form
2926.8 710391343 706682324 703097105 700491309 699601829 700616121 703101277 706221104 709049165
2943.2 709049165 710856795 711304665 710557044 709208786 707915545 707172811 707294405 708331704 710177064
2961.5 710177064 712665558 715581179 718750179 722066939 725455642 728815854 731975198 734790683
2977.8 734790683 737121820 738692939 739243686 738612175 736749709 733929634 730653107 727441609 724898815
2996.2 724898815 723426223 723016620 723580062 724981308 726979434 729387164 732102215 734974861 737760723
3014.5 737760723 740236640 742234886 743568897 744070351 743803620 742979407 741751730 740385413 739286125
3032.9 739286125 738749743 738830745 739412069 740249336 740997314 741440117 741577864 741419315 740941405 740190566
3053.3 740190566 739221454 738086998 736958802 736045897 735360265 734784901 734279454 733856261 733596444
3071.7G33596444J00613O15358R82583R98854R28164R22739P50304M96328L38137J09136
3092.1G39838660j38343j91867j50323j46568j01506R9659L62575M63962L96848L81350
3112.4G40814447M16279L25680J40786q4102k42114j17898J52230K76923K94030L28660
3132.8G42304921L12805K26796J45018j907k24829l77536m24146m56512n42820o92546
3153.2G40269244q96216j072466j116216j072169j100659j188815j199841j222313
3169.6G31400549j350641j416325j370132j401782j489342j486897j469314j518131
3185.9G19897985j521527j443327j431942j483917j479149j444936j424610j373828
3202.2G08294749j315474j298487j306832j310289j322150j349926j299799j205683
$$ plain form
3071.7 733596444 733697057 734312415 735294998 736293852 737222016 738144755 738895059 739391387 739729524 739838660
3092.1 739838660 739700317 739508450 739358127 739211559 739110053 739209712 739572287 740036249 740433097 740814447
3112.4 740814447 741230726 741556406 741697192 741613090 741370976 741253078 741405308 741682231 741976261 742304921
3132.8 742304921 742617726 742844522 742989540 742987633 742762804 742385268 741961122 741504610 740961790 740269244
3153.2 740269244 739373028 738300562 737184346 736112177 735011518 733822703 732622862 731400549
3169.6 731400549 730049908 728633583 727263451 725861669 724372327 722885430 721416116 719897985
3185.9 719897985 718376458 716933131 715501189 714017272 712538123 711093187 709668577 708294749
3202.2 708294749 706979275 705680788 704373956 703063667 701741517 700391591 699091792 697886109
3218.5F97886109j199901j220107j163065j086772j072824j051426r77635r65118r83656
3236.9F88165605r14872q40783q04186p19964o23882o17564o05821m80593m00245m37438
3257.3F81720257m27664l57866l36766l42608k98738k08497j75417k29299k67565k93791
3277.7F78782046l30627l21865l18110l66748l94761l93212m51326n43893n63740n60761
3298F74537003o05345o41823o70790p55370q46088q64506r20474j038969j043915r71795
3318.4F66177928j017749j139581j169622j173854j241505j261175j242637j295448
3334.8F56636357j359284j373589j384914j417458j462638j507640j527905j540542
3351.1F45062387j578331j610756j626193j625658j614630j646757j699507j684845
$$ plain form
3218.5 697886109 696686208 695466101 694303036 693216264 692143440 691092014 690114379 689149261 688165605
3236.9 688165605 687250733 686409950 685605764 684885800 684261918 683644354 683038533 682557940 682157695 681720257
3257.3 681720257 681292593 680934727 680597961 680255353 679956615 679748118 679572701 679343402 679075837 678782046
3277.7 678782046 678451419 678129554 677811444 677444696 677049935 676656723 676205397 675661504 675097764 674537003
3298 674537003 673931658 673289835 672619045 671863675 671017587 670153081 669232607 668193638 667149723 666177928
3318.4 666177928 665160179 664020598 662850976 661677122 660435617 659174442 657931805 656636357
3334.8 656636357 655277073 653903484 652518570 651101112 649638474 648130834 646602929 645062387
3351.1 645062387 643484056 641873300 640247107 638621449 637006819 635360062 633660555 631975710
3367.4F31975710j627624j576781j500189j421273j356363j251638j113892j016974
3383.7F21110976r71914q81314p51614o61970n82575m52519l01778j84715q4460p272
3404.1F16230845L9578J41919L15070M08292L96430M29750N52654O25729O30319O98805
3424.5F20469391P86722Q36790Q99613J014947J116932J131177J128375J205862J308441
3442.9F29898250J370549J416326J415431J429975J492441J513958J526654J614034
3459.2F41677618J669288J652181J714766J835227J798630J626849J648128J868427
3475.5F55491114K075076K138614K017260J953840K079845K186477K203882K250433
3491.8F72396541K326309K378524K385854K409935K457083K313077K115131K209544
$$ plain form
3367.4 631975710 630348086 628771305 627271116 625849843 624493480 623241842 622127950 621110976
3383.7 621110976 620139062 619257748 618506134 617844164 617261589 616809070 616507292 616322577 616238117 616230845
3404.1 616230845 616270423 616412342 616727412 617135704 617532134 617961884 618514538 619140267 619770586 620469391
3424.5 620469391 621256113 622092903 622992516 624007463 625124395 626255572 627383947 628589809 629898250
3442.9 629898250 631268799 632685125 634100556 635530531 637022972 638536930 640063584 641677618
3459.2 641677618 643346906 644999087 646713853 648549080 650347710 651974559 653622687 655491114
3475.5 655491114 657566190 659704804 661722064 663675904 665755749 667942226 670146108 672396541
3491.8 672396541 674722850 677101374 679487228 681897163 684354246 686667323 688782454 690991998
3508.1F90991998K390861K424956K320528K192735K204120K303124K386033K289892
3524.4G09504247K063095J949311J953005K013624K120614K116203K011061K119005
3540.8G25850165K337396K293706J953542J762271J937509K068340J989365K018929
3557.1G42211223K228200K385259K446174K527595K486706K099395J831948K061665
3573.4G60278165K466560K657473K696752K827168L053605L139019K803207K349377
3589.7G82271326K360582K652049K793014K767205K683997K601624K631783K746761
3606H03508341K802432K664208K497495K448022K442777K427518K153457J810252J968682
3624.4H24723184K471209K619028J827299J156211J261294J440764J498758J572013
$$ plain form
3508.1 690991998 693382859 695807815 698128343 700321078 702525198 704828322 707214355 709504247
3524.4 709504247 711567342 713516653 715469658 717483282 719603896 721720099 723731160 725850165
3540.8 725850165 728187561 730481267 732434809 734197080 736134589 738202929 740192294 742211223
3557.1 742211223 744439423 746824682 749270856 751798451 754285157 756384552 758216500 760278165
3573.4 760278165 762744725 765402198 768098950 770926118 773979723 777118742 779921949 782271326
3589.7 782271326 784631908 787283957 790076971 792844176 795528173 798129797 800761580 803508341
3606 803508341 806310773 808974981 811472476 813920498 816363275 818790793 820944250 822754502 824723184
3624.4 824723184 827194393 829813421 831640720 832796931 834058225 835498989 836997747 838569760
3640.7H38569760J744569K115130K437234K116978R81808K80142N68866R58920Q71301
3659H50644708P04765P49946J029849J349628J343488R74954P82430N16653j94550
3677.4H57901871l50714Q0944O11186J213073J596809R38356k19286l71873O7174L83199
3697.8H61850739N25236L85999J15216L35634Q45373Q03291j2219n81324l03387J46150
3718.2H64110708L57747L07858M5479j56105L7611N97298R74774N58317l48866o97315
3738.6H65787506k02060M30346L64005l9339P0990j90795q74758o51777l5643j5259
3759H64643216l36587k14160J14501J39773q345k49267l78191j06812K81573K18987
3779.4H64104688k44021l56794j87456j54615r7215Q1897K45631K87771K48849K45750
$$ plain form
3640.7 838569760 840314329 842429459 844866693 846983671 847965479 848245621 848814487 849773407 850644708
3659 850644708 851349473 852099419 853129268 854478896 855822384 856797338 857579768 858096421 857901871
3677.4 857901871 857551157 857632101 858243287 859456360 861053169 861991525 861772239 861400366 861467540 861850739
3697.8 861850739 862375975 862761974 862877190 863212824 864058197 864861488 864849269 864267945 863964558 864110708
3718.2 864110708 864468455 864776313 864821792 864665687 864703298 865300596 866275370 866833687 866484821 865787506
3738.6 865787506 865585446 866015792 866379797 866340458 866411448 866220653 865345895 864694118 864658475 864643216
3759 864643216 864306629 864092469 864206970 864346743 864338398 864089131 863710940 863604128 863885701 864104688
3779.4 864104688 863860667 863503873 863316417 863161802 863064587 863146484 863392115 863679886 863928735 864174485
3799.8H64174485J6868l23116l14713m27067m75049N185M44293M21167K55465R9778
3820.2H63877296m75466p86960m19021q3685O9261K21133M13835L64364j32680n00918
3840.6H62547159n35846n51402l25024L22044Q70049M17769r09508j176715n82218
3858.9H60076308l7014K07484P3373n9903P630p3374k57313k16603L9875K57552J69158
3881.4H60187173N7459k0564k48730k07245j16170k33531n5790L15190L58343K4080
3901.8H60060215l95834o35863n78940l41475q1956R3222J15156m2498j72496j03533
3922.1H57915998l2604r7931j03593Q762l8921k18034k17021p5578L1292K8372m0770
3944.6H57159972k0981j1384j39594j97292j27196j15573j47760j18315p6652o3419
$$ plain form
3799.8 864174485 864191353 863868237 863553524 863126457 862651408 862656593 863100886 863522053 863777518 863877296
3820.2 863877296 863401830 862614870 862195849 862112164 862181425 862402558 862816393 863180757 863048077 862547159
3840.6 862547159 862011313 861459911 861134887 861456931 862326980 862744749 861835241 860658526 860076308
3858.9 860076308 860039294 860246778 860320151 860260248 860267878 860194504 859937191 859720588 859760463 860018015 860187173
3881.4 860187173 860244632 860224068 859975338 859768093 859651923 859418392 859362602 859677792 860036135 860060215
3901.8 860060215 859664381 859028518 858449578 858108103 858026147 858119369 858234525 858192027 858019531 857915998
3922.1 857915998 857883394 857785463 857681870 857690632 857651711 857433677 857216656 857141078 857172370 857200742 857159972
3944.6 857159972 857138991 857127607 856988013 856790721 856663525 856547952 856400192 856281877 856205225 856141806
3965H56141806l6955J0252J728o0498n5552o676k9504o9082l4153M887l4093j04309
3989.5H55727851j25050j23322j27971j09434
3997.6H55242074
$$ plain form
3965 856141806 856104851 856115103 856116831 856056333 856000781 855994105 855964601 855895519 855861366 855866253 855832160 855727851
3989.5 855727851 855602801 855479479 855351508 855242074
3997.6 855242074
##END=$$ End of the data block
