##TITLE=ME hep 002 $$ Begin of the data block
##JCAMP-DX=5.00 $$ ACD/SpecManager v 10.08
##SPECTROMETER/DATA SYSTEM=Alpha
##DATE=24 Jun 2014 10:27:12
##DATA TYPE=INFRARED SPECTRUM
##DATA CLASS=XYDATA
##ORIGIN=
##OWNER=
##NPOINTS=1667
##FIRSTX=599.63549805
##LASTX=3997.56909180
##MAXX=3997.56909180
##MINX=599.63549805
##MAXY=1.12197959
##MINY=0.55629951
##XFACTOR=1.0000000000
##YFACTOR=0.000000010000000
##FIRSTY=1.07518804
##DELTAX=2.03957605
##XUNITS=1/CM
##YUNITS=ARBITRARY UNITS
##XYDATA=(X++(Y..Y))
599.6A07518804J752l683n031J8943O9403J14644J45757J44744J04415P1717O7794
$$ 107518804 107520556 107516873 107511842 107530785 107600188 107714832 107860589 108005333 108109748 108181465 108249259
622.1A08249259N2106q702n8067m0149o32K5284M9901O4004M7147J6594M327P796K2102
$$ 108249259 108301365 108292663 108234596 108194447 108193815 108219099 108269000 108333004 108380151 108396745 108401072 108408868 108430970
648.6A08430970M9650O3861M4524L2747P4709J07693P0084L2901P344q822N3942N3501
$$ 108430970 108480620 108544481 108589005 108621752 108696461 108804154 108874238 108907139 108914483 108905661 108959603 109013104
673.1A09013104J5939K1386L3247K3973m172j3089J3411J4281n293j478K384k0289
$$ 109013104 109029043 109050429 109083676 109107649 109103477 109090388 109103799 109118080 109112787 109111309 109113693 109093404
697.5A09093404m8030m8506l4666l7503m6754o5851j19126j87469k60543l92032n97286
$$ 109093404 109045374 108996868 108962202 108924699 108877945 108812094 108692968 108505499 108244956 107852924 107255638
720A07255638p28357n99468k65837R7561M07779N71871N07307L27659K07055J60026
$$ 107255638 106527281 105927813 105661976 105759537 106167316 106739187 107246494 107574153 107781208 107941234
740.4A07941234J28973J20067J37532J42848J22893Q9085O1334O1881N6994J3876l5095
$$ 107941234 108070207 108190274 108327806 108470654 108593547 108682632 108743966 108805847 108862841 108876717 108841622
762.8A08841622o9630r7478j09672j10543r0659j8644N9640J04440J38211J38378Q6939
$$ 108841622 108771992 108674514 108564842 108454299 108363640 108344996 108404636 108509076 108647287 108785665 108872604
785.2A08872604L4774K7168M0340L1984J6546J4210K5737N2762O6257N7697N1951L5417
$$ 108872604 108907378 108934546 108974886 109006870 109023416 109037626 109063363 109116125 109182382 109240079 109292030 109327447
809.7A09327447r679m2439k5451J0097K8861K5022N459j4233l2127l8481k2662o79
$$ 109327447 109317768 109275329 109249878 109259975 109288836 109313858 109319317 109305084 109272957 109234476 109211814 109211135
834.2A09211135J0598R77j4913n329J0646J395n711K15n949j3959k5642n1236n9009
$$ 109211135 109221733 109222710 109207797 109202468 109213114 109214509 109208798 109209013 109203064 109189105 109163463 109112227 109053218
860.7A09053218n1272n7542p2634q1909p6079n7805k5224J3423L2758L7647L9756L8886
$$ 109053218 109001946 108944404 108871770 108789861 108713782 108655977 108630753 108644176 108676934 108714581 108754337 108793223
885.2A08793223L6216K5606j419l3939m8971m2462j8287N889j204l3843n7912o8736
$$ 108793223 108829439 108855045 108853626 108819687 108770716 108728254 108709967 108715856 108714652 108680809 108622897 108554161
909.6A08554161q8621j04689q2290l0518J9300M8053M8173K8550J0455P03j2421k3377
$$ 108554161 108465540 108360851 108278561 108248043 108267343 108315396 108363569 108392119 108402574 108403277 108390856 108367479
934.1A08367479j8239j431J1707J8513L0398L2997J5796J382j3625m2904p0357j01578
$$ 108367479 108349240 108347809 108359516 108378029 108408427 108441424 108457220 108458602 108444977 108402073 108331716 108230138
958.6A08230138j63603k58756l67975m62854n21147n29707m73403l42525j61325J9991
$$ 108230138 108066535 107807779 107439804 106976950 106455803 105926096 105452693 105110168 104948843 104968834
979A04968834J69086K61450K90454K78616K33244J61469R1064L4631p87n48K8812P7188
$$ 104968834 105137920 105399370 105689824 105968440 106201684 106363153 106454217 106488848 106488061 106487513 106516325 106593513
1003.5A06593513J34695J73676J74475J43540R4640K4545o2060j16408j01185n1188
$$ 106593513 106728208 106901884 107076359 107219899 107314539 107339084 107277024 107160616 107059431 107008243
1023.9A07008243m2260j13702j96516j98090j26827n6291p1275k05755l83914m87399
$$ 107008243 106965983 106852281 106655765 106457675 106330848 106274557 106203282 105997527 105613613 105126214
1044.3A05126214m43673k36511N8150K90334L68297L31497K78152K51221K31898J80113
$$ 105126214 104682541 104446030 104504180 104794514 105162811 105494308 105772460 106023681 106255579 106435692
1064.7A06435692P5400m8125j24371j05703k4580M2545Q6284J28424J42169R1791l1244
$$ 106435692 106511092 106462967 106338596 106232893 106208313 106250858 106337142 106465566 106607735 106699526 106668282
1087.1A06668282k11716m40204p32661j067292j355338j480723j349759r71633m83000
$$ 106668282 106456566 106016362 105283701 104216409 102861071 101380348 100030589 99058956 98575956
1105.4I8575956m6045K38103L53765L85261M49455O15292Q59785J063049J114786R85789
$$ 98575956 98529911 98768014 99121779 99507040 99956495 100571787 101431572 102494621 103609407 104595196
1125.8A04595196P23112M30512J88220l803j76465l33059m97639p15399r86898j281226
$$ 104595196 105318308 105748820 105937040 105933237 105756772 105423713 104926074 104210675 103223777 101942551
1146.2A01942551j550436j760262j925457k070081k182442k223396k161533j983124
$$ 101942551 100392115 98631853 96706396 94636315 92453873 90230477 88068944 86085820
1162.6H6085820j663959j168942n27078J50180P45856J186616J431930J488220J401449
$$ 86085820 84421861 83252919 82725841 82876021 83621877 84808493 86240423 87728643 89130092
1180.9H9130092J194781R01198N98329L45666J71435J04659J52064K67571L65776L98999
$$ 89130092 90324873 91226071 91824400 92170066 92341501 92446160 92598224 92865795 93231571 93630570
1201.3I3630570L88068L54296L00050K26045J38598M5747n4503j61248k63465l40801
$$ 93630570 94018638 94372934 94672984 94899029 95037627 95083374 95028871 94867623 94604158 94263357
1221.7I4263357l53092k48092o259K99329N32263O24490N82093M09990J47599j13838
$$ 94263357 93910265 93662173 93655914 93955243 94487506 95111996 95694089 96104079 96251678 96137840
1242.1I6137840k92308l67081l61573k87933j50835J2302J48487K36065K82514L06415
$$ 96137840 95845532 95478451 95116878 94828945 94678110 94690412 94838899 95074964 95357478 95663893
1262.5I5663893L47251M42964N81431O85477O61719N13095L23260J42896J6344r0Q0276
$$ 95663893 96011144 96454108 97035539 97721016 98382735 98895830 99219090 99361986 99378330 99378240 99458516
1284.9I9458516J79845K17932J41001k6584j67626j61964n763J87689L09443L39067
$$ 99458516 99638361 99856293 99997294 99970710 99803084 99641120 99635357 99823046 100132489 100471556
1305.3A00471556K94972K05469J30653R7811Q8382J00827J38116J95933K84528L78085
$$ 100471556 100766528 100971997 101102650 101200461 101288843 101389670 101527786 101723719 102008247 102386332
1325.7A02386332L98671L00229J33621j4030j23156k26438l10969l11697k55572k20442
$$ 102386332 102785003 103085232 103218853 103204823 103081667 102855229 102544260 102232563 101976991 101756549
1346.1A01756549k10464j88029j41537p2515L2198J66428K92278L50439L02625K24352
$$ 101756549 101546085 101358056 101216519 101144004 101176202 101342630 101634908 101985347 102287972 102512324
1366.5A02512324J59049L3080k09796o24859r39870o45626J63365P08592N56147J29223
$$ 102512324 102671373 102704453 102494657 101869798 100929928 100284302 100447667 101156259 101712406 101841629
1386.9A01841629q0967L8504L33202N99754O56676N97704M48978K44093N9139j49202
$$ 101841629 101760662 101799166 102132368 102732122 103388798 103986502 104435480 104679573 104738712 104589510
1407.3A04589510l22247m31382m82583m50194l19696j26445N8234K15781K57456J44911
$$ 104589510 104267263 103835881 103353298 102903104 102583408 102456963 102515197 102730978 102988434 103133345
1427.7A03133345j1540j59383k01296j44077j51551k27057k63870l22116m59575p25222
$$ 103133345 103121805 102962422 102761126 102617049 102465498 102238441 101974571 101652455 101192880 100467658
1448.1A00467658j062751j305944j324349j181424q62109m83323l50993m73488m27753
$$ 100467658 99404907 98098963 96774614 95593190 94731081 94247758 93896765 93423277 92995524
1466.4I2995524M81785K046996L408635K947527J668727J099646Q91364P10332N08428
$$ 92995524 93477309 95524305 98932940 101880467 103549194 104648840 105540204 106250536 106758964
1484.8A06758964M04334L51954K07686P8821J09792J73008R6751J2994M0042J72770
$$ 106758964 107163298 107515252 107722938 107801759 107911551 108084559 108181310 108194304 108234346 108407116
1505.2A08407116K04921m4751j20831m0567O1929J15335J12021J03855P201m9985j8596
$$ 108407116 108612037 108567286 108446455 108405888 108467817 108583152 108695173 108799028 108806229 108756244 108737648
1527.6A08737648j0944L0756O3944J4889P0501K00224N4907j11139j03044n0569J133
$$ 108737648 108726704 108757460 108821404 108836293 108906794 109107018 109161925 109050786 108947742 108897173 108898306
1550.1A08898306J5163M4144J18923K14839J7821j95848j14084j2445M1783K5677l0255
$$ 108898306 108913469 108957613 109076536 109291375 109309196 109113348 108999264 108986819 109028602 109054279 109024024
1572.5A09024024K0492O4993m7457q5819l2759l326j263R06K324Q869J3662n925j5712
$$ 109024024 109044516 109109509 109062052 108976233 108943474 108940148 108938885 108939791 108942115 108950984 108964646 108958721 108943009
1599A08943009j478N520n067m148l171j8215o44O5601M6372o5815l5560L1662o938
$$ 108943009 108941531 108947051 108941984 108937836 108934665 108916450 108915806 108981407 109027779 108961964 108926404 108958066 108951128
1625.5A08951128m4775m5956l1173N0116R3853n7947j33133q1790K003R0170K7835
$$ 108951128 108906353 108860397 108829224 108879340 108973193 108915246 108782113 108700323 108702326 108792496 108820331
1648A08820331o7770M4584O151k36976k00307p7928k9194q9896j04057l7325o3443
$$ 108820331 108752561 108797145 108803296 108566320 108366013 108288085 108258891 108168995 108064938 108027613 107964170
1670.4A07964170j67155j89376k21574k51663k20418k04587l86095o12366o67525p43580
$$ 107964170 107797015 107607639 107386065 107134402 106913984 106709397 106323302 105710936 105043411 104299831
1690.8A04299831p66444q86059j080596j326752j914984k121162k319801k587062k098107
$$ 104299831 103533387 102647328 101566732 100239980 98324996 96203834 93884033 91296971 89198864
1709.2H9198864j166326r0790R46355J600760J173246P5525r68975k206820l635562
$$ 89198864 88032538 87941748 88888103 90488863 91662109 91737634 90768659 88561839 84926277
1727.5H4926277n064356o115842p486647o851745l456193l21543L000927N833202P380814
$$ 84926277 79861921 73746079 66259432 59407687 55951494 55629951 58630878 64464080 71844894
1745.9G1844894P620257P030618N499256L566181K519131K007282J482427J186359
$$ 71844894 79465151 86495769 91995025 95561206 98080337 100087619 101570046 102756405
1762.2A02756405Q72195O45637N98359N48816M73261L03483J95277K14898K41733K01750
$$ 102756405 103628600 104274237 104872596 105421412 105894673 106198156 106393433 106608331 106850064 107051814
1782.6A07051814J75213J55938J51348J87576J84703Q9824N9545R7430R5439O6674
$$ 107051814 107227027 107382965 107534313 107721889 107906592 107996416 108055961 108153391 108248830 108315504
1803A08315504N1009O6364P6211O7508M3487M3404N2381M4656M2772N5337P0643P3910
$$ 108315504 108366513 108432877 108509088 108576596 108620083 108663487 108715868 108760524 108803296 108858633 108929276 109003186
1827.4A09003186O7628M351k7037O664K1791J8263N1165Q2278K2912l3331j7392J2600
$$ 109003186 109070814 109075165 109048128 109054792 109076583 109094846 109146011 109228289 109251201 109217870 109200478 109213078
1851.9A09213078J9360J9800J8025J5974J7690L2187N7959N3370m565l9423j7392L397
$$ 109213078 109232438 109252238 109270263 109286237 109303927 109336114 109394073 109447443 109442878 109403455 109386063 109389460
1876.4A09389460J3638J5759J4150J0419J1063J7905M089p701M637J3280Q452R644
$$ 109389460 109403098 109418857 109433007 109443426 109454489 109472394 109476483 109468782 109473419 109486699 109495151 109504795
1900.9A09504795J1087P641P927J0348L790K075J7571K9063J4437q130j0050q571n793
$$ 109504795 109515882 109523523 109531450 109541798 109545588 109547663 109565234 109594297 109608734 109600604 109590554 109581983 109576190
1927.4A09576190L755J2040J1682O545L111M316J4853J2016l969q679m804k313J920
$$ 109576190 109579945 109591985 109603667 109610212 109613323 109617639 109632492 109644508 109640539 109631860 109627056 109624743 109626663
1953.9A09626663P450R215R418R525P271K361N36J764K301k396o902o497j633N662
$$ 109626663 109634113 109643328 109652746 109662271 109669542 109671903 109672439 109674203 109676504 109674108 109667206 109660709 109659076 109664738
1982.5A09664738O545Q237J5605J2028l088o401L254J407r036o235K62K051L838P51
$$ 109664738 109671283 109679520 109695125 109707153 109704065 109697664 109700918 109702325 109693289 109687054 109687316 109689367 109693205 109693956
2011A09693956l886o676r203p295l827p832j1647p808l421q58j085j371N782R739M125
$$ 109693956 109690070 109683394 109674191 109666896 109663069 109655237 109643590 109635782 109632361 109631503 109630418 109629047 109634829 109644568 109648693
2041.6A09648693o44q70M375J0860R775M875P28l601k205O175J4055J0145l82j693
$$ 109648693 109648049 109647179 109651554 109662414 109672189 109677064 109677792 109674191 109671986 109678161 109692216 109702361 109701979 109700286
2070.2A09700286q46j693L052O914J824q3O449P367L040K181M340K884k157j860j943
$$ 109700286 109699440 109697747 109700799 109707713 109709537 109709454 109715903 109723270 109726310 109728491 109732831 109735715 109733558 109731698 109729755
2100.7A09729755j669P069P129o068j0109R5L863J073N48l302m923o08K241j407l862
$$ 109729755 109728086 109735155 109742284 109736216 109726107 109726202 109730065 109731138 109731686 109728384 109723461 109722853 109725094 109723687 109719825
2131.3A09719825n138l982M661N436m494r954o926k146J514P04j502k122l600q11K992
$$ 109719825 109714687 109710705 109715366 109720802 109716308 109706354 109699428 109697282 109698796 109699500 109697998 109695876 109692276 109691465 109694457
2161.9A09694457M733O079N567P713N746l528p344o997n675l767j657J824M614O055
$$ 109694457 109699190 109705269 109710836 109718549 109724295 109720767 109713423 109706426 109700751 109696984 109695327 109697151 109701765 109707820
2190.5A09707820L124o08J001K623j622P75J0372P164k813O31J0849N185p903q083
$$ 109707820 109710944 109710336 109711337 109713960 109712338 109713113 109723485 109730649 109727836 109728467 109739316 109744501 109736598 109728515
2219A09728515q476j2076l314L338p98l136o878j1873q524r5M494K062p271j8370k1053
$$ 109728515 109720039 109707963 109704649 109707987 109707189 109704053 109697175 109685302 109676778 109676683 109681177 109683239 109675968 109657598 109636545
2249.6A09636545j1122o08j55m065m447l850r966j1051k169L69k26L874L58j2803j4293
$$ 109636545 109625423 109624815 109624660 109620595 109616148 109612298 109602332 109591281 109589112 109589481 109589255 109593129 109593487 109580684 109566391
2280.2A09566391j920L231k086o307n328q297j5879j3101o640p248j2302k9075l3403
$$ 109566391 109564471 109567702 109565616 109559309 109553981 109545684 109529805 109516704 109510064 109502816 109490514 109461439 109428036
2306.7A09428036o616J3614J7857K8539L4416K2781J6617K3914L0899M8303N7412L3044
$$ 109428036 109421420 109435034 109452891 109481430 109515846 109538627 109555244 109579158 109610057 109658360 109715772 109748816
2331.2A09748816K7764M4215K7669Q308j0025p3767j37770r2065K8872J28997J52230
$$ 109748816 109776580 109820795 109848464 109856772 109846747 109772980 109635210 109543145 109572017 109701014 109853244
2353.6A09853244R5391K9314l5167q8942q0705n4836p1859q9372q6927p3481m4894
$$ 109853244 109948635 109977949 109942782 109853840 109773135 109718299 109646440 109557068 109470141 109396660 109351766
2376.1A09351766j5235O461K1696L0435K7787J8811J4067Q226m995j2374p510n937
$$ 109351766 109336531 109342992 109364688 109395123 109422910 109441721 109455788 109464014 109459019 109446645 109439135 109433198
2400.6A09433198p761k682K361j777m625l719q524q511K992P498m113j0764n698l350
$$ 109433198 109425437 109422755 109425116 109423339 109418714 109414995 109406471 109397960 109400952 109408450 109404337 109393573 109387875 109384525
2429.1A09384525m566o020j1158j2422q833p427O68N233n364j4055j0693l529n221
$$ 109384525 109379959 109373939 109362781 109350359 109341526 109334099 109334767 109340000 109334636 109320581 109309888 109306359 109301138
2455.6A09301138j4734j6940q464k014k027m435r513j7392j7739q201r06m959j2231
$$ 109301138 109286404 109269464 109261000 109258986 109256959 109252524 109243011 109225619 109207880 109199679 109198773 109193814 109181583
2482.1A09181583j1873j1528q309k134l433l540k039o604r024j1170j9968k4569k3603
$$ 109181583 109169710 109158182 109149873 109147739 109144306 109140766 109138727 109132123 109123099 109111929 109091961 109067392 109043789
2508.7A09043789k1851j7750j7190j8490j7035j0979j335m828j9419k4510k6107l0410
$$ 109043789 109021938 109004188 108986998 108968508 108951473 108940494 108939159 108934331 108914912 108890402 108864295 108833885
2533.1A08833885k3877j6475j9837j8858j8430k5070k5594j8180r954j2171k0981k2649
$$ 108833885 108810008 108793533 108773696 108754838 108736408 108711338 108685744 108667564 108657610 108645439 108624458 108601809
2557.6A08601809j8013j2732j2958j8823k1636j9193j6224j7619j5200p617j2589j9443
$$ 108601809 108583796 108571064 108558106 108539283 108517647 108498454 108482230 108464611 108449411 108441794 108429205 108409762
2582.1A08409762j4162p665J490O044l385j2064j6427k2304j8096m256n722j9443j9968
$$ 108409762 108395600 108387935 108389425 108395469 108392084 108380020 108363593 108341289 108323193 108318937 108313215 108293772 108273804
2608.6A08273804j2409q154o831q321n782n137j7286k8133j9860k110j264j9550k5058
$$ 108273804 108261395 108253241 108246410 108238089 108232307 108227170 108209884 108181751 108161891 108159781 108158517 108138967 108113909
2635.1A08113909j0813p748j5307j4007j3292k0992k6667l1686l5286k8229k1875k4235
$$ 108113909 108103096 108095348 108080041 108066034 108052742 108031750 108005083 107973397 107938111 107909882 107888007 107863772
2659.6A07863772k7466l1066l4094l2448l2259k6106j2148o974O32K0135L7396M1675
$$ 107863772 107836306 107805240 107771146 107738698 107706439 107680333 107668185 107661211 107661843 107681978 107719374 107761049
2684.1A07761049L6872K7525K1935K9480L6156L3725K7966K4521J9932J4627O998j0312
$$ 107761049 107797921 107825446 107847381 107876861 107913017 107946742 107974708 107999229 108019161 108033788 108040786 108030474
2708.5A08030474j8310j5295j9514k7609l2831l9136n1677o3288n0950k5929k0492
$$ 108030474 108012164 107996869 107977355 107949746 107916915 107877779 107826102 107762814 107711864 107685935 107665443
2731A07665443j3864J1909L9471M8208K8479O807J144O938K1756L1066K5666J9943
$$ 107665443 107651579 107663488 107702959 107751167 107779646 107786453 107787597 107794535 107816291 107847357 107873023 107892966
2755.4A07892966J6022Q11j2887j4496k0468l2186l3176l2878l6323k5642k0099l2461
$$ 107892966 107908988 107909799 107896912 107882416 107861948 107829762 107796586 107763708 107727385 107701743 107681644 107649183
2779.9A07649183l9959m4298o3491p6437o1118n1177o1643p8475r1196q4531p8130
$$ 107649183 107609224 107564926 107501435 107424998 107363880 107312703 107251060 107172585 107081389 106996858 106918728
2802.4A06918728r3233j19484j42300j41811j29962j42467j76525k08295k21765k28917
$$ 106918728 106825495 106706011 106563711 106421900 106291938 106149471 105972946 105764651 105542886 105313969
2822.7A05313969k53666k96080l44133l89004m52578n76437p61568r96399j344085
$$ 105313969 105060303 104764223 104420090 104031086 103578508 103002071 102240503 101244104 99900019
2841.1I9900019j868093k502662l087944l449422l451496l042620k292109j323718
$$ 99900019 98031926 95529264 92441320 88991898 85540402 82497782 80205673 78881955
2857.4G8881955k30634Q31824J554567J618636J015889J92005j49691M39083J574183
$$ 78881955 78651321 79483145 81037712 82656348 83672237 83864242 83714551 84153634 85727817
2875.8H5727817K325874K230961J583403Q27992J75553l37314p24936r94324j128799
$$ 85727817 88053691 90284652 91868055 92696047 92871600 92534286 91809350 90815026 89686227
2894.1H9686227j128787j078606j091617j199657j376509j604241j841242k040267
$$ 89686227 88557440 87478834 86387217 85187560 83811051 82206810 80365568 78325301
2910.4G8325301k196377k311337k381086k389002k305967k102560j783198j372444
$$ 78325301 76128924 73817587 71436501 69047499 66741532 64638972 62855774 61483330
2926.8F1483330q48824j95241N71942J358658J982665K307463K287823J905048J181024
$$ 61483330 60634506 60439265 61011207 62369865 64352530 66659993 68947816 70852864 72033888
2945.1G2033888K09981q44973j723504k111012j786613q20959M28748J642835K675522
$$ 72033888 72243869 71398896 69675392 67564380 65777767 64956808 65385556 67028391 69703913
2963.5F9703913L450691L892601L957617L703261L256058K749145K281082J893258
$$ 69703913 73154604 77047205 81004822 84708083 87964141 90713286 92994368 94887626
2979.8I4887626J580888J337636J150053R82297Q22985O95694O05356N24402M55034
$$ 94887626 96468514 97806150 98956203 99938500 100761485 101457179 102062535 102586937 103041971
2998.1A03041971L97455L32082K80761K45488J97566J48427J25754J32132J42133J31309
$$ 103041971 103439426 103771508 104052269 104297757 104495323 104643750 104769504 104901636 105043769 105175078
3018.5A05175078J07419Q4293P3779Q0371P6639N2536L9434N8568P6807N1295K3198
$$ 105175078 105282497 105366790 105440569 105520940 105597579 105650115 105689549 105748117 105824924 105876219 105899417
3041A05899417M1068P0405P4124N0724L0541L6490M6933N8651P2432O3538L0315R298
$$ 105899417 105940485 106010890 106085014 106135738 106166279 106202769 106249702 106308353 106380785 106444323 106474638 106483936
3065.5A06483936L4142P0059O6960L1960q988j9825J1408L0399K3532L2472L8517K6536
$$ 106483936 106518078 106588137 106655097 106687057 106678069 106658244 106669652 106700051 106723583 106756055 106794572 106821108
3089.9A06821108L0279L5203K0742P677J1301L0434L0506J645l58K9886K0290j7703
$$ 106821108 106851387 106886590 106907332 106915009 106926310 106956744 106987250 106988895 106988537 107018423 107038713 107021010
3114.4A07021010j0669K1696N0056O6292M7100J8978J6904L0839L4416K0087k4J573
$$ 107021010 107010341 107032037 107082093 107148385 107195485 107214463 107231367 107262206 107296622 107316709 107316685 107318258
3138.9A07318258L3057M6861K2817L290m077j6534p51L7801M5311L3510K2209Q845
$$ 107318258 107351315 107398176 107420993 107424283 107420206 107403672 107402921 107440722 107486033 107519543 107541752 107550597
3163.4A07550597P081P868N817Q846P808N066O533O020J156K349J4841K5773K4629
$$ 107550597 107557678 107565546 107571363 107580209 107588017 107593083 107599616 107605636 107606792 107609141 107623982 107649755 107674384
3189.9A07674384J3375O378J0061J3101R871J67q476M256L2234M2284K7024P987n376
$$ 107674384 107687759 107694137 107704198 107717299 107727170 107727337 107718861 107723117 107755351 107797635 107824659 107832646 107827270
3216.4A07827270o580J3959K9361K6906K5105J6666r847k1064J4472M5800L3271J7703
$$ 107827270 107820690 107834649 107864010 107890916 107916021 107932687 107922840 107901776 107916248 107962048 107995319 108013022
3240.9A08013022J1015j0061j4961J7881L9435K1648P379K3234L1173J9419J0086M780
$$ 108013022 108024037 108013976 107999015 108016896 108056331 108077979 108085358 108108592 108139765 108159184 108169270 108174050
3265.3A08174050j6499m2212j4567L8648M8947M0197M3512L3962P761J550J645j8609
$$ 108174050 108157551 108115339 108100772 108139420 108188367 108228564 108272076 108306038 108313799 108315349 108316994 108298385
3289.8A08298385k0218M685K7156M4394L4773j3161m1723j1766L8087P2205P6867N3942
$$ 108298385 108278167 108282852 108310008 108354402 108389175 108376014 108334291 108322525 108360612 108432817 108509684 108563626
3314.3A08563626L6585L4356L0923J0872p760J8310N4777N0747L1507J1110l635J7046
$$ 108563626 108600211 108634567 108665490 108676362 108668602 108686912 108741689 108792436 108823943 108835053 108831418 108848464
3338.8A08848464M1152M0864N0462M3320L207K2650Q3172P2408K4366J9050L8850L0315
$$ 108848464 108889616 108930480 108980942 109024262 109027469 109050119 109133291 109205699 109230065 109249115 109287965 109318280
3363.2A09318280q559j6856L4904R0516Q9478O3444N4550M2903M0209N0533L2163j4746
$$ 109318280 109309721 109292865 109327769 109418285 109507763 109571207 109625757 109668660 109708869 109759402 109791565 109776819
3387.7A09776819m9794o080R2757R2447k0528o0916N1999J47701R5570J3399N018L3665
$$ 109776819 109727025 109720945 109813702 109906149 109885621 109824705 109876704 110024405 110119975 110133374 110138392 110172057
3412.2A10172057P4947R8956O4528L3307L8910J3458m7207p9858n1915l5394o1702
$$ 110172057 110247004 110345960 110410488 110443795 110482705 110496163 110448956 110369098 110317183 110281789 110220087
3434.6A10220087j7250Q3554J02639M7147J061j7833k0397j7882p915J8191K8205K2376
$$ 110220087 110202837 110286391 110389030 110436177 110437238 110419405 110399008 110381126 110373211 110391402 110419607 110441983
3459.1A10441983N7983O1715m3941r1207P3850K74682K60306J01161m1092o2525O1143
$$ 110441983 110499966 110561681 110517740 110426533 110500383 110775065 111035371 111136532 111095440 111032915 111094058
3481.5A11094058Q8107j8978l0375R239l3235q7345p8285m3261l6466l8254J4353N6135
$$ 111094058 111182165 111163187 111132812 111142051 111108816 111021471 110943186 110899925 110863459 110825205 110839558 110895693
3506A10895693K4379j7870l9863j6416L3677L5846o246m0281j8728L5155L6097m614
$$ 110895693 110920072 110902202 110862339 110845923 110879600 110915446 110909200 110868919 110850191 110885346 110921443 110916829
3530.5A10916829l1483m6730k1041L2878J9825k6655j6618K5058L6227K6405K5571
$$ 110916829 110885346 110838616 110817575 110850453 110870278 110843623 110827005 110852063 110888290 110914695 110940266
3552.9A10940266J6212M768N699K1565O1202O5231j4997o4086j3042K1756N018j1837
$$ 110940266 110956478 110961246 110966945 110988510 111049712 111114943 111099946 111035860 111022818 111044574 111049592 111037755
3577.4A11037755j5175o116J6117L8421M2141J6022q250l635J1193j19j4889N960L5513
$$ 111037755 111022580 111016464 111032581 111071002 111113143 111129165 111120915 111117280 111128473 111128354 111113465 111119425 111154938
3603.9A11154938M7898M2975K7013R370o819j288k884l8076k5761M0579P1704L5346
$$ 111154938 111202836 111245811 111272824 111282194 111275375 111274087 111271203 111233127 111207366 111247945 111319649 111354995
3628.4A11354995k7633m6134k8050m959m89p534J6701Q1099J16205L6907o2788n1701
$$ 111354995 111327362 111281228 111253178 111248219 111247730 111240196 111256897 111337996 111454201 111491108 111428320 111376619
3652.8A11376619l2425m7957m7255q047L3534O9427J01209J01256P2682M2081p784
$$ 111376619 111344194 111296237 111248982 111240935 111274469 111343896 111445105 111546361 111619043 111661124 111653340
3675.3A11653340q3745j05548o4230l838L4773L7265K3532r239m0006j1683L9053M5824
$$ 111653340 111569595 111464047 111399817 111395979 111430752 111468017 111491549 111482310 111442304 111430621 111469674 111515498
3699.8A11515498J8299J466L3319Q6677O9749k9957p6484l6145J9932M4751K1529j5592
$$ 111515498 111533797 111535263 111568582 111655259 111725008 111695051 111618567 111582422 111602354 111647105 111668634 111653042
3724.2A11653042j0467L6979P6914P4434J07p5602l7849N3394R4414N8162J7106J1909
$$ 111653042 111642575 111679554 111756468 111830902 111831009 111755407 111717558 111770952 111865366 111923528 111940634 111952543
3748.7A11952543k7323q2349o8069k2018j0097k9659k5773J0490L4166J5974j8478
$$ 111952543 111925220 111842871 111774802 111752784 111742687 111713028 111687255 111697745 111731911 111747885 111729407
3771.1A11729407l1268o461K3794K1362L946m625j4306k9766j6105L2985N8997O5028
$$ 111729407 111698139 111691678 111715472 111736834 111740780 111736155 111721849 111692083 111675978 111708963 111767960 111832988
3795.6A11832988P8964O1679O724l1328m3154n9581l5977K3877O2406P4768N9843J7357
$$ 111832988 111911952 111973631 111980355 111949027 111905873 111846292 111810315 111834192 111896598 111971366 112031209 112048566
3820.1A12048566m0340p0572n2929j1563L5369N4097L8016L0232K2292k0528o7925
$$ 112048566 112008226 111937654 111884725 111873162 111908531 111962628 112000644 112030876 112053168 112032640 111964715
3842.5A11964715p1252r942P8344J36733R9361m9913j09589o0689O211N1510N2333
$$ 111964715 111893463 111883521 111961865 112098598 112197959 112148046 112038457 111977768 111983979 112035489 112087822
3865A12087822J6963k6536l5023k3628k8800j0837K5344K3222j8573l3247k444J9121
$$ 112087822 112104785 112078249 112043226 112019598 111990798 111979961 112005305 112028527 112009954 111976707 111974263 111993384
3889.4A11993384J3233j216r18K1624N3239N7090M327n9164o3741j6189J8132J1075
$$ 111993384 112006617 112005401 112004483 112026107 112079346 112136436 112140763 112081599 112017858 112001669 112019801 112030876
3913.9A12030876j884l111j002J1564K4664J4341J073P63l076j2493j7345j5342p212
$$ 112030876 112028992 112025881 112024879 112036443 112061107 112075448 112076521 112077284 112074208 112061715 112044370 112029028 112021816
3940.4A12021816Q023J9228K0468J7953r65k6560k7061m661J1754L851q417l45R858
$$ 112021816 112029839 112049067 112069535 112087488 112086523 112059963 112032902 112028241 112039995 112043846 112035429 112035084 112044942
3966.9A12044942l016j3470p785n281R585L1113K7848O234p188n877K313R143Q440
$$ 112044942 112041926 112028456 112020671 112015390 112024975 112056088 112083936 112090170 112082982 112077105 112079418 112088561 112097001
3993.4A12097001N543P785
$$ 112097001 112102544 112110329
3997.5A12110329
$$ 112110329
##END=$$ End of the data block
