##TITLE=MANIDU 01 Rafaela $$ Begin of the data block
##JCAMP-DX=5.00 $$ ACD/SpecManager v 10.08
##SPECTROMETER/DATA SYSTEM=Alpha
##DATE=04 Sep 2014 08:34:00
##DATA TYPE=INFRARED SPECTRUM
##DATA CLASS=XYDATA
##ORIGIN=
##OWNER=
##NPOINTS=1765
##FIRSTX=399.76428223
##LASTX=3997.64306641
##MAXX=3997.64306641
##MINX=399.76428223
##MAXY=0.88319391
##MINY=0.65003222
##XFACTOR=1.0000000000
##YFACTOR=1.000000000000000e-9
##FIRSTY=0.83856755
##DELTAX=2.03961372
##XUNITS=1/CM
##YUNITS=ARBITRARY UNITS
##XYDATA=(X++(Y..Y))
399.8 838567555 841213167 840198457 839867234 841208339 839825153 838581502 839469433 837658226 834802806
418.1 834802806 836099684 836562157 835689545 837346673 837381959 835286796 836172342 836906910 835048735
436.5 835048735 835306287 835952759 833906531 833707750 834993541 833582401 832785785 833855569 832561493
454.8 832561493 831244707 832794130 832370400 830623209 831275761 830870450 828564346 828455806 828624070
473.2 828624070 826947093 826849282 827216387 825170696 823898673 823614061 820825517 817846239 815398455
491.5 815398455 809112608 798733473 783658862 760819972 738522351 729826450 735652864 750841677
507.9 750841677 765203476 774645865 790117502 812778294 829443097 835165441 836784005 838120818
524.2 838120818 837299168 835876644 835998476 835130930 833440185 833963454 835097611 835247040 836434305
542.5 836434305 837456346 836646080 836717486 837617636 836835027 836323977 837099910 836593986 835841835 836509049
562.9 836509049 836229622 835246444 835872233 836104453 835043132 835231960 835727274 834948421 835150957 836036265
583.3 836036265 835343480 834864020 835309744 834370613 833255827 833605647 833134592 831455588 829667330
601.7 829667330 824742794 816320181 813133359 819815755 828687906 833531022 834113955 831163406 829068959
620 829068959 831156611 834969163 838956416 843084753 845030189 844854176 845202804 845089197 842990220
638.4 842990220 840371370 837787449 836477876 839452505 844813824 847603858 848257124 849275470 849524140
656.8 849524140 849137843 850031972 850677550 848872781 845442772 844585001 846677065 848478019 849414229
675.1 849414229 848898768 848318577 848903537 848825872 848245561 848875701 849314213 848764002 848979712 849401712
695.5 849401712 848736286 848406255 848517179 847531796 846709490 847184062 847159147 846471310 846411884 845881104
715.9 845881104 844295681 843273401 842511833 840782821 839180708 837880433 835599661 833149552 831111848
734.3 831111848 828026175 824065924 820202410 815272927 808919609 802568197 796193898 789925635
750.6 789925635 786001742 785381556 787456691 792805314 801191628 810314417 819233954 827869356 834479511
768.9 834479511 838636696 842630565 847201467 851063609 854036808 856006682 856567323 856857955 857275248
787.3 857275248 856752634 855806231 855219305 853958607 851811171 849397182 845576406 839281440 830752432
805.6 830752432 818951547 801907599 779277682 754642844 738042355 738427520 749393106 757002711
822 757002711 765130281 787848413 819299340 843147874 856386423 863229096 866311014 868080854
838.3 868080854 869316578 868863821 866694033 863285303 859811366 860267520 865857065 871739030 874857306
856.6 874857306 876651704 877654612 877509356 877422750 877680540 877237856 876712203 876832068 876559675 875968516
877 875968516 876118600 876297474 875998914 876208365 876550317 876136839 875875652 876012027 875525177 874981403
897.4 874981403 875139236 874959052 874370992 874363065 874250531 873533547 873280406 873282790 872587502 871978879
917.8 871978879 871753275 870850682 869767606 869422257 868886530 867792904 866736710 864514470 859473467
936.2 859473467 853880465 853069484 857500136 861865461 863198102 862166703 860127270 857752502 854242980
954.5 854242980 849339306 844305277 840120912 837568104 839064121 845300078 852240205 856722057
970.9 856722057 858878374 858998477 858005583 857107520 855735719 853534281 851462722 849397480 846899390
989.2 846899390 845309734 845323265 845749676 846039653 845977902 844551027 841877580 838893235 834970832
1007.6 834970832 829472125 823478460 818532169 816630900 818486810 819371879 816743791 818137765
1023.9 818137765 826668739 834217072 836069345 834150672 829703271 823433816 818221807 817112565
1040.2 817112565 820768178 827720702 835144877 840530276 843828440 846233249 847685575 848178446
1056.5 848178446 848663151 849092424 848922670 848750591 848789811 848372340 847809494 847584844 847126961 846451461
1076.9 846451461 846230507 846024752 845426321 845086753 844988108 844547391 844125450 843970716 843508601 842861533
1097.3 842861533 842472911 841817558 840605199 839320660 837899745 836526990 836277366 836883783 836775899
1115.7 836775899 835436046 833141387 831040502 831993222 836428165 840638399 842574596 843472421 844008088
1134 844008088 843958616 843794227 843780816 843466520 842958510 842702270 842419863 841941476 841628969 841348231
1154.4 841348231 840779722 840226173 839800775 839147270 838412225 837868094 837149858 835970461 834308147
1172.8 834308147 831694961 827913821 824862957 826084495 831226826 835663855 838341832 840729237
1189.1 840729237 842033088 841874540 841036320 839971125 838924050 837808788 836421371 834753156 832605004
1207.5 832605004 829689324 826967716 826453149 828067601 829449654 829249382 827469528 824447274 821005762
1225.8 821005762 818249285 817154229 817704499 818435371 818029940 816457868 814252019 812036812 810217917
1244.2 810217917 808520496 806101024 801930428 795077980 784942389 771395564 755787551 743391693
1260.5 743391693 743116200 760465145 789888680 817513764 833507597 838302135 837124527 833846748
1276.8 833846748 829823017 825229287 820303559 815172553 809638083 803838789 798220336 792687476
1293.1 792687476 786619306 779201210 769793987 759619117 753570020 755891085 760424197 753989398
1309.4 753989398 732733428 704024732 677674234 664999902 675771952 707432568 746366441
1323.7 746366441 780862808 806309760 823147953 833541572 838959038 840253770 838316381 834254324
1340 834254324 829541028 825573504 823324203 822885096 822938800 821640730 817863464 811408341 802115142
1358.4 802115142 788403749 768361926 746352911 735280156 745100856 769252241 790331364
1372.7 790331364 797861397 790110350 774799228 768823922 779182374 793329477 800321102 800129175
1389 800129175 795309007 786163390 772915840 757731318 742506683 732696295 736875176 757797539
1405.3 757797539 784766078 804439783 814296424 817459464 816802919 813827157 810051799 806567848
1421.6 806567848 802640676 798376024 794425607 790836275 787895322 784720778 779990673 774948716
1437.9 774948716 770907938 766880929 763084114 760243893 758659244 758537829 759302437 760404944 763247848
1456.3 763247848 770126939 777572036 782244921 784545362 785858750 786194563 784693360 781868398
1472.6 781868398 779588938 777870715 775717556 772873163 769668639 766115606 761809170 757355988
1488.9 757355988 754075050 751508296 747468054 740927517 732722521 723220170 711729169 694947302
1505.2 694947302 673593342 661490560 660350263 665783882 676214576 689634502 701482654 708573878
1521.6 708573878 710261703 707982898 704183698 700120330 694927275 689493656 686508417 685031235
1537.9 685031235 684973240 689767003 699114978 711450458 725708783 741394758 756727636 769771099
1554.2 769771099 779311776 787515223 798341572 807506502 814053953 819178641 822980762 826554716
1570.5 826554716 829009056 828659415 826731563 825017452 821821153 815839112 807379127 796339035
1586.8 796339035 782813609 767269254 749507487 729081571 707384109 687659621 673493028
1601.1 673493028 666800976 666858375 672942340 685537457 702878714 719747782 733293295 743369818
1617.4 743369818 748631835 749840975 749858737 750125587 749323010 747072756 744075418 739771485 734386683
1635.8 734386683 731225610 729881108 728153288 725593626 722932339 722379923 722935677 721500635 718489647
1654.1 718489647 714661360 706345916 692156553 675626874 666099966 668585300 681407273 701705515
1670.5 701705515 721837103 739999413 756180704 766284883 770809591 776267290 789895713 804956615
1686.8 804956615 814929008 822399080 827773869 831426322 834734321 838317215 843371928 848493099
1703.1 848493099 852149725 855431318 858262658 860052526 860807776 860882342 861924112 865003467 867886305
1721.5 867886305 869331777 870008826 870079577 869493306 868492782 868069530 869732201 871741414 872957706
1739.8 872957706 874137521 875226438 875686944 875525832 875478625 876380742 877386212 877717257 877875268
1758.2 877875268 877964079 878153801 878851831 879258037 878911018 878242314 878218472 879467845 880674422 880969524
1778.6 880969524 880806267 880732536 880783081 880823553 880345166 879160464 878633380 879431844 880260408 880550027
1799 880550027 880858719 881517947 882140398 882365644 882347107 882558107 883006096 883193910 883054376 882879019
1819.4 882879019 882603288 882161021 881876409 881663978 881472468 881985128 882694483 882787883 882670581 882486105
1839.8 882486105 881723046 880797803 880911827 881579280 881942093 882070541 882020533 881827950 881610692 881344855
1860.2 881344855 880963087 880436480 879533410 878600836 878694355 879507065 879940987 879937112 879830778 879541039
1880.5 879541039 879033685 878458917 877573013 875940084 873591423 870355308 866925418 866194665 869228721
1898.9 869228721 873336613 876169205 877575159 878058851 878220439 878634155 879108965 879058540 878685713
1917.3 878685713 878616214 878621280 878506601 878572881 878582299 878329098 878042161 877737463 877342582 876973450 876596808
1939.7 876596808 876181304 876154721 876543522 876793623 876787066 876723647 876568735 876288712 876030684 875747979
1960.1 875747979 875303090 874822676 874489784 874359310 874383688 874404073 874272943 874043405 873890936 873769104
1980.5 873769104 873575091 873462141 873429298 873265982 873071492 873132169 873293042 873248637 873111308 872983515
2000.9 872983515 872837245 872798800 872824609 872712255 872540116 872433364 872268796 872085571 872043908 871968329
2021.3 871968329 871714532 871462345 871267796 871041238 870885730 870859802 870836973 870833099 870902002 870924056 870876133
2043.7 870876133 870873094 870861530 870744348 870627940 870562315 870434880 870269597 870132565 869932413 869694233
2064.1 869694233 869595110 869558573 869373202 869080842 868788481 868547857 868497491 868674040 868896067 869043052
2084.5 869043052 869118035 869103253 869057715 869120657 869263649 869332075 869344711 869369388 869353890 869307578 869290650
2106.9 869290650 869258940 869190812 869161189 869179070 869190693 869186342 869165421 869092464 869005620 868957579 868886948 868778169
2131.4 868778169 868689656 868589342 868436098 868303955 868221343 868137002 868034363 867905736 867733002 867578149
2151.8 867578149 867541909 867586017 867592275 867506683 867330909 867111206 866937876 866889656 867016733 867294371 867586076
2174.3 867586076 867770970 867840707 867849827 867823839 867771745 867725790 867691636 867669463 867695630 867745697 867766857
2196.7 867766857 867769837 867758572 867729247 867677629 867579699 867452800 867341757 867232084 867080867 866926432 866828799
2219.1 866828799 866763890 866717160 866718292 866723061 866685629 866647720 866622508 866571784 866502047 866423905 866292298 866104186
2243.6 866104186 865916014 865743220 865611434 865565419 865554512 865511477 865444660 865348697 865202129 865024984
2264 865024984 864853561 864674032 864451110 864211023 863983870 863802135 863743544 863822579 863938153 863984168
2284.4 863984168 863910198 863708138 863425612 863118112 862766147 862341106 861846387 861241460 860466957 859501302
2304.8 859501302 858440161 857468486 856650531 855897367 855019033 853769302 852103114 850345194 848903656
2323.1 848903656 847805202 846728802 845641851 844939232 844632864 844222546 843577087 842962801 842663169
2341.5 842663169 843264937 845488310 848091006 848521113 845984459 841887712 838239014 835844636 834753454
2359.9 834753454 834805608 835842133 837698519 840151250 842991352 846017718 848978341 851739228 854314327
2378.2 854314327 856600225 858380377 859589875 860275090 860526383 860554516 860533535 860472381 860379934 860326827
2398.6 860326827 860307813 860297740 860330164 860356092 860311806 860271513 860265672 860240579 860226333 860232234 860165417 860056937
2423.1 860056937 860035419 860057056 860033333 859979033 859867632 859671175 859472036 859311581 859143555 858978570
2443.5 858978570 858824968 858625293 858408570 858271241 858176947 858076930 858044028 858069956 858086646 858125865
2463.9 858125865 858189523 858199179 858173549 858190238 858189046 858079672 857935607 857815206 857647777 857435167 857228220
2486.3 857228220 856994152 856751978 856540680 856289446 856004000 855810821 855747163 855784237 855922401 856094837
2506.7 856094837 856181383 856173337 856120884 855971634 855703652 855399668 855075598 854748428 854540408 854473531
2527.1 854473531 854454756 854495287 854617476 854699969 854666531 854544461 854281545 853875697 853527129 853385568
2547.5 853385568 853441656 853651643 853893757 853994727 853965759 853930950 853885055 853819072 853813469 853853405 853862941
2569.9 853862941 853878140 853892982 853808761 853642106 853455305 853241742 853065908 853027582 853076160 853142381 853258550
2592.4 853258550 853377759 853398561 853358567 853303552 853167534 852983534 852843404 852690339 852481842 852293432
2612.8 852293432 852105439 851832271 851498902 851138115 850742042 850408792 850300550 850448847 850787103 851218760
2633.2 851218760 851572037 851758301 851831138 851794958 851653039 851502359 851337194 851064980 850727320 850434959
2653.5 850434959 850181878 849917650 849649787 849392235 849206507 849159300 849188328 849199355 849192739 849185169 849134088
2676 849134088 849036515 848920703 848756194 848562837 848418593 848290324 848143458 848051131 848000765 847896516
2696.4 847896516 847751617 847613633 847444713 847227693 847011983 846807659 846569240 846286476 845956922 845583200
2716.8 845583200 845271468 845112801 845023453 844830811 844396889 843827128 843629122 844113469 844850719 845270932
2737.2 845270932 845301986 845144391 844922602 844699740 844484806 844214141 843890548 843591630 843336999 843087733
2757.6 843087733 842809558 842477679 842093587 841689825 841282845 840920150 840697229 840580225 840397775 840114772
2778 840114772 839785576 839373410 838895738 838426650 837905526 837232292 836473763 835764945 835205793 834914923
2798.4 834914923 834966958 835353076 836026371 836837769 837562740 838063240 838298321 838268876 838052571 837763906
2818.8 837763906 837382734 836847484 836248875 835653603 835018933 834353864 833679020 832960844 832231224 831469595
2839.1 831469595 830548882 829572558 828761160 828004777 827087998 826112866 825229108 824385464 823647082 823155940
2859.5 823155940 822813392 822594464 822737634 823296726 824169099 825343251 826545596 827376187 827900827
2877.9 827900827 828310370 828517497 828490317 828345180 828102946 827743590 827358246 826966882 826436162 825765371
2898.3 825765371 825067043 824298382 823441446 822612107 821741223 820647299 819204509 817150652 814348280
2916.6 814348280 811217725 808403552 806486845 806117713 807624996 810423970 813430786 816007018
2933 816007018 817942441 819118381 819669008 819829822 819709480 819475770 819253862 818976998 818684161 818500757
2953.4 818500757 818433225 818488300 818694472 818882942 818766236 818393409 818028212 817702830 817402661 817210436
2973.8 817210436 817056358 816904783 816922009 817054033 817076564 817039132 817037761 816971481 816766083 816477478 816281140
2996.2 816281140 816393316 816955268 817837119 818609059 819028497 819134951 818951964 818614662 818308651 817909002
3016.6 817909002 817188084 816099107 814576805 812520146 810158312 808251321 807597160 808170378 808926404
3034.9 808926404 808922350 808409750 808223128 808580875 809110165 809533894 809721768 809502482 808881640 808037758
3055.3 808037758 806990623 805778921 804612458 803574562 802716553 802158058 801893353 801876783 802186787
3073.7 802186787 802911639 803918600 804965436 805997968 806989491 807770550 808331668 808696628 808662713
3092.1 808662713 808192432 807449996 806370258 804804802 802964687 801349044 800245166 799356699 798079312
3110.4 798079312 796254873 794146776 791795611 789109528 786199152 783425033 781344593 780407965
3126.7 780407965 780739665 782107830 784152508 786644220 789315581 791682661 793333948 794336379
3143 794336379 794975281 795353889 795548737 795590281 795224786 794336438 793235242 792142153 791036725 789879382
3163.4 789879382 788609803 787164032 785505593 783598423 781417906 778961599 776258826 773367405
3179.8 773367405 770295143 767066836 763881326 761041224 758817673 757513225 757373929 758360863 760169148
3198.1 760169148 762301266 764226317 765598238 766276836 766281188 765801966 765059471 764149487 763129175
3216.5 763129175 762074590 761025190 759938657 758695364 757163346 755318582 753272176 751037717
3232.8 751037717 748435020 745444953 742292881 739111483 735860527 732530236 729132712 725589931
3249.1 725589931 721987247 718569517 715468168 712832093 711029172 710400581 710893393 712089598 713436961
3267.5 713436961 714399815 714526296 713735640 712255239 710168958 707492828 704234123 700370252 696059287
3285.8 696059287 691568196 687108636 682803214 678662956 674732029 671340525 669133127 668682456
3302.1 668682456 670023263 672607541 675766110 679141402 682661057 686281443 689883053 693312407
3318.4 693312407 696307302 698528051 699841499 700563967 701324046 702544689 704202950 706091762 708006203
3336.8 708006203 709712327 711041272 711931586 712360322 712439835 712279379 711670756 710489929 709021807
3355.2 709021807 707457840 705743492 703821301 701713800 699576855 697483003 695186853 692501307
3371.5 692501307 689716160 687171638 684823513 682544529 680297196 678153515 676246464 674592435
3387.8 674592435 673132479 671604514 669785619 667981386 666627467 665580511 664200187 662368417
3404.1 662368417 660691261 659433186 658336818 657222629 656033397 654792070 653663695 652721465
3420.4 652721465 651951194 651378334 651023269 650830090 650618374 650458753 650515914 650514424 650248647 650032222
3440.8 650032222 650161505 650561392 651093543 651735246 652472377 653297484 654217601 655233622 656307697
3459.2 656307697 657282650 658262253 659606636 661183715 662397206 663081348 663756669 664807439 666165829
3477.5 666165829 667495191 668529510 669558704 670826018 672094524 673301220 674584329 675925732
3493.8 675925732 677293360 678630531 679917097 681240618 682566106 683846176 685191333 686753631
3510.2 686753631 688548446 690299690 691830337 693320692 694919229 696616948 698217273 699611008
3526.5 699611008 701128840 703005731 705012262 706960678 708824337 710576594 712316692 714094400
3542.8 714094400 715808213 717423618 719074786 720787287 722554982 724455655 726380229 728202164
3559.1 728202164 729901075 731297195 732382417 734043717 736823261 739704549 742046893 744215667
3575.4 744215667 746472061 748835146 751273513 753453434 755137682 756987631 759757042 762678444
3591.7 762678444 765089333 767487407 770184934 772899508 775542736 777957439 779797316 781467497
3608.1 781467497 783617795 785994887 788259387 790205479 791883767 794114470 796777487 798710763
3624.4 798710763 799352884 799640477 801593125 804470479 806762516 808540285 810013115 811188400 812032163
3642.7 812032163 812140703 811216354 810534179 812045634 814508557 815999806 817072034 818560123 819673538
3661.1 819673538 820031822 819902539 819030941 817584932 816859484 816437066 815705001 816560626 818656325
3679.4 818656325 820288360 821180642 821260691 820552051 820079446 821042538 822721720 823860288 824168265
3697.8 824168265 823908508 823660076 824013233 824299216 823616385 822499633 822565675 824046910 825215220
3716.2 825215220 825237632 824620008 824046671 823769569 823811293 823961556 823492587 822213590 821258903 821810484
3736.5 821810484 823297620 823969483 822833717 821248293 821215689 821218431 820813060 821889102 823617697
3754.9 823617697 824331999 824354947 824789643 825318336 825264454 824965119 824752450 825014710 825726151 826045334
3775.3 826045334 825675845 825243711 825321555 825499952 825549245 825786650 826048374 826021135 825530112 824595213
3795.7 824595213 823632777 822566211 821830153 822263718 822714984 823073506 823995709 824419141 823580086
3814.1 823580086 822286785 821531892 820877433 820998132 822185338 822917044 823003769 822716713 822120905
3832.4 822120905 821499050 820665061 819981456 820328236 821329653 822348714 822993696 822698832 820919156
3850.8 820919156 818282008 818098724 820275843 821666539 821601689 820887625 820500493 820387363 819924474
3869.1 819924474 819775581 820360899 821067631 821367919 820847929 820353985 820428729 820465922 820685923 820808530
3889.5 820808530 820628762 820962965 821391940 820897639 819775403 819005787 819058478 819973290 821123183
3907.9 821123183 821716785 821714997 821378052 820883155 820585370 820640683 820734859 820677578 820682943 820715547 820545495
3930.3 820545495 820453942 820731997 821011186 820937991 820646584 820435047 820445538 820459604 820368350 820391715 820502937
3952.7 820502937 820524275 820485294 820451140 820402205 820378304 820395410 820382476 820340395 820317268 820322454 820381999 820479333
3977.2 820479333 820494950 820415556 820345461 820284009 820181549 820069015 819992363 819933593 819880128 819857836
3997.6 819857836
##END=$$ End of the data block
