##TITLE=$$ Begin of the data block
##JCAMP-DX=5.00 $$ ACD/SpecManager v 10.08
##SPECTROMETER/DATA SYSTEM=Varian
##DATE=16 Apr 2013 15:19:04
##DATA TYPE=INFRARED SPECTRUM
##DATA CLASS=XYDATA
##ORIGIN=
##OWNER=
##NPOINTS=3735
##FIRSTX=399.26403809
##LASTX=4000.35498047
##MAXX=4000.35498047
##MINX=399.26403809
##MAXY=59.30965424
##MINY=7.78835869
##XFACTOR=1.0000000000
##YFACTOR=0.000000100000000
##FIRSTY=13.73121548
##DELTAX=0.96440572
##XUNITS=1/CM
##YUNITS=TRANSMITTANCE
##XYDATA=(X++(Y..Y))
399.3 137312155 145858974 145284348 139390268 135229120 131067972 132548399 135048037 136658726 137372990 138664570
408.9 138664570 141411161 144935465 148154297 151122723 154879217 159733734 164183216 166023941
416.6 166023941 164687881 162292290 162124081 165897980 172340260 178293095 181174583 180632286 178292866
425.3 178292866 176268425 175826931 177038155 179221306 181592655 183707924 185592651 187580090 189948063
434 189948063 192584286 194967499 196534042 197145844 197258453 197639885 198867054 200967503 203410931
442.7 203410931 205422897 206449375 206534100 206345043 206719170 207969532 209541950 210468121 210360031
451.3 210360031 210045624 211110325 214601688 220037708 225672741 229817276 232020512 233113403 234247189
460 234247189 235947971 237993488 239961166 241702614 243307419 244816704 246172924 247461548 249045944
468.7 249045944 251308937 254231148 257301216 259926434 261967430 263878613 266321049 269606991
476.4 269606991 273445835 277157001 280141983 282261333 283875408 285533714 287514172 289537544
484.1 289537544 290912132 291071129 290114288 288884373 288438854 289296513 291070175 292802753 293739376
492.8 293739376 293902111 294006310 294808006 296433163 298239613 299317627 299212856 298279533 297385311
501.5 297385311 297234955 297892227 298875313 299671097 300148735 300510254 300910625 301200123 301062508 300360241
511.1 300360241 299282227 298142490 297087345 296044331 294922523 293752232 292550182 291088829
518.9 291088829 288939819 285871811 282219963 278770084 276164780 274358158 272651558 270289879
526.6 270289879 267060833 263366451 259772358 256518192 253429356 250221043 246823807 243421860
534.3 243421860 240229912 237270985 234352913 231218395 227713242 223852863 219781799 215681076
542 215681076 211683006 207832813 204110641 200488110 196960163 193519421 190111504 186645145 183072891
550.7 183072891 179462242 175964088 172686882 169599285 166564445 163475399 160354671 157321835
558.4 157321835 154473953 151809158 149263268 146804438 144474964 142338266 140392246 138544254
566.1 138544254 136679783 134769001 132918291 131316786 130104723 129258041 128577909 127805271 126784201
574.8 126784201 125552969 124298506 123219147 122412796 121867161 121527786 121353331 121303482 121295538 121205750
584.4 121205750 120946970 120559311 120220032 120137749 120399742 120897808 121405706 121756401 121975603 122253637
594.1 122253637 122775440 123559818 124452791 125277328 125988569 126681604 127456245 128291903 129075289 129750252
603.7 129750252 130420675 131278067 132410536 133681135 134804049 135557489 135950327 136207771 136607590
612.4 136607590 137306480 138279705 139383774 140469742 141462860 142374573 143264027 144187794 145171452
621.1 145171452 146212225 147299538 148432808 149622316 150876684 152191153 153543682 154903440
628.8 154903440 156247368 157577810 158930531 160362396 161927147 163657417 165566521 167659187
636.5 167659187 169929066 172343254 174843197 177382755 179975376 182692280 185592899 188644943
644.2 188644943 191721821 194692631 197523785 200289936 203083019 205913982 208707085 211389637
651.9 211389637 213982792 216604176 219382153 222357063 225446625 228493710 231359615 234008465
659.7 234008465 236532345 239090919 241790676 244582443 247272873 249667740 251751842 253755226
667.4 253755226 256027241 258795891 261990891 265268974 268230038 270671253 272699375 274624310
675.1 274624310 276718521 279021683 281341667 283446217 285284252 287045937 289004879 291283531
682.8 291283531 293752670 296153889 298327007 300329456 302345600 304487133 306677628 308719769
690.5 308719769 310463886 311917686 313219223 314528637 315952015 317539101 319311333 321264038
698.2 321264038 323346100 325465584 327542191 329561768 331572266 333621254 335700378 337757416
705.9 337757416 339763069 341754990 343811874 345984192 348260307 350599327 352988358 355460167
713.7 355460167 358059120 360805054 363694000 366718369 369866486 373103905 376383247 379705315
721.4 379705315 383170547 386938248 391094055 395540543 400032997 404348831 408443909 412456665
729.1 412456665 416567574 420854912 425266151 429694557 434055824 438298492 442381325 446284142
736.8 446284142 450055313 453822327 457715759 461749840 465769463 469528999 472854881 475766602
744.5 475766602 478463287 481183891 484047661 486989288 489831314 492433014 494797783 497056999
752.2 497056999 499345665 501677933 503928108 505927696 507589073 508946152 510092278 511090469 511947365
760.9 511947365 512660599 513270264 513845139 514419594 514958038 515395546 515710335 515940933 516121635 516208420
770.6 516208420 516091614 515699806 515087967 514406395 513765144 513123932 512319183 511200867 509749260
779.2 509749260 508073044 506322479 504618378 503045082 501663475 500486908 499448929 498433647
787 498433647 497380981 496366234 495557022 495074043 494900436 494943962 495186081 495750198 496802979 498387985
796.6 498387985 500366974 502529488 504759750 507094688 509635239 512413826 515346146 518291626
804.3 518291626 521144371 523871803 526489067 529010963 531429291 533724365 535895844 537985344
812 537985344 540070000 542216492 544423103 546595726 548591385 550305786 551742287 553008690 554251518
820.7 554251518 555576401 557000275 558451233 559805374 560950089 561848221 562565079 563227615 563936005
829.4 563936005 564693985 565417519 566012459 566449432 566773338 567051659 567319221 567567406 567776527 567957153
839 567957153 568165550 568481216 568951111 569530029 570065231 570367165 570337143 570054855 569731369 569544678
848.7 569544678 569497719 569430313 569177208 568719978 568185539 567704086 567276230 566782570 566113701 565281487
858.3 565281487 564405670 563602295 562891045 562195587 561411896 560469131 559340439 558026390 556543884
867 556543884 554927216 553223152 551470871 549682312 547838974 545904236 543842201 541634674 539299660
875.7 539299660 536898460 534513931 532195435 529909973 527552414 525028419 522352676 519672241
883.4 519672241 517179527 514978638 513018723 511157417 509301300 507503624 505941200 504798126
891.1 504798126 504162331 504010963 504276047 504915848 505936317 507362976 509201584 511417618 513936157
899.8 513936157 516659203 519498482 522413750 525427399 528588028 531902313 535295372 538646469
907.5 538646469 541873779 544985504 548039207 551048126 553932228 556572227 558922691 561071129
915.2 561071129 563184090 565382271 567651367 569856110 571836739 573507156 574892426 576099129
922.9 576099129 577249069 578416481 579598656 580730362 581736259 582586174 583310890 583963928 584563026
931.6 584563026 585069962 585433655 585658226 585826416 586045761 586362228 586719475 587004776 587144241 587160034
941.3 587160034 587144241 587174721 587249565 587299194 587256393 587121582 586966438 586876793 586886978 586956787 587000618
951.9 587000618 586936378 586716270 586333618 585820732 585246887 584704933 584270592 583953438 583685837 583373795
961.5 583373795 582977409 582542801 582148743 581815643 581471214 581016273 580430908 579814072 579312134 579002457
971.2 579002457 578841629 578722153 578577995 578443108 578423347 578621902 579082146 579774399 580615234 581498184
980.8 581498184 582331429 583077011 583768387 584485474 585293083 586185760 587082634 587880936 588528824 589066353
990.5 589066353 589600945 590231247 590969048 591717987 592330093 592704391 592852974 592881508 592905540 592973251
1000.1 592973251 593056297 593096542 593053131 592912369 592676125 592365227 592034683 591764259 591604424 591519623
1009.7 591519623 591392212 591099358 590599670 589954262 589266472 588603706 587964096 587303467 586580544 585782585
1019.4 585782585 584923820 584030952 583124962 582201271 581222343 580139275 578935661 577657204 576389847
1028.1 576389847 575198288 574073906 572942772 571721077 570372467 568920898 567423859 565936241
1035.8 565936241 564489250 563088074 561721992 560384331 559095459 557910042 556892624 556079636
1043.5 556079636 555463791 555021400 554755821 554704933 554899101 555313339 555870247 556496391 557174911 557938995
1053.1 557938995 558812370 559756966 560677071 561468086 562066498 562471657 562746315 563007050 563390846 563986931
1062.8 563986931 564765129 565563698 566176414 566487732 566554260 566561890 566689186 566985588 567354050 567640991
1072.4 567640991 567754173 567721100 567654610 567660446 567758522 567873611 567898598 567778664 567547760 567289009 567056923
1083 567056923 566834755 566564560 566217995 565834885 565486679 565200310 564913902 564508514 563893433 563080254
1092.7 563080254 562189941 561390076 560794983 560389824 560025520 559500580 558690529 557637253 556524162
1101.4 556524162 555540504 554733620 553970184 553043785 551842651 550435829 549011078 547725220 546598511
1110 546598511 545531387 544406242 543175354 541870880 540559235 539295311 538107834 536999245 535942497
1118.7 535942497 534888763 533800201 532683792 531575127 530466537 529255486 527805862 526110306
1126.4 526110306 524416428 523165131 522744980 523243370 524396133 525775528 527055130 528149300 529154778
1135.1 529154778 530191803 531293221 532402916 533449173 534413490 535354004 536374016 537555504 538894005
1143.8 538894005 540283546 541580772 542709808 543720818 544741783 545860939 547048836 548189964
1151.5 548189964 549188423 550038185 550800362 551523972 552201653 552800522 553324318 553835716 554416313 555102425
1161.1 555102425 555852242 556564560 557129707 557482834 557636986 557682648 557751579 557954102 558325386 558811073
1170.8 558811073 559305496 559718857 560028992 560285263 560563164 560902557 561272392 561590919 561788483 561866379
1180.4 561866379 561903229 562000961 562212677 562511864 562826996 563106956 563362541 563650818 564027214 564504585
1190.1 564504585 565048752 565603523 566122818 566593399 567040176 567511024 568041534 568620148 569185295 569669304
1199.7 569669304 570064850 570451164 570946770 571614189 572397919 573155746 573763199 574206505 574585686 575028763
1209.4 575028763 575592690 576229324 576834602 577329750 577710724 578038254 578390045 578814278 579308777 579829826
1219 579829826 580319557 580737648 581081505 581383247 581682892 581999168 582317619 582608566 582857208 583080940
1228.6 583080940 583319130 583601608 583922310 584235458 584479523 584612198 584636497 584599953 584567642 584583397
1238.3 584583397 584643707 584702110 584703903 584627914 584503899 584388924 584316559 584261513 584153900 583939857 583640060
1248.9 583640060 583349380 583167458 583109093 583073959 582910080 582527122 581971321 581399460 580969810 580734787
1258.5 580734787 580612755 580455513 580153008 579699783 579183273 578711853 578341293 578048668 577764854 577435036
1268.2 577435036 577061806 576698265 576401100 576179047 575979538 575725403 575375557 574961510 574568253 574271622
1277.8 574271622 574078560 573917694 573689232 573336487 572889481 572445946 572109566 571924133 571850128 571793175
1287.5 571793175 571666908 571446648 571180916 570950394 570804977 570726738 570647354 570505638 570295181 570061798
1297.1 570061798 569856339 569688454 569522667 569313354 569043312 568734703 568428307 568156548 567924461 567707291
1306.8 567707291 567461700 567152290 566783638 566413002 566122169 565959549 565893364 565822144 565638428 565299683
1316.4 565299683 564854317 564408417 564063454 563862419 563769989 563689499 563511772 563178253 562721062 562247391
1326 562247391 561867218 561615028 561431808 561223831 560945892 560629425 560330505 560051613 559718399 559243889
1335.7 559243889 558620148 557952347 557397346 557055359 556901283 556806564 556628494 556297035 555843849 555365639
1345.3 555365639 554957657 554657745 554434052 554215088 553942528 553608894 553253784 552920876 552612839 552286377
1355 552286377 551890488 551410179 550872726 550313911 549743309 549146957 548520241 547889709 547296982 546763725
1364.6 546763725 546274986 545795555 545292358 544734917 544083176 543291512 542341957 541273956 540169945
1373.3 540169945 539099960 538072433 537037621 535935326 534737854 533451347 532088776 530656319
1381 530656319 529166374 527653656 526163216 524713898 523279800 521810875 520275612 518676872 517026672
1389.7 517026672 515312729 513500710 511578331 509592705 507639618 505809898 504145584 502648735
1397.4 502648735 501327515 500227737 499416504 498937416 498783264 498908081 499256439 499779587 500429459
1406.1 500429459 501151733 501895409 502628136 503337326 504016724 504654465 505239792 505777092 506285782 506780052
1415.7 506780052 507252197 507678795 508048401 508379593 508707047 509046555 509374886 509646072 509831886 509946976
1425.4 509946976 510037766 510146637 510290451 510472145 510706902 511023254 511427536 511868210 512249718 512500763
1435 512500763 512640915 512775650 513015480 513392334 513850555 514315338 514761887 515217171 515703316 516196251
1444.7 516196251 516645470 517024994 517351799 517657547 517955017 518238907 518504066 518736343 518881607 518850365
1454.3 518850365 518594856 518203011 517901955 517930222 518368607 519069633 519744453 520133133 520133476 519822311
1464 519822311 519393616 519061050 518961906 519086418 519277992 519329338 519126778 518734131 518339958 518112793
1473.6 518112793 518090057 518185234 518279343 518294563 518202095 517997131 517696953 517355423 517052155 516839905
1483.2 516839905 516700211 516551971 516304665 515906181 515361748 514736290 514149895 513738251 513566284 513553925
1492.9 513553925 513505478 513250885 512781372 512242775 511795578 511488800 511275291 511117592 511028061 510983162
1502.5 510983162 510836220 510384789 509567375 508584976 507792053 507438278 507503395 507764091 507989159 508063354
1512.2 508063354 507964935 507696342 507282372 506811028 506412544 506153145 505955238 505654793 505161095 504558907
1521.8 504558907 504046059 503762703 503677177 503626747 503466530 503183937 502882500 502657204 502479439 502206688
1531.5 502206688 501723213 501089516 500540466 500294685 500327187 500331345 499939270 499022560 497798233 496647949
1541.1 496647949 495830154 495346832 495043678 494787407 494534264 494269714 493944588 493497543 492919579 492268143
1550.7 492268143 491620865 491026115 490482330 489918861 489174461 488048134 486465073 484645042 483066750
1559.4 483066750 482167320 482000237 482179794 482189598 481775360 481053276 480268745 479495201 478596039 477453461
1569.1 477453461 476171761 475012665 474134521 473423462 472597351 471469994 470112877 468774834 467661629
1577.7 467661629 466783714 465981522 465068054 463952293 462666359 461308746 459966736 458669472 457385864
1586.4 457385864 456057091 454640083 453133392 451573181 450000610 448430595 446846085 445222282
1594.1 445222282 443556175 441872444 440196991 438526039 436822968 435049553 433199615 431301155
1601.9 431301155 429386597 427470589 425558167 423666191 421816635 419997444 418142242 416173630
1609.6 416173630 414083519 411962814 409926491 407995605 406062279 403997459 401812248 399709053
1617.3 399709053 397950287 396646461 395651360 394664078 393452568 392010498 390529289 389226036 388182068
1626 388182068 387315445 386484642 385618668 384763718 384020081 383431091 382923813 382355423 381635551 380828094
1635.6 380828094 380138855 379783974 379834976 380173416 380596504 380977287 381326141 381701279 382081146 382360268
1645.3 382360268 382490540 382605247 382947540 383627586 384449654 385020370 385079422 384746552 384438972 384530258
1654.9 384530258 385069847 385809402 386468086 386953926 387349777 387742691 388116951 388413467 388649788 388933182
1664.5 388933182 389346809 389847527 390299911 390618896 390868874 391219788 391809502 392647972 393644142 394704971
1674.2 394704971 395803185 396963921 398213196 399558792 401014709 402621727 404424515 406427345
1681.9 406427345 408593025 410896492 413375397 416104164 419106293 422296829 425529404 428701286
1689.6 428701286 431798897 434831619 437740402 440405235 442758064 444861526 446838074 448707314
1697.3 448707314 450322495 451504478 452248001 452775078 453361206 454107933 454893494 455545120 456042290
1706 456042290 456543312 457226143 458123131 459109116 460028000 460811234 461484070 462092667 462653084 463172379
1715.6 463172379 463698273 464320602 465109482 466040955 466985321 467780991 468340607 468700905 468969307 469216194
1725.3 469216194 469417534 469509964 469496613 469477730 469551544 469685020 469707146 469463387 468985214 468493767
1734.9 468493767 468215256 468183022 468221359 468119087 467818947 467442245 467150726 466997681 466906662 466771355
1744.6 466771355 466554184 466292839 466033554 465778847 465504303 465214462 464963455 464809418 464742622 464669991
1754.2 464669991 464481392 464145660 463739510 463374329 463089371 462822456 462491379 462099457 461744308 461512909
1763.9 461512909 461377373 461211929 460920563 460537186 460189018 459960251 459802933 459589157 459241905 458810883
1773.5 458810883 458422050 458166962 458037148 457948112 457808876 457572289 457246170 456878319 456531105 456246948
1783.2 456246948 456023636 455820999 455602341 455372162 455164948 454993401 454812050 454542732 454145432 453667068
1792.8 453667068 453218040 452897606 452730484 452659416 452589989 452446480 452204819 451892471 451566048 451282463
1802.4 451282463 451075859 450947914 450870476 450797653 450683174 450499077 450249367 449966431 449691086 449448051
1812.1 449448051 449238586 449051323 448874741 448694992 448488045 448227196 447908516 447565918 447249374 446983986
1821.7 446983986 446754379 446536903 446339531 446194267 446100311 445981979 445727348 445287056 444740181 444252548
1831.4 444252548 443958206 443865738 443865929 443821793 443655739 443375511 443040428 442712555 442424011 442166786
1841 442166786 441902542 441592865 441234818 440873032 440569954 440355377 440201035 440047722 439854584 439622307
1850.7 439622307 439372101 439111443 438829308 438520813 438207169 437922974 437683296 437466965 437231712 436946716
1860.3 436946716 436614189 436266594 435948105 435688171 435478897 435270462 434997940 434631653 434211540 433827858
1869.9 433827858 433554687 433391800 433267593 433099632 432855186 432559242 432255402 431969299 431704330 431457863
1879.6 431457863 431224556 430985794 430709915 430377617 430009041 429653778 429348412 429083481 428817940 428525391
1889.2 428525391 428221664 427944336 427710381 427499275 427275925 427025032 426758614 426497879 426252785 426022835
1898.9 426022835 425804672 425589714 425355873 425070801 424717293 424317856 423930550 423610001 423367004 423160019
1908.5 423160019 422929230 422644386 422326851 422028313 421783600 421576042 421347885 421050034 420687828 420323219
1918.2 420323219 420022507 419797325 419592590 419335518 419001617 418634300 418303223 418043098 417831497 417619667
1927.8 417619667 417378731 417117462 416862526 416628723 416410866 416193886 415964355 415710983 415422783 415092850
1937.5 415092850 414728470 414354591 414004173 413700142 413443794 413214951 412983284 412725754 412438393 412136307
1947.1 412136307 411840096 411556969 411274071 410971489 410645332 410317383 410020866 409771461 409552689 409329643
1956.7 409329643 409080124 408814697 408566170 408357697 408177567 407983665 407732430 407408524 407033997 406651878
1966.4 406651878 406302261 406005669 405760078 405546417 405335464 405098267 404818077 404500046 404169350 403854256
1976 403854256 403565979 403292046 403010330 402713470 402421265 402168388 401973763 401817055 401645584 401409912
1985.7 401409912 401103363 400768967 400465240 400218315 400002823 399771385 399503937 399228363 398990974 398805771
1995.3 398805771 398634224 398415489 398118439 397764816 397407379 397089233 396819458 396579437 396341553 396082764
2005 396082764 395790863 395470009 395143623 394845657 394599304 394398727 394211273 393997459 393733406 393418999
2014.6 393418999 393074417 392730103 392416649 392152557 391935234 391744270 391557350 391365814 391173019 390978813
2024.2 390978813 390768585 390523109 390239372 389938202 389648590 389383278 389131966 388878250 388620415 388375244
2033.9 388375244 388160362 387975273 387799072 387605286 387380180 387131195 386880760 386652222 386455040 386278763
2043.5 386278763 386097755 385885925 385631371 385341339 385035057 384731026 384440231 384168243 383920212 383702011
2053.2 383702011 383516045 383355484 383203430 383035202 382826118 382560730 382242889 381900368 381575661 381304970
2062.8 381304970 381096878 380928268 380762062 380573273 380361862 380142365 379923668 379700050 379460297 379203377
2072.5 379203377 378942909 378696709 378474121 378271599 378078461 377883301 377678909 377466736 377259903 377076721
2082.1 377076721 376920967 376766129 376564827 376287003 375954399 375634575 375392532 375241547 375138664 375024948
2091.7 375024948 374867439 374665413 374424973 374143219 373822632 373493118 373206902 373001022 372864304 372744789
2101.4 372744789 372591667 372392120 372170181 371954880 371751480 371541176 371302948 371033821 370753059 370489426
2111 370489426 370264473 370081902 369925728 369769249 369589157 369376831 369140625 368898315 368666420 368452606
2120.7 368452606 368254662 368063087 367865295 367652283 367420731 367173424 366914825 366651115 366394577 366166267
2130.3 366166267 365987778 365862770 365764313 365646210 365473404 365247307 365002518 364776268 364577866 364384613
2140 364384613 364165001 363906403 363621902 363337288 363072968 362839661 362642555 362483063 362351990 362222595
2149.6 362222595 362058067 361831627 361546288 361235275 360944214 360708427 360539970 360427322 360342064 360246353
2159.3 360246353 360105400 359902000 359646454 359370079 359103966 358860092 358630676 358403130 358174286 357947845
2168.9 357947845 357722893 357489777 357241707 356988640 356753960 356554832 356382523 356205177 355990868 355731583
2178.5 355731583 355448380 355177269 354948082 354772148 354641190 354533501 354421654 354280281 354093704 353862114
2188.2 353862114 353601074 353334084 353079643 352841797 352612000 352381248 352152252 351939049 351751442 351579399
2197.8 351579399 351394882 351172829 350911865 350635223 350370216 350127106 349897499 349672165 349456177 349265671
2207.5 349265671 349110374 348981094 348853874 348705673 348524628 348308067 348055840 347767944 347449417 347118034
2217.1 347118034 346803207 346536484 346335297 346190567 346068535 345929184 345751114 345544815 345340157 345158882
2226.8 345158882 344994926 344820099 344609947 344363251 344099007 343837204 343584366 343337555 343097878 342874756
2236.4 342874756 342675514 342493782 342309303 342101631 341864281 341607857 341352196 341115303 340904198 340710030
2246 340710030 340510216 340281563 340019341 339746704 339500847 339302521 339135017 338956604 338737679 338488007
2255.7 338488007 338247795 338049164 337887535 337728348 337539444 337315407 337073135 336828270 336580887 336322403
2265.3 336322403 336051178 335778618 335520782 335286522 335075035 334881973 334703789 334537849 334378319 334215927
2275 334215927 334041824 333852081 333648834 333438454 333225975 333011093 332788658 332553635 332306480 332052612
2284.6 332052612 331794662 331527672 331243248 330943375 330647202 330383530 330170403 330000763 329844894 329666862
2294.3 329666862 329439545 329151497 328808746 328437576 328082886 327793694 327591667 327446327 327282677 327027817
2303.9 327027817 326667366 326264839 325920296 325694885 325561714 325426445 325202103 324875526 324510193 324187813
2313.5 324187813 323943253 323743935 323521843 323221321 322827225 322367668 321903992 321512642 321253662 321132965
2323.2 321132965 321085625 321004524 320801392 320454636 320009575 319538612 319099312 318717957 318396358 318123741
2332.8 318123741 317885265 317668018 317460728 317244625 316986485 316656590 316269741 315909958 315691261 315670147
2342.5 315670147 315787182 315906715 315927124 315853233 315756397 315665588 315513954 315204716 314725189 314180489
2352.1 314180489 313703060 313331032 312985134 312566109 312069798 311599007 311267204 311093292 310990658 310852623
2361.8 310852623 310647163 310437622 310321007 310345821 310474033 310609150 310661259 310600929 310468578 310338230
2371.4 310338230 310263882 310248127 310251217 310228100 310159779 310056667 309941635 309833736 309745045 309681511 309638672
2382 309638672 309595547 309522781 309403534 309248543 309086189 308933983 308780670 308598900 308375626 308127460
2391.7 308127460 307886715 307673035 307481346 307293549 307095737 306883335 306655769 306417007 306183376 305981789
2401.3 305981789 305828323 305702076 305548782 305320740 305021839 304711781 304459991 304289246 304159470 304002762
2410.9 304002762 303777580 303493538 303194332 302921467 302689075 302485027 302287331 302081585 301870289 301670933
2420.6 301670933 301503849 301375084 301266174 301140423 300964909 300733242 300470238 300211735 299973373 299734936
2430.2 299734936 299456673 299117661 298745461 298406124 298157291 298002453 297887497 297744904 297545547 297312069
2439.9 297312069 297084599 296877365 296668453 296428032 296151962 295867882 295613575 295412407 295264034 295148621
2449.5 295148621 295034199 294886360 294685097 294439144 294180984 293939209 293713036 293475933 293209152 292929287
2459.2 292929287 292677135 292478371 292315445 292141838 291924095 291668777 291410770 291178894 290973797 290775013
2468.8 290775013 290563583 290336151 290102005 289871826 289650669 289437904 289230442 289025650 288823223 288624954
2478.5 288624954 288431587 288239899 288043575 287838879 287628078 287413349 287186966 286929913 286628170 286293926
2488.1 286293926 285970516 285708885 285531654 285415154 285306358 285159855 284964848 284739857 284508095 284278316
2497.7 284278316 284048481 283822098 283613529 283434525 283274250 283096886 282863770 282563381 282223625 281896400
2507.4 281896400 281627464 281433716 281300793 281195450 281080933 280929585 280732422 280503616 280272884 280063744
2517 280063744 279872646 279670200 279430351 279163780 278918419 278738708 278616619 278484516 278265839 277941170
2526.7 277941170 277570362 277245865 277019501 276866703 276717377 276518993 276275082 276028862 275816956 275637989
2536.3 275637989 275460377 275255394 275021133 274778099 274545765 274324284 274099998 273865948 273636837 273438492
2546 273438492 273282490 273150673 273008766 272837048 272645149 272454681 272267208 272056637 271796589 271494751
2555.6 271494751 271195240 270942726 270745659 270573483 270388508 270175705 269943390 269704342 269463596 269223881
2565.2 269223881 268994503 268786564 268600101 268420773 268230095 268018150 267784691 267534561 267279110 267040596
2574.9 267040596 266847439 266712494 266614761 266505165 266338234 266099358 265805378 265482025 265146713 264812260
2584.5 264812260 264498043 264228020 264013710 263841438 263680973 263507481 263315792 263116093 262921581 262742348
2594.2 262742348 262585258 262451630 262330704 262197990 262027988 261813068 261569252 261323624 261094131 260882626
2603.8 260882626 260682697 260490780 260304947 260116463 259908619 259668407 259399166 259119549 258848400 258592472
2613.5 258592472 258349037 258118095 257905598 257712669 257525578 257320518 257083969 256824589 256566086 256328049
2623.1 256328049 256114635 255920792 255741978 255573769 255404072 255214996 254996967 254760017 254524136 254297657
2632.8 254297657 254069633 253829975 253594704 253401775 253273849 253183231 253062248 252854977 252564831 252252331
2642.4 252252331 251984863 251785583 251623898 251447830 251223240 250949364 250649166 250352020 250083752 249860382
2652 249860382 249682522 249532471 249383106 249215946 249034100 248856506 248698711 248556576 248408470 248233204
2661.7 248233204 248025475 247795563 247555485 247306995 247043228 246760864 246471748 246199799 245967445 245780334
2671.3 245780334 245623074 245469742 245301838 245119953 244938412 244765835 244588032 244372292 244095516 243773479
2681 243773479 243460445 243210850 243032036 242871342 242655678 242354298 242011147 241717529 241543312 241483421
2690.6 241483421 241458149 241367607 241156693 240847301 240517540 240247135 240066833 239946079 239823227 239651508
2700.3 239651508 239424343 239164448 238893948 238617077 238329105 238035660 237757053 237513752 237309666 237133007
2709.9 237133007 236970081 236813297 236655636 236482430 236277008 236037197 235783367 235545444 235341206 235164433
2719.5 235164433 234995060 234814682 234614658 234394131 234156666 233911419 233672028 233447609 233231106 233000603
2729.2 233000603 232736588 232441978 232146263 231887341 231686058 231533203 231397972 231247807 231065216 230850868
2738.8 230850868 230614719 230364799 230104294 229837132 229575920 229340439 229145889 228988762 228845596 228686028
2748.5 228686028 228492031 228267307 228029747 227796955 227575188 227360039 227142353 226915455 226677876 226432800
2758.1 226432800 226186104 225942230 225701981 225464573 225233898 225020866 224837608 224683361 224535637 224358845
2767.8 224358845 224127426 223847389 223556767 223301258 223102207 222941303 222774429 222562618 222298298 222006340
2777.4 222006340 221724701 221479721 221274548 221092701 220911026 220709324 220476971 220217705 219950390 219701405
2787 219701405 219488354 219305000 219123611 218915749 218677711 218435650 218224812 218057098 217907448 217731266
2796.7 217731266 217498150 217214165 216913261 216630554 216379948 216155510 215949116 215763359 215605259 215466824
2806.3 215466824 215316200 215112000 214833679 214501724 214168243 213882923 213661480 213480644 213302326 213105297
2816 213105297 212895851 212694187 212510223 212333317 212142544 211925945 211689892 211451874 211225185 211008492
2825.6 211008492 210787945 210546913 210275650 209975796 209659576 209345646 209052601 208792515 208565941 208362751
2835.3 208362751 208167400 207967052 207756138 207536259 207310009 207075176 206822491 206540470 206224766 205884018
2844.9 205884018 205535889 205196209 204869919 204554634 204250774 203968410 203718872 203501415 203299694 203097687
2854.6 203097687 202898006 202722759 202589741 202488079 202379284 202224731 202013721 201763554 201497097 201225033
2864.2 201225033 200951977 200694389 200481682 200331154 200224648 200114040 199956169 199745102 199510803 199288712
2873.8 199288712 199091091 198903046 198699894 198464909 198195724 197903328 197610092 197344112 197126503 196956406
2883.5 196956406 196807499 196639099 196416111 196123848 195774956 195408115 195076065 194819889 194640732 194493961
2893.1 194493961 194319210 194085941 193811913 193535366 193270721 192996025 192686481 192353039 192039280 191777840
2902.8 191777840 191556225 191330109 191069355 190781975 190492382 190207005 189908562 189585190 189251518 188935184
2912.4 188935184 188646393 188372021 188103065 187855587 187653885 187490959 187315483 187069511 186740284 186371593
2922.1 186371593 186025276 185734921 185499268 185307941 185160828 185053787 184955463 184813690 184595242 184320145
2931.7 184320145 184049778 183838902 183697510 183596783 183505096 183412399 183318729 183209610 183051243 182819138
2941.3 182819138 182528305 182232380 181985226 181798153 181633453 181439438 181197186 180937595 180715656 180563736
2951 180563736 180464020 180358181 180185966 179922371 179591351 179250164 178957272 178742065 178592358 178466873
2960.6 178466873 178323364 178143997 177938499 177726078 177513466 177288589 177034836 176749382 176446762 176148396
2970.3 176148396 175869122 175615044 175388260 175190144 175016251 174852028 174675541 174468060 174222107 173941479
2979.9 173941479 173634567 173310165 172981606 172671318 172410297 172223186 172107849 172025719 171917839 171742287
2989.6 171742287 171504230 171248035 171012974 170792522 170540485 170224514 169874535 169569683 169368896 169249363
2999.2 169249363 169117851 168887768 168551235 168180676 167863960 167636089 167464466 167285328 167052250 166759357
3008.8 166759357 166436501 166128578 165870724 165665779 165480461 165269527 165016174 164749985 164520607 164347572
3018.5 164347572 164195461 164002438 163732758 163402462 163056774 162730141 162431202 162158623 161919193 161720600
3028.1 161720600 161552067 161380501 161173515 160925655 160658646 160396500 160141163 159875679 159589186 159296970
3037.8 159296970 159035406 158832569 158680849 158532724 158327456 158031044 157660589 157273283 156926317 156637812
3047.4 156637812 156380243 156109657 155803051 155474463 155157690 154876604 154628963 154392262 154141607 153866034
3057.1 153866034 153573494 153285942 153024635 152794256 152576647 152342796 152075272 151781874 151485882 151202211
3066.7 151202211 150924482 150634689 150324526 150002689 149683914 149373913 149068861 148765154 148463097 148157959
3076.4 148157959 147833996 147475691 147089252 146707077 146363058 146062975 145781641 145494061 145206852 144952688
3086 144952688 144748669 144562445 144322929 143972311 143512602 143008127 142544632 142180376 141921997 141733971
3095.6 141733971 141563396 141366177 141121531 140835676 140530005 140220709 139904089 139561844 139183483 138787613
3105.3 138787613 138418455 138117962 137894163 137712889 137517900 137263546 136936760 136557617 136167097 135811939
3114.9 135811939 135533352 135353918 135261745 135205278 135110273 134918661 134625797 134285707 133975172 133741312
3124.6 133741312 133573513 133419914 133231421 132995749 132736282 132486238 132265549 132077103 131915302 131770554
3134.2 131770554 131624861 131450691 131222668 130937767 130624695 130331106 130096350 129928818 129804020 129683418
3143.9 129683418 129539003 129366798 129183044 129007902 128852110 128713932 128585091 128456507 128319283 128165932
3153.5 128165932 127996635 127828665 127691422 127605076 127555571 127494068 127368851 127165613 126918707 126679392
3163.1 126679392 126472702 126283169 126082878 125872326 125688114 125569744 125516768 125481071 125403214 125259056
3172.8 125259056 125074663 124896851 124749031 124612474 124449148 124241676 124012823 123806705 123649693 123529549
3182.4 123529549 123411274 123274164 123132114 123018856 122951097 122908688 122848520 122738400 122574968 122374392
3192.1 122374392 122150269 121907969 121657438 121425905 121247082 121134300 121063385 120984688 120855732 120666752
3201.7 120666752 120441694 120218115 120025358 119872265 119746656 119621286 119465837 119263325 119023991 118786678
3211.4 118786678 118601274 118500786 118479729 118494062 118482275 118398514 118235035 118022738 117808075 117623453
3221 117623453 117472162 117336102 117195482 117041922 116874704 116693430 116499376 116305904 116141863 116033878
3230.7 116033878 115979528 115935278 115837975 115644455 115359449 115030718 114719915 114473057 114308949 114222403
3240.3 114222403 114191399 114181890 114157124 114093618 113995781 113893137 113815756 113765678 113709364 113605251 113443470
3250.9 113443470 113261871 113118963 113042078 112999487 112923422 112766848 112542782 112310562 112123203 111985922
3260.5 111985922 111861467 111711092 111528702 111339664 111170940 111026230 110887995 110738239 110576754 110421486
3270.2 110421486 110293627 110201283 110133142 110065393 109975672 109855185 109708414 109543581 109365005 109175453
3279.8 109175453 108986053 108817024 108683119 108576517 108464375 108309250 108094912 107837124 107571697 107333527
3289.5 107333527 107141037 106991873 106868496 106748981 106621494 106490755 106368170 106249380 106104593 105898409
3299.1 105898409 105625963 105328674 105064907 104858646 104678068 104466629 104198933 103905687 103643456 103440752
3308.8 103440752 103272810 103083544 102832394 102523489 102200298 101917038 101707888 101568756 101457005 101310797
3318.4 101310797 101080217 100756235 100376215 100001564 99682159 99429140 99212551 98981171 98694448 98347588
3328.1 98347588 97976828 97637005 97365589 97156096 96965551 96746178 96477261 96170683 95852165 95542097
3337.7 95542097 95248890 94971371 94699993 94416819 94105673 93767548 93425226 93101482 92792854 92467422
3347.3 92467422 92097483 91692524 91295071 90939236 90618362 90297384 89954643 89602737 89264030 88934097
3357 88934097 88582458 88196106 87814341 87508230 87317190 87206306 87088013 86885233 86576967 86191444
3366.6 86191444 85769386 85340366 84924498 84539242 84192734 83872833 83553438 83217621 82873526 82545280
3376.3 82545280 82250986 81993923 81772118 81587591 81436129 81290207 81101170 80830421 80484190 80117798
3385.9 80117798 79802952 79583635 79452877 79362445 79255123 79101315 78920584 78771377 78706360 78719525
3395.6 78719525 78733630 78652091 78442540 78177786 77986598 77952266 78049340 78172407 78225856 78187289 78096895
3406.2 78096895 78003674 77931199 77887025 77883587 77933812 78029552 78135633 78214598 78252707 78258295 78238697 78189673
3417.7 78189673 78112583 78031993 77984781 77987056 78016119 78031287 78011041 77968354 77932897 77928662 77969441 78064189
3429.3 78064189 78208776 78367872 78479352 78500533 78460364 78459296 78597322 78885489 79221692 79457536
3439 79457536 79503789 79386888 79219151 79116392 79132957 79253616 79431505 79629030 79832454 80040379
3448.6 80040379 80246191 80433998 80589008 80712090 80822868 80949993 81114359 81318197 81546087 81774912
3458.2 81774912 81987028 82177210 82351494 82517090 82670956 82799711 82892838 82960577 83034697 83148260
3467.9 83148260 83309259 83498154 83692493 83892641 84115849 84362259 84590073 84738274 84782982 84774284
3477.5 84774284 84812460 84978657 85280848 85658789 86036053 86367903 86648741 86886206 87079725 87224960
3487.2 87224960 87332973 87439642 87590132 87809963 88084984 88367243 88604803 88776340 88904915 89040022
3496.8 89040022 89220276 89448776 89701681 89959698 90227852 90523119 90843935 91158533 91429758 91649303
3506.5 91649303 91844006 92045746 92256556 92450056 92607069 92747288 92920008 93164816 93480377 93830862
3516.1 93830862 94175940 94492750 94773188 95012894 95212460 95386839 95565701 95772190 96000004 96215620
3525.7 96215620 96388454 96524553 96671925 96891680 97217846 97633944 98081112 98490114 98818264 99070292
3535.4 99070292 99289398 99522972 99786272 100055723 100299349 100517559 100752697 101052589 101421537 101810017
3545 101810017 102157936 102450151 102727156 103037939 103380470 103694267 103914623 104039173 104143324 104327669
3554.7 104327669 104643488 105057430 105480480 105834236 106103773 106345024 106645422 107064419 107589464 108135328
3564.3 108135328 108590641 108885660 109034700 109120340 109230528 109400473 109606800 109815111 110031242 110304890
3574 110304890 110680799 111147203 111632557 112056570 112387810 112657967 112924299 113220005 113535767 113841610
3583.6 113841610 114122257 114391966 114681597 115015736 115398474 115816259 116246843 116666727 117052431 117383404
3593.2 117383404 117648449 117855959 118039532 118249636 118528576 118885984 119295139 119718485 120139027 120564241
3602.9 120564241 120992880 121381817 121660700 121797676 121856756 121976109 122266617 122716837 123194113 123551311
3612.5 123551311 123742924 123846960 123979530 124192076 124445429 124670992 124843111 124992609 125165157 125384808
3622.2 125384808 125658112 125993786 126392965 126811209 127146482 127291908 127221594 127028322 126868343 126856747
3631.8 126856747 127004423 127244129 127505016 127758999 128004646 128228350 128396692 128487492 128515844 128522940
3641.5 128522940 128542624 128586731 128657017 128751488 128845921 128875790 128765326 128501291 128178711 127956543 127944126
3652.1 127944126 128118830 128349886 128502293 128521957 128438272 128311987 128195705 128129673 128141613 128224812
3661.7 128224812 128323612 128366365 128330851 128273077 128276882 128370838 128498774 128571033 128532152 128371391 128082275
3672.3 128082275 127645073 127075167 126481981 126048279 125915680 126072483 126352215 126554031 126583519 126498842
3682 126498842 126437263 126492701 126640882 126757174 126705723 126436100 126025248 125636454 125418854 125415592 125547152
3692.6 125547152 125680027 125723591 125677567 125599594 125534153 125470724 125362396 125178165 124938793 124708805
3702.2 124708805 124559355 124530439 124614019 124759035 124889231 124931946 124847937 124650965 124402838 124179010
3711.9 124179010 124027872 123950729 123917446 123897181 123875008 123841648 123779535 123671064 123523178 123372307 123250465
3722.5 123250465 123142262 122987976 122745571 122454939 122231445 122180376 122306404 122501411 122620564 122576094
3732.1 122576094 122375402 122089930 121800632 121562462 121397791 121305609 121276407 121308298 121405697 121552992
3741.8 121552992 121684418 121698160 121528034 121213474 120887842 120671253 120562239 120440388 120187531 119810543
3751.4 119810543 119443913 119226389 119175663 119180431 119107037 118912725 118665161 118468037 118374052 118358154 118356991
3762 118356991 118329496 118289671 118293257 118388214 118562689 118731089 118777580 118636265 118342066 118009386 117754183
3772.6 117754183 117625494 117597961 117611141 117605858 117533894 117363739 117106400 116836176 116658401 116627350 116689863
3783.2 116689863 116726751 116662579 116533041 116430721 116387768 116328993 116156120 115869150 115585203 115425901
3792.9 115425901 115399427 115406570 115355310 115243711 115118742 114976654 114745731 114387436 113992729 113741102
3802.5 113741102 113745356 113941221 114140635 114191227 114080772 113903475 113755417 113674326 113653564 113667765 113668318
3813.1 113668318 113586550 113385344 113120546 112921286 112875051 112928591 112924719 112754526 112468758 112227173
3822.8 112227173 112138720 112164230 112175245 112093954 111957150 111853895 111824102 111831999 111825151 111790628 111743040
3833.4 111743040 111672201 111527519 111264286 110902367 110533247 110266762 110166111 110219831 110362444 110514011
3843 110514011 110612459 110623989 110542603 110387993 110204277 110046577 109948244 109886570 109784918 109569645 109242544
3853.6 109242544 108898792 108659153 108578167 108619823 108720026 108856220 109031477 109194775 109215860 108984137
3863.3 108984137 108545074 108111115 107898779 107938871 108057423 108051882 107879257 107664423 107537661 107495146
3872.9 107495146 107434406 107303963 107178507 107169418 107281008 107385778 107348347 107153883 106901093 106683226
3882.6 106683226 106502724 106310444 106100664 105933933 105859900 105841980 105782862 105626001 105416660 105256805
3892.2 105256805 105213852 105281582 105418406 105595331 105790691 105956964 106021070 105934172 105710354 105406237
3901.8 105406237 105067959 104712982 104364061 104079266 103920851 103893089 103925009 103932047 103894224 103864594 103900023
3912.5 103900023 103989067 104053659 104015484 103857336 103626623 103392925 103206911 103085203 103017998 102980947
3922.1 102980947 102948608 102907085 102862034 102835312 102852268 102923498 103026724 103098421 103054543 102841558 102484474
3932.7 102484474 102082014 101739073 101496658 101329708 101210032 101153412 101189213 101290359 101364155 101335821
3942.3 101335821 101236048 101182261 101258821 101422834 101538134 101502256 101331644 101127119 100969629 100858574
3952 100858574 100738850 100568762 100359364 100159607 100013351 99926205 99861784 99773130 99643974 99502153
3961.6 99502153 99383640 99285355 99166155 99006176 98852262 98782759 98819189 98892097 98909101 98846531 98755627
3972.2 98755627 98683338 98618298 98527107 98416367 98320417 98232956 98091908 97856836 97572432 97319832 97120762
3982.8 97120762 96938915 96780005 96721954 96788883 96838293 96679039 96323280 96010313 95871897 95648422
3992.5 95648422 94951649 93886852 93150845 93055935 94300976 95291929 95584049 94732561
4000.2 94732561
##END=$$ End of the data block
